Xenopus Phenotype Ontology
type: Ontology
version IRI: xpo-simple.owl
description: XPO represents anatomical, cellular, and gene function phenotypes occurring throughout the development of the African frogs Xenopus laevis and tropicalis.
license: https://creativecommons.org/licenses/by/3.0/
version info: 2021-03-05

definition
type: AnnotationProperty
IAO_0000111: definition
IAO_0000114: IAO_0000122
definition: The official definition, explaining the meaning of a class or property. Shall be Aristotelian, formalized and normalized. Can be augmented with colloquial definitions.
IAO_0000116: 2012-04-05: Barry Smith The official OBI definition, explaining the meaning of a class or property: 'Shall be Aristotelian, formalized and normalized. Can be augmented with colloquial definitions' is terrible. Can you fix to something like: A statement of necessary and sufficient conditions explaining the meaning of an expression referring to a class or property. Alan Ruttenberg Your proposed definition is a reasonable candidate, except that it is very common that necessary and sufficient conditions are not given. Mostly they are necessary, occasionally they are necessary and sufficient or just sufficient. Often they use terms that are not themselves defined and so they effectively can't be evaluated by those criteria. On the specifics of the proposed definition: We don't have definitions of 'meaning' or 'expression' or 'property'. For 'reference' in the intended sense I think we use the term 'denotation'. For 'expression', I think we you mean symbol, or identifier. For 'meaning' it differs for class and property. For class we want documentation that let's the intended reader determine whether an entity is instance of the class, or not. For property we want documentation that let's the intended reader determine, given a pair of potential relata, whether the assertion that the relation holds is true. The 'intended reader' part suggests that we also specify who, we expect, would be able to understand the definition, and also generalizes over human and computer reader to include textual and logical definition. Personally, I am more comfortable weakening definition to documentation, with instructions as to what is desirable. We also have the outstanding issue of how to aim different definitions to different audiences. A clinical audience reading chebi wants a different sort of definition documentation/definition from a chemistry trained audience, and similarly there is a need for a definition that is adequate for an ontologist to work with.
IAO_0000117: PERSON:Daniel Schober
IAO_0000119: GROUP:OBI:<http://purl.obolibrary.org/obo/obi>

has_exact_synonym
type: AnnotationProperty

part of
type: ObjectProperty
inverse of: has part
type: TransitiveProperty
IAO_0000111: is part of
IAO_0000112: my brain is part of my body (continuant parthood, two material entities)
IAO_0000112: my stomach cavity is part of my stomach (continuant parthood, immaterial entity is part of material entity)
IAO_0000112: this day is part of this year (occurrent parthood)
definition: a core relation that holds between a part and its whole
IAO_0000116: Everything is part of itself. Any part of any part of a thing is itself part of that thing. Two distinct things cannot be part of each other.
IAO_0000116: Occurrents are not subject to change and so parthood between occurrents holds for all the times that the part exists. Many continuants are subject to change, so parthood between continuants will only hold at certain times, but this is difficult to specify in OWL. See https://code.google.com/p/obo-relations/wiki/ROAndTime
IAO_0000116: Parthood requires the part and the whole to have compatible classes: only an occurrent can be part of an occurrent; only a process can be part of a process; only a continuant can be part of a continuant; only an independent continuant can be part of an independent continuant; only an immaterial entity can be part of an immaterial entity; only a specifically dependent continuant can be part of a specifically dependent continuant; only a generically dependent continuant can be part of a generically dependent continuant. (This list is not exhaustive.) A continuant cannot be part of an occurrent: use 'participates in'. An occurrent cannot be part of a continuant: use 'has participant'. A material entity cannot be part of an immaterial entity: use 'has location'. A specifically dependent continuant cannot be part of an independent continuant: use 'inheres in'. An independent continuant cannot be part of a specifically dependent continuant: use 'bearer of'.
IAO_0000118: part_of
RO_0001900: RO_0001901
RO_0040042: BFO_0000002
RO_0040042: BFO_0000003
RO_0040042: BFO_0000004
RO_0040042: BFO_0000017
RO_0040042: BFO_0000019
RO_0040042: BFO_0000020
RO_0040042: BFO_0000031
has db xref: BFO:0000050
has OBO namespace: external
has OBO namespace: quality
has OBO namespace: uberon
has OBO namespace: xenopus_anatomy
id: part_of
in subset: valid for go annotation extension
in subset: valid for go gp2term
in subset: valid for go ontology
in subset: valid for gocam
shorthand: part_of
label: part_of

has part
type: ObjectProperty
type: TransitiveProperty
IAO_0000111: has part
IAO_0000112: my body has part my brain (continuant parthood, two material entities)
IAO_0000112: my stomach has part my stomach cavity (continuant parthood, material entity has part immaterial entity)
IAO_0000112: this year has part this day (occurrent parthood)
definition: Q1 has_part Q2 if and only if: every instance of Q1 is a quality_of an entity that has_quality some Q2.
definition: a core relation that holds between a whole and its part
IAO_0000116: Everything has itself as a part. Any part of any part of a thing is itself part of that thing. Two distinct things cannot have each other as a part.
IAO_0000116: Occurrents are not subject to change and so parthood between occurrents holds for all the times that the part exists. Many continuants are subject to change, so parthood between continuants will only hold at certain times, but this is difficult to specify in OWL. See https://code.google.com/p/obo-relations/wiki/ROAndTime
IAO_0000116: Parthood requires the part and the whole to have compatible classes: only an occurrent have an occurrent as part; only a process can have a process as part; only a continuant can have a continuant as part; only an independent continuant can have an independent continuant as part; only a specifically dependent continuant can have a specifically dependent continuant as part; only a generically dependent continuant can have a generically dependent continuant as part. (This list is not exhaustive.) A continuant cannot have an occurrent as part: use 'participates in'. An occurrent cannot have a continuant as part: use 'has participant'. An immaterial entity cannot have a material entity as part: use 'location of'. An independent continuant cannot have a specifically dependent continuant as part: use 'bearer of'. A specifically dependent continuant cannot have an independent continuant as part: use 'inheres in'.
IAO_0000118: has_part
RO_0001900: RO_0001901
has db xref: BFO:0000051
has OBO namespace: chebi_ontology
has OBO namespace: external
has OBO namespace: quality
has OBO namespace: uberon
id: has_part
in subset: valid for go annotation extension
in subset: valid for go ontology
in subset: valid for gocam
is cyclic: false
shorthand: has_part
comment: We use the has_part relation to relate complex qualities to more primitive ones. A complex quality is a collection of qualities. The complex quality cannot exist without the sub-qualities. For example, the quality 'swollen' necessarily comes with the qualities of 'protruding' and 'increased size'.
label: has_part

Axiom
annotated source: has part
annotated property: definition
annotated target: Q1 has_part Q2 if and only if: every instance of Q1 is a quality_of an entity that has_quality some Q2.
has db xref: PATOC:CJM

occurs in
type: ObjectProperty
property chain axiom: part of
IAO_0000111: occurs in
definition: b occurs_in c =def b is a process and c is a material entity or immaterial entity& there exists a spatiotemporal region r and b occupies_spatiotemporal_region r.& forall(t) if b exists_at t then c exists_at t & there exist spatial regions s and s’ where & b spatially_projects_onto s at t& c is occupies_spatial_region s’ at t& s is a proper_continuant_part_of s’ at t
IAO_0000118: occurs_in
IAO_0000118: unfolds in
IAO_0000118: unfolds_in
has db xref: BFO:0000066
has OBO namespace: external
id: occurs_in
in subset: valid for go annotation extension
in subset: valid for go ontology
in subset: valid for gocam
shorthand: occurs_in
comment: Paraphrase of definition: a relation between a process and an independent continuant, in which the process takes place entirely within the independent continuant

inheres in
type: ObjectProperty
sub property of: inheres in part of
IAO_0000111: inheres in
IAO_0000112: this fragility inheres in this vase
IAO_0000112: this red color inheres in this apple
definition: a relation between a specifically dependent continuant (the dependent) and an independent continuant (the bearer), in which the dependent specifically depends on the bearer for its existence
IAO_0000116: A dependent inheres in its bearer at all times for which the dependent exists.
IAO_0000118: inheres_in
RO_0001900: RO_0001901

results in developmental progression of
type: ObjectProperty
IAO_0000114: IAO_0000125
definition: p results in the developmental progression of s iff p is a developmental process and s is an anatomical structure and p causes s to undergo a change in state at some point along its natural developmental cycle (this cycle starts with its formation, through the mature structure, and ends with its loss).
IAO_0000116: This property and its subproperties are being used primarily for the definition of GO developmental processes. The property hierarchy mirrors the core GO hierarchy. In future we may be able to make do with a more minimal set of properties, but due to the way GO is currently structured we require highly specific relations to avoid incorrect entailments. To avoid this, the corresponding genus terms in GO should be declared mutually disjoint.
IAO_0000117: Chris Mungall
shorthand: results_in_developmental_progression_of

inheres in part of
type: ObjectProperty
property chain axiom: inheres in
property chain axiom: part of
definition: q inheres in part of w if and only if there exists some p such that q inheres in p and p part of w.
IAO_0000116: Because part_of is transitive, inheres in is a sub-relation of inheres in part of
IAO_0000117: Chris Mungall
IAO_0000119: http://www.ncbi.nlm.nih.gov/pubmed/20064205
RO_0001900: RO_0001901

towards
type: ObjectProperty
definition: q towards e2 if and only if q is a relational quality such that q inheres-in some e, and e != e2 and q is dependent on e2
IAO_0000116: This relation is provided in order to support the use of relational qualities such as 'concentration of'; for example, the concentration of C in V is a quality that inheres in V, but pertains to C.
IAO_0000117: Chris Mungall
IAO_0000119: http://www.ncbi.nlm.nih.gov/pubmed/20064205

results in movement of
type: ObjectProperty
definition: Holds between p and c when p is locomotion process and the outcome of this process is the change of location of c
IAO_0000117: Chris Mungall
in subset: valid for go annotation extension
in subset: valid for go ontology
in subset: valid for gocam

has modifier
type: ObjectProperty
definition: A relation that holds between an attribute or a qualifier and another attribute.
IAO_0000117: Chris Mungall
IAO_0000119: http://www.ncbi.nlm.nih.gov/pubmed/20064205
IAO_0000232: This relation is intended to be used in combination with PATO, to be able to refine PATO quality classes using modifiers such as 'abnormal' and 'normal'. It has yet to be formally aligned into an ontological framework; it's not clear what the ontological status of the "modifiers" are.
in subset: ro-eco

Xenopus phenotype
type: Class
definition: A phenotype observed in Xenopus.

abnormal head
type: Class
subclass of: abnormal organism subdivision
subclass of: XPO_0141315
definition: Abnormality of head.
has_exact_synonym: abnormality of head

abnormal organism subdivision
type: Class
subclass of: abnormal multicellular anatomical structure
definition: Abnormality of organism subdivision.
has_exact_synonym: abnormality of organism subdivision

abnormal cell
type: Class
subclass of: abnormal whole organism
definition: Abnormality of cell.
has_exact_synonym: abnormality of cell

abnormal anatomical structure
type: Class
subclass of: Xenopus phenotype
definition: Abnormality of anatomical structure.
has_exact_synonym: abnormality of anatomical structure

abnormal epidermis
type: Class
subclass of: abnormal multi-tissue structure
subclass of: abnormal ectoderm
subclass of: abnormal skin
definition: Abnormality of epidermis.
has_exact_synonym: abnormality of epidermis

abnormal multi-tissue structure
type: Class
subclass of: abnormal multicellular anatomical structure
definition: Abnormality of multi-tissue structure.
has_exact_synonym: abnormality of multi-tissue structure

abnormal multicellular anatomical structure
type: Class
subclass of: abnormal whole organism
definition: Abnormality of multicellular anatomical structure.
has_exact_synonym: abnormality of multicellular anatomical structure

abnormal cardiac neural crest
type: Class
subclass of: abnormal neural crest
definition: Abnormality of cardiac neural crest.
has_exact_synonym: abnormality of cardiac neural crest

abnormal heart
type: Class
subclass of: abnormal cavitated compound organ
subclass of: abnormal cardiovascular system
subclass of: abnormal viscus
definition: Abnormality of heart.
has_exact_synonym: abnormality of heart

abnormal tissue
type: Class
subclass of: abnormal multicellular anatomical structure
definition: Abnormality of tissue.
has_exact_synonym: abnormality of tissue

abnormal anterior placodal area
type: Class
subclass of: abnormal preplacodal ectoderm
definition: Abnormality of anterior placodal area.
has_exact_synonym: abnormality of anterior placodal area

abnormal external plexiform layer of the olfactory bulb
type: Class
subclass of: abnormal tissue
subclass of: abnormal olfactory bulb
definition: Abnormality of external plexiform layer of the olfactory bulb.
has_exact_synonym: abnormality of external plexiform layer of the olfactory bulb

abnormal distal mesenchyme
type: Class
subclass of: abnormal mesenchyme
subclass of: abnormal limb bud
definition: Abnormality of distal mesenchyme.
has_exact_synonym: abnormality of distal mesenchyme

abnormal mesenchyme
type: Class
subclass of: abnormal tissue
definition: Abnormality of mesenchyme.
has_exact_synonym: abnormality of mesenchyme

abnormal oocyte
type: Class
subclass of: abnormal germ cell
definition: Abnormality of oocyte.
has_exact_synonym: abnormality of oocyte

abnormal germ cell
type: Class
subclass of: abnormal cell
definition: Abnormality of germ cell.
has_exact_synonym: abnormality of germ cell

abnormal lower jaw
type: Class
subclass of: abnormal cranium
definition: Abnormality of lower jaw.
has_exact_synonym: abnormality of lower jaw

abnormal anatomical cluster
type: Class
subclass of: abnormal anatomical group
definition: Abnormality of anatomical cluster.
has_exact_synonym: abnormality of anatomical cluster

abnormal central nervous system
type: Class
subclass of: abnormal nervous system
definition: Abnormality of central nervous system.
has_exact_synonym: abnormality of central nervous system

abnormal nervous system
type: Class
subclass of: abnormal anatomical system
definition: Abnormality of nervous system.
has_exact_synonym: abnormality of nervous system

abnormal fundus
type: Class
subclass of: abnormal proximal stomach
definition: Abnormality of fundus.
has_exact_synonym: abnormality of fundus

abnormal blastomere V1.1
type: Class
subclass of: abnormal ventral animal hemisphere blastomere
definition: Abnormality of blastomere V1.1.
has_exact_synonym: abnormality of blastomere V1.1

abnormal ventral animal hemisphere blastomere
type: Class
subclass of: abnormal animal blastomere
definition: Abnormality of ventral animal hemisphere blastomere.
has_exact_synonym: abnormality of ventral animal hemisphere blastomere

abnormal ovary
type: Class
subclass of: abnormal gonad
subclass of: abnormal female genitalia
definition: Abnormality of ovary.
has_exact_synonym: abnormality of ovary

abnormal gonad
type: Class
subclass of: abnormal trunk
subclass of: abnormal cavitated compound organ
definition: Abnormality of gonad.
has_exact_synonym: abnormality of gonad

abnormal olfactory bulb
type: Class
subclass of: abnormal olfactory system
subclass of: abnormal telencephalon
definition: Abnormality of olfactory bulb.
has_exact_synonym: abnormality of olfactory bulb

abnormal hepatic vein
type: Class
subclass of: abnormal vein
subclass of: abnormal trunk vasculature
subclass of: abnormal alimentary system
definition: Abnormality of hepatic vein.
has_exact_synonym: abnormality of hepatic vein

abnormal vein
type: Class
subclass of: abnormal blood vessel
definition: Abnormality of vein.
has_exact_synonym: abnormality of vein

abnormal trunk somite 12
type: Class
subclass of: abnormal trunk somite
definition: Abnormality of trunk somite 12.
has_exact_synonym: abnormality of trunk somite 12

abnormal trunk somite
type: Class
subclass of: abnormal trunk
subclass of: abnormal somite
definition: Abnormality of trunk somite.
has_exact_synonym: abnormality of trunk somite

abnormal cartilage element
type: Class
subclass of: abnormal skeletal element
definition: Abnormality of cartilage element.
has_exact_synonym: abnormality of cartilage element

abnormal skeletal element
type: Class
subclass of: abnormal solid compound organ
subclass of: abnormal skeleton
definition: Abnormality of skeletal element.
has_exact_synonym: abnormality of skeletal element

abnormal chondrocranium
type: Class
subclass of: abnormal cranium
definition: Abnormality of chondrocranium.
has_exact_synonym: abnormality of chondrocranium

abnormal chondrocyte
type: Class
subclass of: abnormal cell
subclass of: abnormal cartilage tissue
definition: Abnormality of chondrocyte.
has_exact_synonym: abnormality of chondrocyte

abnormal head somite 1
type: Class
subclass of: abnormal head somite
definition: Abnormality of head somite 1.
has_exact_synonym: abnormality of head somite 1

abnormal head somite
type: Class
subclass of: abnormal somite
subclass of: XPO_0141315
definition: Abnormality of head somite.
has_exact_synonym: abnormality of head somite

abnormal head vasculature
type: Class
subclass of: abnormal head
subclass of: abnormal multi-tissue structure
subclass of: abnormal cardiovascular system
definition: Abnormality of head vasculature.
has_exact_synonym: abnormality of head vasculature

abnormal blood vessel
type: Class
subclass of: abnormal multi-tissue structure
subclass of: abnormal circulatory system
subclass of: abnormal cardiovascular system
definition: Abnormality of blood vessel.
has_exact_synonym: abnormality of blood vessel

abnormal olfactory epithelium
type: Class
subclass of: abnormal epithelium
subclass of: abnormal olfactory system
definition: Abnormality of olfactory epithelium.
has_exact_synonym: abnormality of olfactory epithelium

abnormal sclerotome of trunk somite 9
type: Class
subclass of: abnormal sclerotome
definition: Abnormality of sclerotome of trunk somite 9.
has_exact_synonym: abnormality of sclerotome of trunk somite 9

abnormal sclerotome
type: Class
subclass of: abnormal somite
definition: Abnormality of sclerotome.
has_exact_synonym: abnormality of sclerotome

abnormal regenerating tail
type: Class
subclass of: abnormal blastema
definition: Abnormality of regenerating tail.
has_exact_synonym: abnormality of regenerating tail

abnormal regenerating tissue
type: Class
subclass of: abnormal tissue
definition: Abnormality of regenerating tissue.
has_exact_synonym: abnormality of regenerating tissue

abnormal anatomical space
type: Class
subclass of: abnormal whole organism
definition: Abnormality of anatomical space.
has_exact_synonym: abnormality of anatomical space

abnormal myotome
type: Class
subclass of: abnormal dermomyotome
definition: Abnormality of myotome.
has_exact_synonym: abnormality of myotome

abnormal animal hemisphere
type: Class
subclass of: abnormal embryo
subclass of: XPO_0141315
definition: Abnormality of animal hemisphere.
has_exact_synonym: abnormality of animal hemisphere

obsolete abnormal anatomical region
type: Class
IAO_0000125: XPO_0141315
deprecated: true

abnormal urinary system
type: Class
subclass of: abnormal urogenital system
definition: Abnormality of urinary system.
has_exact_synonym: abnormality of urinary system

abnormal anatomical system
type: Class
subclass of: abnormal anatomical group
definition: Abnormality of anatomical system.
has_exact_synonym: abnormality of anatomical system

abnormal endoderm
type: Class
subclass of: abnormal primary germ layer
definition: Abnormality of endoderm.
has_exact_synonym: abnormality of endoderm

abnormal mandibular artery
type: Class
subclass of: abnormal head vasculature
subclass of: abnormal artery
definition: Abnormality of mandibular artery.
has_exact_synonym: abnormality of mandibular artery

abnormal artery
type: Class
subclass of: abnormal blood vessel
definition: Abnormality of artery.
has_exact_synonym: abnormality of artery

abnormal olfactory placode
type: Class
subclass of: abnormal neurogenic placode
subclass of: abnormal olfactory system
definition: Abnormality of olfactory placode.
has_exact_synonym: abnormality of olfactory placode

abnormal neurogenic placode
type: Class
subclass of: abnormal cranial placode
definition: Abnormality of neurogenic placode.
has_exact_synonym: abnormality of neurogenic placode

abnormal dorsal aorta
type: Class
subclass of: abnormal aorta
subclass of: abnormal trunk vasculature
definition: Abnormality of dorsal aorta.
has_exact_synonym: abnormality of dorsal aorta

abnormal aorta
type: Class
subclass of: abnormal artery
definition: Abnormality of aorta.
has_exact_synonym: abnormality of aorta

abnormal anatomical entity in vitro
type: Class
subclass of: Xenopus phenotype
definition: Abnormality of anatomical entity in vitro.
has_exact_synonym: abnormality of anatomical entity in vitro

abnormal rhombomere R3
type: Class
subclass of: abnormal rhombomere
definition: Abnormality of rhombomere R3.
has_exact_synonym: abnormality of rhombomere R3

abnormal rhombomere
type: Class
subclass of: abnormal neuromere
subclass of: abnormal hindbrain
definition: Abnormality of rhombomere.
has_exact_synonym: abnormality of rhombomere

abnormal anatomical group
type: Class
subclass of: abnormal whole organism
definition: Abnormality of anatomical group.
has_exact_synonym: abnormality of anatomical group

abnormal mesonephric sinus
type: Class
subclass of: abnormal anatomical space
subclass of: abnormal urogenital system
definition: Abnormality of mesonephric sinus.
has_exact_synonym: abnormality of mesonephric sinus

abnormal venous endothelium
type: Class
subclass of: abnormal vein
subclass of: abnormal simple squamous epithelium
definition: Abnormality of venous endothelium.
has_exact_synonym: abnormality of venous endothelium

abnormal simple squamous epithelium
type: Class
subclass of: abnormal unilaminar epithelium
definition: Abnormality of simple squamous epithelium.
has_exact_synonym: abnormality of simple squamous epithelium

abnormal head somite 4
type: Class
subclass of: abnormal head somite
definition: Abnormality of head somite 4.
has_exact_synonym: abnormality of head somite 4

abnormal optic tectum
type: Class
subclass of: abnormal midbrain
definition: Abnormality of optic tectum.
has_exact_synonym: abnormality of optic tectum

abnormal cranial muscle
type: Class
subclass of: abnormal head
subclass of: abnormal muscle
definition: Abnormality of cranial muscle.
has_exact_synonym: abnormality of cranial muscle

abnormal muscle
type: Class
subclass of: abnormal tissue
subclass of: abnormal muscular system
definition: Abnormality of muscle.
has_exact_synonym: abnormality of muscle

abnormal trunk
type: Class
subclass of: abnormal organism subdivision
subclass of: abnormal trunk region
definition: Abnormality of trunk.
has_exact_synonym: abnormality of trunk

abnormal embryonic structure
type: Class
subclass of: abnormal embryo
subclass of: abnormal whole organism
definition: Abnormality of embryonic structure.
has_exact_synonym: abnormality of embryonic structure

abnormal mesoderm
type: Class
subclass of: abnormal primary germ layer
definition: Abnormality of mesoderm.
has_exact_synonym: abnormality of mesoderm

abnormal involuted dorsal mesoderm
type: Class
subclass of: abnormal tissue
subclass of: abnormal circumblastoporal collar
definition: Abnormality of involuted dorsal mesoderm.
has_exact_synonym: abnormality of involuted dorsal mesoderm

abnormal cell part
type: Class
subclass of: abnormal cell
definition: Abnormality of cell part.
has_exact_synonym: abnormality of cell part

abnormal trigeminal nerve
type: Class
subclass of: abnormal cranial nerve
definition: Abnormality of trigeminal nerve.
has_exact_synonym: abnormality of trigeminal nerve

abnormal cranial nerve
type: Class
subclass of: XPO_0131652
definition: Abnormality of cranial nerve.
has_exact_synonym: abnormality of cranial nerve

abnormal fin vasculature
type: Class
subclass of: abnormal blood vessel
subclass of: abnormal fin
definition: Abnormality of fin vasculature.
has_exact_synonym: abnormality of fin vasculature

abnormal peripheral nervous system
type: Class
subclass of: abnormal nervous system
definition: Abnormality of peripheral nervous system.
has_exact_synonym: abnormality of peripheral nervous system

abnormal aortic arch 1
type: Class
subclass of: abnormal aortic arch
definition: Abnormality of aortic arch 1.
has_exact_synonym: abnormality of aortic arch 1

abnormal aortic arch
type: Class
subclass of: abnormal artery
definition: Abnormality of aortic arch.
has_exact_synonym: abnormality of aortic arch

abnormal genital system
type: Class
subclass of: abnormal urogenital system
definition: Abnormality of genital system.
has_exact_synonym: abnormality of genital system

abnormal endochondral bone
type: Class
subclass of: abnormal endochondral element
definition: Abnormality of endochondral bone.
has_exact_synonym: abnormality of endochondral bone

abnormal pelvic girdle
type: Class
subclass of: abnormal appendicular skeleton
definition: Abnormality of pelvic girdle.
has_exact_synonym: abnormality of pelvic girdle

abnormal endochondral element
type: Class
subclass of: abnormal regenerating skeletal element
definition: Abnormality of endochondral element.
has_exact_synonym: abnormality of endochondral element

abnormal upper blastopore lip
type: Class
subclass of: abnormal blastopore lip
definition: Abnormality of upper blastopore lip.
has_exact_synonym: abnormality of upper blastopore lip

abnormal tail tip
type: Class
subclass of: abnormal tail fin
definition: Abnormality of tail tip.
has_exact_synonym: abnormality of tail tip

abnormal anterior lateral line placode
type: Class
subclass of: abnormal lateral line placode
definition: Abnormality of anterior lateral line placode.
has_exact_synonym: abnormality of anterior lateral line placode

abnormal lateral line placode
type: Class
subclass of: abnormal neurogenic placode
subclass of: abnormal lateral line system
definition: Abnormality of lateral line placode.
has_exact_synonym: abnormality of lateral line placode

abnormal mouth primordium
type: Class
subclass of: abnormal multi-tissue structure
subclass of: abnormal alimentary system
subclass of: abnormal ectoderm
definition: Abnormality of mouth primordium.
has_exact_synonym: abnormality of mouth primordium

abnormal cranium
type: Class
subclass of: abnormal head
subclass of: abnormal anatomical cluster
subclass of: abnormal skeletal system
definition: Abnormality of cranium.
has_exact_synonym: abnormality of cranium

abnormal solid compound organ
type: Class
subclass of: abnormal compound organ
definition: Abnormality of solid compound organ.
has_exact_synonym: abnormality of solid compound organ

abnormal neural plate
type: Class
subclass of: abnormal neuroectoderm
definition: Abnormality of neural plate.
has_exact_synonym: abnormality of neural plate

abnormal surface structure
type: Class
subclass of: abnormal organism subdivision
definition: Abnormality of surface structure.
has_exact_synonym: abnormality of surface structure

abnormal neural tube
type: Class
subclass of: abnormal central nervous system
subclass of: abnormal embryonic structure
definition: Abnormality of neural tube.
has_exact_synonym: abnormality of neural tube

abnormal cardinal vein
type: Class
subclass of: abnormal vein
definition: Abnormality of cardinal vein.
has_exact_synonym: abnormality of cardinal vein

abnormal trunk vasculature
type: Class
subclass of: abnormal multi-tissue structure
subclass of: abnormal trunk
subclass of: abnormal cardiovascular system
definition: Abnormality of trunk vasculature.
has_exact_synonym: abnormality of trunk vasculature

abnormal intermediate mesoderm
type: Class
subclass of: abnormal mesoderm
definition: Abnormality of intermediate mesoderm.
has_exact_synonym: abnormality of intermediate mesoderm

abnormal paired dorsal aorta
type: Class
subclass of: abnormal aorta
definition: Abnormality of paired dorsal aorta.
has_exact_synonym: abnormality of paired dorsal aorta

abnormal branchial crest
type: Class
subclass of: abnormal cranial neural crest
definition: Abnormality of branchial crest.
has_exact_synonym: abnormality of branchial crest

abnormal primary germ layer
type: Class
subclass of: abnormal tissue
subclass of: abnormal embryo
definition: Abnormality of primary germ layer.
has_exact_synonym: abnormality of primary germ layer

abnormal mesonephric mesenchyme
type: Class
subclass of: abnormal mesenchyme
subclass of: abnormal trunk
definition: Abnormality of mesonephric mesenchyme.
has_exact_synonym: abnormality of mesonephric mesenchyme

abnormal arteria mesenterica posterior
type: Class
subclass of: abnormal artery
subclass of: abnormal trunk vasculature
definition: Abnormality of arteria mesenterica posterior.
has_exact_synonym: abnormality of arteria mesenterica posterior

abnormal hypophyseal primordium
type: Class
subclass of: abnormal primordium
subclass of: abnormal ectoderm
definition: Abnormality of hypophyseal primordium.
has_exact_synonym: abnormality of hypophyseal primordium

abnormal primordium
type: Class
subclass of: abnormal embryonic structure
definition: Abnormality of primordium.
has_exact_synonym: abnormality of primordium

abnormal alimentary system
type: Class
subclass of: abnormal anatomical system
definition: Abnormality of alimentary system.
has_exact_synonym: abnormality of alimentary system

abnormal hepatic portal vein
type: Class
subclass of: abnormal vein
subclass of: abnormal trunk vasculature
subclass of: abnormal alimentary system
definition: Abnormality of hepatic portal vein.
has_exact_synonym: abnormality of hepatic portal vein

abnormal foregut
type: Class
subclass of: abnormal embryonic structure
subclass of: abnormal alimentary system
definition: Abnormality of foregut.
has_exact_synonym: abnormality of foregut

abnormal optic tract
type: Class
subclass of: abnormal diencephalon
definition: Abnormality of optic tract.
has_exact_synonym: abnormality of optic tract

abnormal neuromere
type: Class
subclass of: abnormal organism subdivision
subclass of: abnormal central nervous system
definition: Abnormality of neuromere.
has_exact_synonym: abnormality of neuromere

abnormal hindbrain
type: Class
subclass of: abnormal multi-tissue structure
subclass of: abnormal brain
definition: Abnormality of hindbrain.
has_exact_synonym: abnormality of hindbrain

abnormal presumptive rhombomere
type: Class
subclass of: abnormal embryonic structure
definition: Abnormality of presumptive rhombomere.
has_exact_synonym: abnormality of presumptive rhombomere

abnormal central amygdala
type: Class
subclass of: abnormal neural nucleus
subclass of: abnormal amygdala
subclass of: abnormal striatum
definition: Abnormality of central amygdala.
has_exact_synonym: abnormality of central amygdala

abnormal neural nucleus
type: Class
subclass of: abnormal anatomical cluster
subclass of: abnormal central nervous system
definition: Abnormality of neural nucleus.
has_exact_synonym: abnormality of neural nucleus

abnormal lateral pallium
type: Class
subclass of: abnormal pallium
definition: Abnormality of lateral pallium.
has_exact_synonym: abnormality of lateral pallium

abnormal somite
type: Class
subclass of: abnormal mesoderm
subclass of: abnormal muscular system
definition: Abnormality of somite.
has_exact_synonym: abnormality of somite

abnormal nerve
type: Class
subclass of: abnormal tissue
subclass of: abnormal nervous system
definition: Abnormality of nerve.
has_exact_synonym: abnormality of nerve

abnormal ectoderm
type: Class
subclass of: abnormal primary germ layer
definition: Abnormality of ectoderm.
has_exact_synonym: abnormality of ectoderm

abnormal brain
type: Class
subclass of: abnormal head
subclass of: abnormal central nervous system
subclass of: abnormal cavitated compound organ
definition: Abnormality of brain.
has_exact_synonym: abnormality of brain

abnormal anterior neural tube
type: Class
subclass of: abnormal neural tube
definition: Abnormality of anterior neural tube.
has_exact_synonym: abnormality of anterior neural tube

abnormal neural stem cell
type: Class
subclass of: abnormal brain
subclass of: abnormal stem cell
definition: Abnormality of neural stem cell.
has_exact_synonym: abnormality of neural stem cell

abnormal stem cell
type: Class
subclass of: abnormal cell
definition: Abnormality of stem cell.
has_exact_synonym: abnormality of stem cell

abnormal pallidum
type: Class
subclass of: abnormal basal ganglion
definition: Abnormality of pallidum.
has_exact_synonym: abnormality of pallidum

abnormal migrating neuroblast
type: Class
subclass of: abnormal cell
subclass of: abnormal nervous system
definition: Abnormality of migrating neuroblast.
has_exact_synonym: abnormality of migrating neuroblast

abnormal stage VI oocyte
type: Class
subclass of: abnormal oocyte
definition: Abnormality of stage VI oocyte.
has_exact_synonym: abnormality of stage VI oocyte

abnormal hindlimb digit
type: Class
subclass of: abnormal digit
subclass of: abnormal hindlimb skeleton
subclass of: abnormal foot
definition: Abnormality of hindlimb digit.
has_exact_synonym: abnormality of hindlimb digit

abnormal digit
type: Class
subclass of: abnormal anatomical cluster
subclass of: abnormal autopod
definition: Abnormality of digit.
has_exact_synonym: abnormality of digit

abnormal sclerotome of trunk somite 7
type: Class
subclass of: abnormal sclerotome
definition: Abnormality of sclerotome of trunk somite 7.
has_exact_synonym: abnormality of sclerotome of trunk somite 7

abnormal hindlimb bud
type: Class
subclass of: abnormal limb bud
definition: Abnormality of hindlimb bud.
has_exact_synonym: abnormality of hindlimb bud

abnormal gastrocoel roof plate
type: Class
subclass of: abnormal archenteron
definition: Abnormality of gastrocoel roof plate.
has_exact_synonym: abnormality of gastrocoel roof plate

abnormal tooth
type: Class
subclass of: abnormal skeletal element
subclass of: abnormal cranium
definition: Abnormality of tooth.
has_exact_synonym: abnormality of tooth

abnormal eye
type: Class
subclass of: abnormal head
subclass of: abnormal central nervous system
subclass of: abnormal cavitated compound organ
subclass of: abnormal visual system
definition: Abnormality of eye.
has_exact_synonym: abnormality of eye

abnormal uveal tract
type: Class
subclass of: abnormal tissue
definition: Abnormality of uveal tract.
has_exact_synonym: abnormality of uveal tract

abnormal regenerating limb
type: Class
subclass of: abnormal blastema
definition: Abnormality of regenerating limb.
has_exact_synonym: abnormality of regenerating limb

abnormal delta cell
type: Class
subclass of: abnormal alimentary system
subclass of: abnormal enteroendocrine cell
definition: Abnormality of delta cell.
has_exact_synonym: abnormality of delta cell

abnormal enteroendocrine cell
type: Class
subclass of: abnormal endocrine cell
definition: Abnormality of enteroendocrine cell.
has_exact_synonym: abnormality of enteroendocrine cell

abnormal tail somite 15
type: Class
subclass of: abnormal tail somite
definition: Abnormality of tail somite 15.
has_exact_synonym: abnormality of tail somite 15

abnormal lens epithelium
type: Class
subclass of: abnormal epithelium
subclass of: abnormal lens
definition: Abnormality of lens epithelium.
has_exact_synonym: abnormality of lens epithelium

abnormal epithelium
type: Class
subclass of: abnormal tissue
definition: Abnormality of epithelium.
has_exact_synonym: abnormality of epithelium

abnormal granule cell layer of the olfactory bulb
type: Class
subclass of: abnormal tissue
subclass of: abnormal olfactory bulb
definition: Abnormality of granule cell layer of the olfactory bulb.
has_exact_synonym: abnormality of granule cell layer of the olfactory bulb

abnormal preoptic area
type: Class
subclass of: abnormal anterior hypothalamus
definition: Abnormality of preoptic area.
has_exact_synonym: abnormality of preoptic area

abnormal retromammillary area
type: Class
subclass of: abnormal hypothalamus
definition: Abnormality of retromammillary area.
has_exact_synonym: abnormality of retromammillary area

abnormal neuron
type: Class
subclass of: abnormal cell
subclass of: abnormal nervous system
definition: Abnormality of neuron.
has_exact_synonym: abnormality of neuron

abnormal subclavian vein
type: Class
subclass of: abnormal vein
subclass of: abnormal trunk vasculature
definition: Abnormality of subclavian vein.
has_exact_synonym: abnormality of subclavian vein

abnormal prehallux
type: Class
subclass of: abnormal cartilage element
subclass of: abnormal foot
definition: Abnormality of prehallux.
has_exact_synonym: abnormality of prehallux

abnormal cranial muscle primordium
type: Class
subclass of: abnormal multi-tissue structure
subclass of: abnormal muscular system
definition: Abnormality of cranial muscle primordium.
has_exact_synonym: abnormality of cranial muscle primordium

abnormal left atrium
type: Class
subclass of: abnormal cardiac atrium
definition: Abnormality of left atrium.
has_exact_synonym: abnormality of left atrium

abnormal cavitated compound organ
type: Class
subclass of: abnormal compound organ
definition: Abnormality of cavitated compound organ.
has_exact_synonym: abnormality of cavitated compound organ

abnormal embryo
type: Class
subclass of: Xenopus phenotype
definition: Abnormality of embryo.
has_exact_synonym: abnormality of embryo

abnormal endocrine cell
type: Class
subclass of: abnormal cell
subclass of: abnormal endocrine system
definition: Abnormality of endocrine cell.
has_exact_synonym: abnormality of endocrine cell

abnormal islets of Langerhans
type: Class
subclass of: abnormal multi-tissue structure
subclass of: abnormal endocrine system
subclass of: abnormal pancreas
definition: Abnormality of islets of Langerhans.
has_exact_synonym: abnormality of islets of Langerhans

abnormal limb segment
type: Class
subclass of: abnormal limb
definition: Abnormality of limb segment.
has_exact_synonym: abnormality of limb segment

abnormal nucleus accumbens
type: Class
subclass of: abnormal neural nucleus
subclass of: abnormal striatum
definition: Abnormality of nucleus accumbens.
has_exact_synonym: abnormality of nucleus accumbens

abnormal blastema
type: Class
subclass of: abnormal regenerating tissue
definition: Abnormality of blastema.
has_exact_synonym: abnormality of blastema

abnormal ventral aorta
type: Class
subclass of: abnormal aorta
subclass of: abnormal trunk vasculature
definition: Abnormality of ventral aorta.
has_exact_synonym: abnormality of ventral aorta

abnormal pulmonary artery
type: Class
subclass of: abnormal artery
subclass of: abnormal trunk vasculature
definition: Abnormality of pulmonary artery.
has_exact_synonym: abnormality of pulmonary artery

abnormal trabecula cranii
type: Class
subclass of: abnormal cartilage element
subclass of: abnormal chondrocranium
definition: Abnormality of trabecula cranii.
has_exact_synonym: abnormality of trabecula cranii

abnormal right channel of ventral aorta
type: Class
subclass of: abnormal artery
subclass of: abnormal trunk vasculature
definition: Abnormality of right channel of ventral aorta.
has_exact_synonym: abnormality of right channel of ventral aorta

abnormal second pancreatic bud
type: Class
subclass of: abnormal multi-tissue structure
subclass of: abnormal posterior foregut
definition: Abnormality of second pancreatic bud.
has_exact_synonym: abnormality of second pancreatic bud

abnormal first pancreatic bud
type: Class
subclass of: abnormal primordium
subclass of: abnormal posterior foregut
definition: Abnormality of first pancreatic bud.
has_exact_synonym: abnormality of first pancreatic bud

abnormal hepato-pancreatic progenitor cell
type: Class
subclass of: abnormal foregut
subclass of: abnormal progenitor cell
definition: Abnormality of hepato-pancreatic progenitor cell.
has_exact_synonym: abnormality of hepato-pancreatic progenitor cell

abnormal ionocyte
type: Class
subclass of: abnormal epidermis
subclass of: abnormal non-neural ectoderm
subclass of: abnormal non-ciliated epithelial cell
definition: Abnormality of ionocyte.
has_exact_synonym: abnormality of ionocyte

abnormal epithelial cell
type: Class
subclass of: abnormal cell
subclass of: abnormal epithelium
definition: Abnormality of epithelial cell.
has_exact_synonym: abnormality of epithelial cell

abnormal basal ganglion
type: Class
subclass of: abnormal anatomical cluster
subclass of: abnormal basal forebrain
definition: Abnormality of basal ganglion.
has_exact_synonym: abnormality of basal ganglion

abnormal semicircular canal
type: Class
subclass of: abnormal tissue
subclass of: abnormal osseous labyrinth
definition: Abnormality of semicircular canal.
has_exact_synonym: abnormality of semicircular canal

abnormal membrane bone
type: Class
subclass of: abnormal bone element
definition: Abnormality of membrane bone.
has_exact_synonym: abnormality of membrane bone

abnormal bone element
type: Class
subclass of: abnormal skeletal element
definition: Abnormality of bone element.
has_exact_synonym: abnormality of bone element

abnormal facial nerve
type: Class
subclass of: abnormal cranial nerve
subclass of: abnormal gustatory system
definition: Abnormality of facial nerve.
has_exact_synonym: abnormality of facial nerve

abnormal lateral semicircular canal
type: Class
subclass of: abnormal semicircular canal
definition: Abnormality of lateral semicircular canal.
has_exact_synonym: abnormality of lateral semicircular canal

abnormal endocrine system
type: Class
subclass of: abnormal anatomical system
definition: Abnormality of endocrine system.
has_exact_synonym: abnormality of endocrine system

abnormal vertebral element
type: Class
subclass of: abnormal skeletal element
subclass of: abnormal vertebral column
definition: Abnormality of vertebral element.
has_exact_synonym: abnormality of vertebral element

abnormal hindlimb skeleton
type: Class
subclass of: abnormal appendicular skeleton
subclass of: abnormal hindlimb
definition: Abnormality of hindlimb skeleton.
has_exact_synonym: abnormality of hindlimb skeleton

abnormal skeletal subdivision
type: Class
subclass of: abnormal skeleton
definition: Abnormality of skeletal subdivision.
has_exact_synonym: abnormality of skeletal subdivision

abnormal photoreceptor layer
type: Class
subclass of: abnormal tissue
subclass of: abnormal retinal neural layer
definition: Abnormality of photoreceptor layer.
has_exact_synonym: abnormality of photoreceptor layer

abnormal brain ventricle
type: Class
subclass of: abnormal anatomical space
subclass of: abnormal brain
definition: Abnormality of brain ventricle.
has_exact_synonym: abnormality of brain ventricle

abnormal compound organ
type: Class
subclass of: abnormal multicellular anatomical structure
definition: Abnormality of compound organ.
has_exact_synonym: abnormality of compound organ

abnormal lymphatic system
type: Class
subclass of: abnormal anatomical system
definition: Abnormality of lymphatic system.
has_exact_synonym: abnormality of lymphatic system

abnormal pars nervosa
type: Class
subclass of: abnormal neurohypophysis
definition: Abnormality of pars nervosa.
has_exact_synonym: abnormality of pars nervosa

abnormal anterior entopeduncular nucleus
type: Class
subclass of: abnormal neural nucleus
subclass of: abnormal pallidum
definition: Abnormality of anterior entopeduncular nucleus.
has_exact_synonym: abnormality of anterior entopeduncular nucleus

abnormal oval window
type: Class
subclass of: abnormal anatomical space
subclass of: abnormal otic capsule
definition: Abnormality of oval window.
has_exact_synonym: abnormality of oval window

abnormal mm. constrictores branchiales IV primordium
type: Class
subclass of: abnormal cranial muscle primordium
definition: Abnormality of mm. constrictores branchiales IV primordium.
has_exact_synonym: abnormality of mm. constrictores branchiales IV primordium

abnormal claw
type: Class
subclass of: abnormal hindlimb digit
subclass of: abnormal acellular anatomical structure
definition: Abnormality of claw.
has_exact_synonym: abnormality of claw

abnormal acellular anatomical structure
type: Class
subclass of: abnormal whole organism
definition: Abnormality of acellular anatomical structure.
has_exact_synonym: abnormality of acellular anatomical structure

abnormal hindlimb digit 1
type: Class
subclass of: abnormal hindlimb digit
definition: Abnormality of hindlimb digit 1.
has_exact_synonym: abnormality of hindlimb digit 1

abnormal wound epidermis inner layer
type: Class
subclass of: abnormal wound epidermis
definition: Abnormality of wound epidermis inner layer.
has_exact_synonym: abnormality of wound epidermis inner layer

abnormal right lymph heart
type: Class
subclass of: abnormal cavitated compound organ
subclass of: abnormal lymphatic system
definition: Abnormality of right lymph heart.
has_exact_synonym: abnormality of right lymph heart

abnormal midbrain tegmentum
type: Class
subclass of: abnormal midbrain
definition: Abnormality of midbrain tegmentum.
has_exact_synonym: abnormality of midbrain tegmentum

abnormal lateral line ganglion
type: Class
subclass of: abnormal cranial ganglion
subclass of: abnormal lateral line system
definition: Abnormality of lateral line ganglion.
has_exact_synonym: abnormality of lateral line ganglion

abnormal cranial ganglion
type: Class
subclass of: abnormal head
subclass of: abnormal ganglion
definition: Abnormality of cranial ganglion.
has_exact_synonym: abnormality of cranial ganglion

abnormal trunk somite 13
type: Class
subclass of: abnormal trunk somite
definition: Abnormality of trunk somite 13.
has_exact_synonym: abnormality of trunk somite 13

abnormal avascular GAG-rich matrix
type: Class
subclass of: abnormal proteinaceous extracellular matrix
definition: Abnormality of avascular GAG-rich matrix.
has_exact_synonym: abnormality of avascular GAG-rich matrix

abnormal non-mineralized cartilage tissue
type: Class
subclass of: abnormal cartilage tissue
definition: Abnormality of non-mineralized cartilage tissue.
has_exact_synonym: abnormality of non-mineralized cartilage tissue

abnormal proteinaceous extracellular matrix
type: Class
subclass of: abnormal extracellular matrix
definition: Abnormality of proteinaceous extracellular matrix.
has_exact_synonym: abnormality of proteinaceous extracellular matrix

abnormal caudal vertebra
type: Class
subclass of: abnormal pelvic girdle
subclass of: abnormal vertebra
definition: Abnormality of caudal vertebra.
has_exact_synonym: abnormality of caudal vertebra

abnormal vertebra
type: Class
subclass of: abnormal endochondral bone
subclass of: abnormal vertebral column
definition: Abnormality of vertebra.
has_exact_synonym: abnormality of vertebra

abnormal astrocyte end-foot
type: Class
subclass of: abnormal cell part
subclass of: abnormal astrocyte
definition: Abnormality of astrocyte end-foot.
has_exact_synonym: abnormality of astrocyte end-foot

abnormal pelvic appendage
type: Class
subclass of: abnormal paired appendage
definition: Abnormality of pelvic appendage.
has_exact_synonym: abnormality of pelvic appendage

abnormal paired appendage
type: Class
subclass of: abnormal appendage
definition: Abnormality of paired appendage.
has_exact_synonym: abnormality of paired appendage

abnormal diaphysis
type: Class
subclass of: abnormal organ part
subclass of: abnormal humerus
subclass of: abnormal radio-ulna
subclass of: abnormal tibia-fibula
subclass of: abnormal femur
definition: Abnormality of diaphysis.
has_exact_synonym: abnormality of diaphysis

abnormal organ part
type: Class
subclass of: abnormal anatomical structure
definition: Abnormality of organ part.
has_exact_synonym: abnormality of organ part

abnormal endocardium
type: Class
subclass of: abnormal heart
subclass of: abnormal tissue
definition: Abnormality of endocardium.
has_exact_synonym: abnormality of endocardium

abnormal dermomyotome
type: Class
subclass of: abnormal somite
subclass of: abnormal multilaminar epithelium
definition: Abnormality of dermomyotome.
has_exact_synonym: abnormality of dermomyotome

abnormal multilaminar epithelium
type: Class
subclass of: abnormal epithelium
definition: Abnormality of multilaminar epithelium.
has_exact_synonym: abnormality of multilaminar epithelium

abnormal aortic arch 4
type: Class
subclass of: abnormal aortic arch
definition: Abnormality of aortic arch 4.
has_exact_synonym: abnormality of aortic arch 4

abnormal prethalamus
type: Class
subclass of: abnormal thalamus
definition: Abnormality of prethalamus.
has_exact_synonym: abnormality of prethalamus

abnormal posterior crista
type: Class
subclass of: abnormal sensory epithelial cell
subclass of: abnormal inner ear
definition: Abnormality of posterior crista.
has_exact_synonym: abnormality of posterior crista

abnormal sensory epithelial cell
type: Class
subclass of: abnormal epithelial cell
definition: Abnormality of sensory epithelial cell.
has_exact_synonym: abnormality of sensory epithelial cell

abnormal trunk neural crest
type: Class
subclass of: XPO_0141494
definition: Abnormality of trunk neural crest.
has_exact_synonym: abnormality of trunk neural crest

abnormal wound epidermis
type: Class
subclass of: abnormal blastema
definition: Abnormality of wound epidermis.
has_exact_synonym: abnormality of wound epidermis

abnormal circulatory system
type: Class
subclass of: abnormal anatomical system
definition: Abnormality of circulatory system.
has_exact_synonym: abnormality of circulatory system

abnormal mesonephric tubule
type: Class
subclass of: abnormal tissue
subclass of: abnormal mesonephric nephron
definition: Abnormality of mesonephric tubule.
has_exact_synonym: abnormality of mesonephric tubule

abnormal mesonephric nephron
type: Class
subclass of: abnormal multi-tissue structure
subclass of: abnormal mesonephric kidney
definition: Abnormality of mesonephric nephron.
has_exact_synonym: abnormality of mesonephric nephron

abnormal coelom
type: Class
subclass of: abnormal anatomical space
subclass of: abnormal trunk
subclass of: abnormal embryo
definition: Abnormality of coelom.
has_exact_synonym: abnormality of coelom

abnormal visual system
type: Class
subclass of: abnormal sensory system
definition: Abnormality of visual system.
has_exact_synonym: abnormality of visual system

abnormal sensory system
type: Class
subclass of: abnormal nervous system
definition: Abnormality of sensory system.
has_exact_synonym: abnormality of sensory system

abnormal skeletal muscle
type: Class
subclass of: abnormal muscle
definition: Abnormality of skeletal muscle.
has_exact_synonym: abnormality of skeletal muscle

abnormal blastocoel
type: Class
subclass of: abnormal anatomical space
definition: Abnormality of blastocoel.
has_exact_synonym: abnormality of blastocoel

abnormal follicle cell
type: Class
subclass of: abnormal cell
subclass of: abnormal ovary
definition: Abnormality of follicle cell.
has_exact_synonym: abnormality of follicle cell

abnormal non-neural ectoderm
type: Class
subclass of: abnormal ectoderm
definition: Abnormality of non-neural ectoderm.
has_exact_synonym: abnormality of non-neural ectoderm

abnormal dorsal fin skeleton
type: Class
subclass of: abnormal median fin skeleton
subclass of: abnormal dorsal fin
definition: Abnormality of dorsal fin skeleton.
has_exact_synonym: abnormality of dorsal fin skeleton

abnormal median fin skeleton
type: Class
subclass of: abnormal skeletal subdivision
subclass of: abnormal median fin
definition: Abnormality of median fin skeleton.
has_exact_synonym: abnormality of median fin skeleton

abnormal pelvic girdle primordium
type: Class
subclass of: abnormal multi-tissue structure
definition: Abnormality of pelvic girdle primordium.
has_exact_synonym: abnormality of pelvic girdle primordium

abnormal sclerotomal cartilage
type: Class
subclass of: abnormal sclerotome
definition: Abnormality of sclerotomal cartilage.
has_exact_synonym: abnormality of sclerotomal cartilage

abnormal tail vasculature
type: Class
subclass of: abnormal blood vessel
subclass of: abnormal tail
definition: Abnormality of tail vasculature.
has_exact_synonym: abnormality of tail vasculature

abnormal progenitor cell
type: Class
subclass of: abnormal cell
definition: Abnormality of progenitor cell.
has_exact_synonym: abnormality of progenitor cell

abnormal heart primordium
type: Class
subclass of: abnormal primordium
subclass of: abnormal cardiovascular system
definition: Abnormality of heart primordium.
has_exact_synonym: abnormality of heart primordium

abnormal chondroblast
type: Class
subclass of: abnormal cell
definition: Abnormality of chondroblast.
has_exact_synonym: abnormality of chondroblast

abnormal trunk somite 9
type: Class
subclass of: abnormal trunk somite
definition: Abnormality of trunk somite 9.
has_exact_synonym: abnormality of trunk somite 9

abnormal trunk somite 10
type: Class
subclass of: abnormal trunk somite
definition: Abnormality of trunk somite 10.
has_exact_synonym: abnormality of trunk somite 10

abnormal pronephric duct
type: Class
subclass of: abnormal duct
subclass of: abnormal pronephric kidney
definition: Abnormality of pronephric duct.
has_exact_synonym: abnormality of pronephric duct

abnormal duct
type: Class
subclass of: abnormal multi-tissue structure
definition: Abnormality of duct.
has_exact_synonym: abnormality of duct

abnormal extracellular matrix
type: Class
subclass of: abnormal acellular anatomical structure
definition: Abnormality of extracellular matrix.
has_exact_synonym: abnormality of extracellular matrix

abnormal tail region
type: Class
subclass of: XPO_0141315
definition: Abnormality of tail region.
has_exact_synonym: abnormality of tail region

abnormal humerus
type: Class
subclass of: abnormal endochondral bone
subclass of: abnormal forelimb skeleton
subclass of: abnormal forelimb stylopod
definition: Abnormality of humerus.
has_exact_synonym: abnormality of humerus

abnormal vagal epibranchial placode
type: Class
subclass of: abnormal epibranchial placode
definition: Abnormality of vagal epibranchial placode.
has_exact_synonym: abnormality of vagal epibranchial placode

abnormal epibranchial placode
type: Class
subclass of: abnormal neurogenic placode
subclass of: abnormal peripheral nervous system
definition: Abnormality of epibranchial placode.
has_exact_synonym: abnormality of epibranchial placode

abnormal gamma cell
type: Class
subclass of: abnormal enteroendocrine cell
subclass of: abnormal islets of Langerhans
definition: Abnormality of gamma cell.
has_exact_synonym: abnormality of gamma cell

abnormal medulla oblongata
type: Class
subclass of: abnormal hindbrain
definition: Abnormality of medulla oblongata.
has_exact_synonym: abnormality of medulla oblongata

abnormal fin
type: Class
subclass of: abnormal surface structure
subclass of: abnormal ectoderm
definition: Abnormality of fin.
has_exact_synonym: abnormality of fin

abnormal tail fin
type: Class
subclass of: abnormal fin
subclass of: abnormal tail
definition: Abnormality of tail fin.
has_exact_synonym: abnormality of tail fin

abnormal blastomere
type: Class
subclass of: abnormal early embryonic cell
definition: Abnormality of blastomere.
has_exact_synonym: abnormality of blastomere

abnormal early embryonic cell
type: Class
subclass of: abnormal cell
subclass of: abnormal embryo
definition: Abnormality of early embryonic cell.
has_exact_synonym: abnormality of early embryonic cell

abnormal vegetal hemisphere
type: Class
subclass of: abnormal embryo
subclass of: XPO_0141315
definition: Abnormality of vegetal hemisphere.
has_exact_synonym: abnormality of vegetal hemisphere

abnormal elastic cartilage tissue
type: Class
subclass of: abnormal non-mineralized hyaline cartilage tissue
definition: Abnormality of elastic cartilage tissue.
has_exact_synonym: abnormality of elastic cartilage tissue

abnormal non-mineralized hyaline cartilage tissue
type: Class
subclass of: abnormal non-mineralized cartilage tissue
subclass of: abnormal hyaline cartilage tissue
definition: Abnormality of non-mineralized hyaline cartilage tissue.
has_exact_synonym: abnormality of non-mineralized hyaline cartilage tissue

abnormal blastopore lip
type: Class
subclass of: abnormal blastopore
definition: Abnormality of blastopore lip.
has_exact_synonym: abnormality of blastopore lip

abnormal neurohypophysis
type: Class
subclass of: abnormal hypophysis
definition: Abnormality of neurohypophysis.
has_exact_synonym: abnormality of neurohypophysis

abnormal gamete
type: Class
subclass of: abnormal germ cell
subclass of: abnormal genital system
definition: Abnormality of gamete.
has_exact_synonym: abnormality of gamete

abnormal respiratory system
type: Class
subclass of: abnormal anatomical system
definition: Abnormality of respiratory system.
has_exact_synonym: abnormality of respiratory system

abnormal middle lateral line
type: Class
subclass of: abnormal lateral line
definition: Abnormality of middle lateral line.
has_exact_synonym: abnormality of middle lateral line

abnormal lateral line
type: Class
subclass of: abnormal tissue
subclass of: abnormal lateral line system
definition: Abnormality of lateral line.
has_exact_synonym: abnormality of lateral line

abnormal eye muscle
type: Class
subclass of: abnormal cranial muscle
definition: Abnormality of eye muscle.
has_exact_synonym: abnormality of eye muscle

abnormal m. obliquus superior primordium
type: Class
subclass of: abnormal cranial muscle primordium
definition: Abnormality of m. obliquus superior primordium.
has_exact_synonym: abnormality of m. obliquus superior primordium

abnormal intersomitic artery
type: Class
subclass of: abnormal intersomitic vessel
definition: Abnormality of intersomitic artery.
has_exact_synonym: abnormality of intersomitic artery

abnormal intersomitic vessel
type: Class
subclass of: abnormal blood vessel
subclass of: abnormal intersomitic region
definition: Abnormality of intersomitic vessel.
has_exact_synonym: abnormality of intersomitic vessel

abnormal axial skeleton
type: Class
subclass of: abnormal skeletal subdivision
definition: Abnormality of axial skeleton.
has_exact_synonym: abnormality of axial skeleton

abnormal visceral pouch
type: Class
subclass of: abnormal embryonic structure
subclass of: abnormal pharyngeal region
definition: Abnormality of visceral pouch.
has_exact_synonym: abnormality of visceral pouch

abnormal supraorbital lateral line
type: Class
subclass of: abnormal lateral line
definition: Abnormality of supraorbital lateral line.
has_exact_synonym: abnormality of supraorbital lateral line

abnormal retinal blood vessel
type: Class
subclass of: abnormal head vasculature
subclass of: abnormal blood vessel
definition: Abnormality of retinal blood vessel.
has_exact_synonym: abnormality of retinal blood vessel

abnormal tympanic annulus
type: Class
subclass of: abnormal cartilage element
subclass of: abnormal inner ear
definition: Abnormality of tympanic annulus.
has_exact_synonym: abnormality of tympanic annulus

abnormal m. interhyoideus primordium
type: Class
subclass of: abnormal cranial muscle primordium
definition: Abnormality of m. interhyoideus primordium.
has_exact_synonym: abnormality of m. interhyoideus primordium

abnormal germinal granule
type: Class
subclass of: abnormal germ plasm
definition: Abnormality of germinal granule.
has_exact_synonym: abnormality of germinal granule

abnormal pronephric mesenchyme
type: Class
subclass of: abnormal mesenchyme
definition: Abnormality of pronephric mesenchyme.
has_exact_synonym: abnormality of pronephric mesenchyme

abnormal trunk placode
type: Class
subclass of: abnormal embryonic structure
subclass of: abnormal ectoderm
definition: Abnormality of trunk placode.
has_exact_synonym: abnormality of trunk placode

abnormal commissural interneuron
type: Class
subclass of: abnormal interneuron
definition: Abnormality of commissural interneuron.
has_exact_synonym: abnormality of commissural interneuron

abnormal interneuron
type: Class
subclass of: abnormal neuron
subclass of: abnormal enteric nervous system
definition: Abnormality of interneuron.
has_exact_synonym: abnormality of interneuron

abnormal zygote
type: Class
subclass of: abnormal cell
definition: Abnormality of zygote.
has_exact_synonym: abnormality of zygote

abnormal lateral ganglionic eminence
type: Class
subclass of: abnormal tissue
subclass of: abnormal subpallium
definition: Abnormality of lateral ganglionic eminence.
has_exact_synonym: abnormality of lateral ganglionic eminence

abnormal circumblastoporal collar
type: Class
subclass of: abnormal embryonic structure
definition: Abnormality of circumblastoporal collar.
has_exact_synonym: abnormality of circumblastoporal collar

abnormal midbrain
type: Class
subclass of: abnormal multi-tissue structure
subclass of: abnormal brain
definition: Abnormality of midbrain.
has_exact_synonym: abnormality of midbrain

abnormal hand
type: Class
subclass of: abnormal forelimb
subclass of: abnormal autopod
definition: Abnormality of hand.
has_exact_synonym: abnormality of hand

abnormal forelimb skeleton
type: Class
subclass of: abnormal appendicular skeleton
subclass of: abnormal forelimb
definition: Abnormality of forelimb skeleton.
has_exact_synonym: abnormality of forelimb skeleton

abnormal lateral plate mesoderm
type: Class
subclass of: abnormal embryonic structure
subclass of: abnormal mesoderm
definition: Abnormality of lateral plate mesoderm.
has_exact_synonym: abnormality of lateral plate mesoderm

abnormal portion of organism substance
type: Class
subclass of: Xenopus phenotype
definition: Abnormality of portion of organism substance.
has_exact_synonym: abnormality of portion of organism substance

abnormal hyaline cartilage tissue
type: Class
subclass of: abnormal cartilage tissue
definition: Abnormality of hyaline cartilage tissue.
has_exact_synonym: abnormality of hyaline cartilage tissue

abnormal anterior neural fold
type: Class
subclass of: abnormal neural fold
subclass of: abnormal pre-chordal neural plate
definition: Abnormality of anterior neural fold.
has_exact_synonym: abnormality of anterior neural fold

abnormal axial ossicle
type: Class
subclass of: abnormal ossicle
subclass of: abnormal postcranial axial skeleton
definition: Abnormality of axial ossicle.
has_exact_synonym: abnormality of axial ossicle

abnormal ossicle
type: Class
subclass of: abnormal skeletal element
definition: Abnormality of ossicle.
has_exact_synonym: abnormality of ossicle

abnormal appendicular skeleton
type: Class
subclass of: abnormal skeletal subdivision
definition: Abnormality of appendicular skeleton.
has_exact_synonym: abnormality of appendicular skeleton

abnormal granule cell
type: Class
subclass of: abnormal granule cell layer of the olfactory bulb
subclass of: abnormal interneuron
subclass of: abnormal granule cell layer of the cerebellum
definition: Abnormality of granule cell.
has_exact_synonym: abnormality of granule cell

abnormal neural plate border
type: Class
subclass of: abnormal neural plate
definition: Abnormality of neural plate border.
has_exact_synonym: abnormality of neural plate border

abnormal amygdala
type: Class
subclass of: abnormal anatomical cluster
subclass of: abnormal basal forebrain
definition: Abnormality of amygdala.
has_exact_synonym: abnormality of amygdala

abnormal striatum
type: Class
subclass of: abnormal basal ganglion
definition: Abnormality of striatum.
has_exact_synonym: abnormality of striatum

abnormal m. rectus anterior primordium
type: Class
subclass of: abnormal cranial muscle primordium
definition: Abnormality of m. rectus anterior primordium.
has_exact_synonym: abnormality of m. rectus anterior primordium

abnormal Leydig cell
type: Class
subclass of: abnormal epidermis
subclass of: abnormal blastema
subclass of: abnormal epithelial cell
definition: Abnormality of Leydig cell.
has_exact_synonym: abnormality of Leydig cell

abnormal ganglion
type: Class
subclass of: abnormal tissue
subclass of: abnormal peripheral nervous system
definition: Abnormality of ganglion.
has_exact_synonym: abnormality of ganglion

abnormal trigeminal placode
type: Class
subclass of: abnormal neurogenic placode
definition: Abnormality of trigeminal placode.
has_exact_synonym: abnormality of trigeminal placode

abnormal aortic arch 6
type: Class
subclass of: abnormal aortic arch
definition: Abnormality of aortic arch 6.
has_exact_synonym: abnormality of aortic arch 6

abnormal small intestine
type: Class
subclass of: abnormal multi-tissue structure
subclass of: abnormal intestine
definition: Abnormality of small intestine.
has_exact_synonym: abnormality of small intestine

abnormal acinar cell
type: Class
subclass of: abnormal cell
subclass of: abnormal pancreas
definition: Abnormality of acinar cell.
has_exact_synonym: abnormality of acinar cell

abnormal cardiovascular system
type: Class
subclass of: abnormal anatomical system
definition: Abnormality of cardiovascular system.
has_exact_synonym: abnormality of cardiovascular system

abnormal mm. levator arcuum branchialium III primordium
type: Class
subclass of: abnormal cranial muscle primordium
definition: Abnormality of mm. levator arcuum branchialium III primordium.
has_exact_synonym: abnormality of mm. levator arcuum branchialium III primordium

abnormal braincase and otic capsule skeleton
type: Class
subclass of: abnormal cranium
subclass of: abnormal skeletal subdivision
definition: Abnormality of braincase and otic capsule skeleton.
has_exact_synonym: abnormality of braincase and otic capsule skeleton

abnormal non-mineralized chondroid tissue
type: Class
subclass of: abnormal skeletal tissue
definition: Abnormality of non-mineralized chondroid tissue.
has_exact_synonym: abnormality of non-mineralized chondroid tissue

abnormal skeletal tissue
type: Class
subclass of: abnormal skeletal element
subclass of: abnormal connective tissue
definition: Abnormality of skeletal tissue.
has_exact_synonym: abnormality of skeletal tissue

abnormal neural crest
type: Class
subclass of: abnormal neuroectoderm
definition: Abnormality of neural crest.
has_exact_synonym: abnormality of neural crest

abnormal m. levator mandibulae longus internus primordium
type: Class
subclass of: abnormal cranial muscle primordium
definition: Abnormality of m. levator mandibulae longus internus primordium.
has_exact_synonym: abnormality of m. levator mandibulae longus internus primordium

abnormal hyaloid blood vessel
type: Class
subclass of: abnormal head vasculature
subclass of: abnormal blood vessel
definition: Abnormality of hyaloid blood vessel.
has_exact_synonym: abnormality of hyaloid blood vessel

abnormal hematological system
type: Class
subclass of: abnormal anatomical system
definition: Abnormality of hematological system.
has_exact_synonym: abnormality of hematological system

abnormal splanchnocranium
type: Class
subclass of: abnormal cranium
definition: Abnormality of splanchnocranium.
has_exact_synonym: abnormality of splanchnocranium

abnormal pharyngeal endoderm
type: Class
subclass of: abnormal endoderm
subclass of: abnormal pharyngeal region
definition: Abnormality of pharyngeal endoderm.
has_exact_synonym: abnormality of pharyngeal endoderm

abnormal anterior entopeduncular region
type: Class
subclass of: abnormal telencephalon
definition: Abnormality of anterior entopeduncular region.
has_exact_synonym: abnormality of anterior entopeduncular region

abnormal animal pole
type: Class
subclass of: abnormal animal hemisphere
definition: Abnormality of animal pole.
has_exact_synonym: abnormality of animal pole

abnormal connective tissue
type: Class
subclass of: abnormal tissue
definition: Abnormality of connective tissue.
has_exact_synonym: abnormality of connective tissue

abnormal perichondrium
type: Class
subclass of: abnormal connective tissue
definition: Abnormality of perichondrium.
has_exact_synonym: abnormality of perichondrium

abnormal periosteum
type: Class
subclass of: abnormal bone tissue
definition: Abnormality of periosteum.
has_exact_synonym: abnormality of periosteum

abnormal m. levator mandibulae longus superficialis
type: Class
subclass of: abnormal mandibular head muscle
definition: Abnormality of m. levator mandibulae longus superficialis.
has_exact_synonym: abnormality of m. levator mandibulae longus superficialis

abnormal mandibular head muscle
type: Class
subclass of: abnormal cranial muscle
definition: Abnormality of mandibular head muscle.
has_exact_synonym: abnormality of mandibular head muscle

abnormal interdigital mesenchyme
type: Class
subclass of: abnormal mesenchyme
subclass of: abnormal limb bud
definition: Abnormality of interdigital mesenchyme.
has_exact_synonym: abnormality of interdigital mesenchyme

abnormal amputated fin
type: Class
subclass of: abnormal amputated tissue
definition: Abnormality of amputated fin.
has_exact_synonym: abnormality of amputated fin

abnormal amputated tissue
type: Class
subclass of: abnormal tissue
definition: Abnormality of amputated tissue.
has_exact_synonym: abnormality of amputated tissue

abnormal retinal neural layer
type: Class
subclass of: abnormal retina
definition: Abnormality of retinal neural layer.
has_exact_synonym: abnormality of retinal neural layer

abnormal limb
type: Class
subclass of: abnormal organism subdivision
definition: Abnormality of limb.
has_exact_synonym: abnormality of limb

abnormal viscus
type: Class
subclass of: abnormal anatomical cluster
subclass of: abnormal trunk
definition: Abnormality of viscus.
has_exact_synonym: abnormality of viscus

abnormal adenohypophyseal placode
type: Class
subclass of: abnormal non-neural ectoderm
subclass of: XPO_0131672
definition: Abnormality of adenohypophyseal placode.
has_exact_synonym: abnormality of adenohypophyseal placode

abnormal cranial placode
type: Class
subclass of: abnormal embryonic structure
subclass of: abnormal neuroectoderm
definition: Abnormality of cranial placode.
has_exact_synonym: abnormality of cranial placode

abnormal m. levator mandibulae longus profundus primordium
type: Class
subclass of: abnormal cranial muscle primordium
definition: Abnormality of m. levator mandibulae longus profundus primordium.
has_exact_synonym: abnormality of m. levator mandibulae longus profundus primordium

abnormal proximal stomach
type: Class
subclass of: abnormal multi-tissue structure
subclass of: abnormal stomach
definition: Abnormality of proximal stomach.
has_exact_synonym: abnormality of proximal stomach

abnormal cilium
type: Class
subclass of: abnormal cell part
subclass of: abnormal ciliated cell
definition: Abnormality of cilium.
has_exact_synonym: abnormality of cilium

abnormal involuting marginal zone
type: Class
subclass of: abnormal marginal zone
definition: Abnormality of involuting marginal zone.
has_exact_synonym: abnormality of involuting marginal zone

abnormal marginal zone
type: Class
subclass of: abnormal embryonic structure
definition: Abnormality of marginal zone.
has_exact_synonym: abnormality of marginal zone

abnormal blastomere D1.1
type: Class
subclass of: abnormal dorsal animal hemisphere blastomere
definition: Abnormality of blastomere D1.1.
has_exact_synonym: abnormality of blastomere D1.1

abnormal dorsal animal hemisphere blastomere
type: Class
subclass of: abnormal animal blastomere
definition: Abnormality of dorsal animal hemisphere blastomere.
has_exact_synonym: abnormality of dorsal animal hemisphere blastomere

abnormal ventral vegetal hemisphere blastomere
type: Class
subclass of: abnormal vegetal blastomere
definition: Abnormality of ventral vegetal hemisphere blastomere.
has_exact_synonym: abnormality of ventral vegetal hemisphere blastomere

abnormal vegetal blastomere
type: Class
subclass of: abnormal blastomere
subclass of: abnormal vegetal hemisphere
definition: Abnormality of vegetal blastomere.
has_exact_synonym: abnormality of vegetal blastomere

abnormal radio-ulna
type: Class
subclass of: abnormal endochondral bone
subclass of: abnormal forelimb skeleton
subclass of: abnormal forelimb zeugopod
definition: Abnormality of radio-ulna.
has_exact_synonym: abnormality of radio-ulna

abnormal tibia-fibula
type: Class
subclass of: abnormal endochondral bone
subclass of: abnormal hindlimb skeleton
subclass of: abnormal hindlimb zeugopod
definition: Abnormality of tibia-fibula.
has_exact_synonym: abnormality of tibia-fibula

abnormal femur
type: Class
subclass of: abnormal endochondral bone
subclass of: abnormal hindlimb skeleton
subclass of: abnormal hindlimb stylopod
definition: Abnormality of femur.
has_exact_synonym: abnormality of femur

abnormal zeugopod
type: Class
subclass of: abnormal limb segment
definition: Abnormality of zeugopod.
has_exact_synonym: abnormality of zeugopod

abnormal forelimb
type: Class
subclass of: abnormal limb
subclass of: abnormal pectoral appendage
definition: Abnormality of forelimb.
has_exact_synonym: abnormality of forelimb

abnormal hematopoietic stem cell
type: Class
subclass of: abnormal stem cell
subclass of: abnormal ventral blood island
subclass of: abnormal anterior dorsal lateral plate region
definition: Abnormality of hematopoietic stem cell.
has_exact_synonym: abnormality of hematopoietic stem cell

abnormal preplacodal ectoderm
type: Class
subclass of: abnormal sensorial layer of neurectoderm
definition: Abnormality of preplacodal ectoderm.
has_exact_synonym: abnormality of preplacodal ectoderm

abnormal tail somite
type: Class
subclass of: abnormal somite
subclass of: abnormal tail
definition: Abnormality of tail somite.
has_exact_synonym: abnormality of tail somite

abnormal presomitic mesoderm
type: Class
subclass of: abnormal muscular system
subclass of: abnormal paraxial mesoderm
definition: Abnormality of presomitic mesoderm.
has_exact_synonym: abnormality of presomitic mesoderm

abnormal glomus
type: Class
subclass of: abnormal pronephric kidney
definition: Abnormality of glomus.
has_exact_synonym: abnormality of glomus

abnormal archenteron
type: Class
subclass of: abnormal anatomical space
subclass of: abnormal endoderm
definition: Abnormality of archenteron.
has_exact_synonym: abnormality of archenteron

abnormal foregut endoderm
type: Class
subclass of: abnormal endoderm
subclass of: abnormal primordium
definition: Abnormality of foregut endoderm.
has_exact_synonym: abnormality of foregut endoderm

abnormal trunk somite 11
type: Class
subclass of: abnormal trunk somite
definition: Abnormality of trunk somite 11.
has_exact_synonym: abnormality of trunk somite 11

abnormal pericardial roof
type: Class
subclass of: abnormal tissue
subclass of: abnormal pericardium
definition: Abnormality of pericardial roof.
has_exact_synonym: abnormality of pericardial roof

abnormal proximal mesenchyme
type: Class
subclass of: abnormal mesenchyme
subclass of: abnormal limb bud
definition: Abnormality of proximal mesenchyme.
has_exact_synonym: abnormality of proximal mesenchyme

abnormal testis
type: Class
subclass of: abnormal gonad
subclass of: abnormal male genitalia
definition: Abnormality of testis.
has_exact_synonym: abnormality of testis

abnormal secretory epithelial cell
type: Class
subclass of: abnormal epithelial cell
definition: Abnormality of secretory epithelial cell.
has_exact_synonym: abnormality of secretory epithelial cell

abnormal ligament
type: Class
subclass of: abnormal dense regular connective tissue
definition: Abnormality of ligament.
has_exact_synonym: abnormality of ligament

abnormal dense regular connective tissue
type: Class
subclass of: abnormal connective tissue
definition: Abnormality of dense regular connective tissue.
has_exact_synonym: abnormality of dense regular connective tissue

abnormal anterior palatine artery
type: Class
subclass of: abnormal internal carotid artery
definition: Abnormality of anterior palatine artery.
has_exact_synonym: abnormality of anterior palatine artery

abnormal hindlimb digit 2
type: Class
subclass of: abnormal hindlimb digit
definition: Abnormality of hindlimb digit 2.
has_exact_synonym: abnormality of hindlimb digit 2

abnormal choana
type: Class
subclass of: abnormal head
subclass of: abnormal anatomical space
definition: Abnormality of choana.
has_exact_synonym: abnormality of choana

abnormal dorsal lateral plate mesoderm
type: Class
subclass of: abnormal lateral plate mesoderm
definition: Abnormality of dorsal lateral plate mesoderm.
has_exact_synonym: abnormality of dorsal lateral plate mesoderm

abnormal notochord
type: Class
subclass of: abnormal tissue
definition: Abnormality of notochord.
has_exact_synonym: abnormality of notochord

abnormal process
type: Class
subclass of: abnormal whole organism
definition: Abnormality of process.
has_exact_synonym: abnormality of process

abnormal auditory ossicle
type: Class
subclass of: abnormal bone element
subclass of: abnormal inner ear
definition: Abnormality of auditory ossicle.
has_exact_synonym: abnormality of auditory ossicle

abnormal sensorial layer
type: Class
subclass of: abnormal ectoderm
definition: Abnormality of sensorial layer.
has_exact_synonym: abnormality of sensorial layer

abnormal olfactory system
type: Class
subclass of: abnormal sensory system
definition: Abnormality of olfactory system.
has_exact_synonym: abnormality of olfactory system

abnormal anterior crista
type: Class
subclass of: abnormal sensory epithelial cell
subclass of: abnormal inner ear
definition: Abnormality of anterior crista.
has_exact_synonym: abnormality of anterior crista

abnormal spermatid
type: Class
subclass of: abnormal germ cell
definition: Abnormality of spermatid.
has_exact_synonym: abnormality of spermatid

abnormal odontoid tissue
type: Class
subclass of: abnormal skeletal tissue
subclass of: abnormal dermal skeleton
definition: Abnormality of odontoid tissue.
has_exact_synonym: abnormality of odontoid tissue

abnormal anterior neural ridge
type: Class
subclass of: abnormal neural plate
definition: Abnormality of anterior neural ridge.
has_exact_synonym: abnormality of anterior neural ridge

abnormal epidermis inner layer
type: Class
subclass of: abnormal epidermis
definition: Abnormality of epidermis inner layer.
has_exact_synonym: abnormality of epidermis inner layer

abnormal pectoral appendage
type: Class
subclass of: abnormal paired appendage
definition: Abnormality of pectoral appendage.
has_exact_synonym: abnormality of pectoral appendage

abnormal ventral pallium
type: Class
subclass of: abnormal pallium
definition: Abnormality of ventral pallium.
has_exact_synonym: abnormality of ventral pallium

abnormal epsilon cell
type: Class
subclass of: abnormal enteroendocrine cell
subclass of: abnormal islets of Langerhans
definition: Abnormality of epsilon cell.
has_exact_synonym: abnormality of epsilon cell

abnormal nucleus of the solitary tract
type: Class
subclass of: abnormal neural nucleus
subclass of: abnormal medulla oblongata
definition: Abnormality of nucleus of the solitary tract.
has_exact_synonym: abnormality of nucleus of the solitary tract

abnormal proepicardium
type: Class
subclass of: abnormal progenitor cell
definition: Abnormality of proepicardium.
has_exact_synonym: abnormality of proepicardium

abnormal spinal cord
type: Class
subclass of: abnormal central nervous system
subclass of: abnormal cavitated compound organ
definition: Abnormality of spinal cord.
has_exact_synonym: abnormality of spinal cord

abnormal internal carotid artery
type: Class
subclass of: abnormal head vasculature
subclass of: abnormal artery
definition: Abnormality of internal carotid artery.
has_exact_synonym: abnormality of internal carotid artery

abnormal trunk somite 2
type: Class
subclass of: abnormal trunk somite
definition: Abnormality of trunk somite 2.
has_exact_synonym: abnormality of trunk somite 2

abnormal cement gland
type: Class
subclass of: abnormal surface structure
definition: Abnormality of cement gland.
has_exact_synonym: abnormality of cement gland

abnormal spinal ganglion
type: Class
subclass of: abnormal ganglion
definition: Abnormality of spinal ganglion.
has_exact_synonym: abnormality of spinal ganglion

abnormal spleen
type: Class
subclass of: abnormal compound organ
subclass of: abnormal viscus
subclass of: abnormal immune system
definition: Abnormality of spleen.
has_exact_synonym: abnormality of spleen

abnormal head somite 2
type: Class
subclass of: abnormal head somite
definition: Abnormality of head somite 2.
has_exact_synonym: abnormality of head somite 2

abnormal thymocyte
type: Class
subclass of: abnormal lymphocyte
subclass of: abnormal thymus
definition: Abnormality of thymocyte.
has_exact_synonym: abnormality of thymocyte

abnormal lymphocyte
type: Class
subclass of: abnormal cell
subclass of: abnormal immune system
definition: Abnormality of lymphocyte.
has_exact_synonym: abnormality of lymphocyte

abnormal circumpharyngeal ridge
type: Class
subclass of: abnormal embryonic structure
subclass of: abnormal pharyngeal region
definition: Abnormality of circumpharyngeal ridge.
has_exact_synonym: abnormality of circumpharyngeal ridge

abnormal head mesenchyme
type: Class
subclass of: abnormal head
subclass of: abnormal mesenchyme
definition: Abnormality of head mesenchyme.
has_exact_synonym: abnormality of head mesenchyme

abnormal fin margin
type: Class
subclass of: abnormal fin
definition: Abnormality of fin margin.
has_exact_synonym: abnormality of fin margin

abnormal ventral tail fin
type: Class
subclass of: abnormal tail fin
definition: Abnormality of ventral tail fin.
has_exact_synonym: abnormality of ventral tail fin

abnormal lung bud
type: Class
subclass of: abnormal multi-tissue structure
subclass of: abnormal foregut
subclass of: abnormal respiratory system
definition: Abnormality of lung bud.
has_exact_synonym: abnormality of lung bud

abnormal optic field
type: Class
subclass of: abnormal pre-chordal neural plate
subclass of: XPO_0141315
definition: Abnormality of optic field.
has_exact_synonym: abnormality of optic field

abnormal m. levator mandibulae externus primordium
type: Class
subclass of: abnormal cranial muscle primordium
definition: Abnormality of m. levator mandibulae externus primordium.
has_exact_synonym: abnormality of m. levator mandibulae externus primordium

abnormal foot
type: Class
subclass of: abnormal autopod
subclass of: abnormal hindlimb
definition: Abnormality of foot.
has_exact_synonym: abnormality of foot

abnormal autopod
type: Class
subclass of: abnormal limb segment
definition: Abnormality of autopod.
has_exact_synonym: abnormality of autopod

abnormal optic vesicle
type: Class
subclass of: abnormal embryonic structure
subclass of: abnormal visual system
definition: Abnormality of optic vesicle.
has_exact_synonym: abnormality of optic vesicle

abnormal ethmoid region
type: Class
subclass of: abnormal cranium
definition: Abnormality of ethmoid region.
has_exact_synonym: abnormality of ethmoid region

abnormal craniofacial skeleton
type: Class
subclass of: abnormal cranial skeleton
definition: Abnormality of craniofacial skeleton.
has_exact_synonym: abnormality of craniofacial skeleton

abnormal anterior foregut
type: Class
subclass of: abnormal foregut
definition: Abnormality of anterior foregut.
has_exact_synonym: abnormality of anterior foregut

abnormal m. transversus ventralis II
type: Class
subclass of: abnormal branchial head muscle
definition: Abnormality of m. transversus ventralis II.
has_exact_synonym: abnormality of m. transversus ventralis II

abnormal branchial head muscle
type: Class
subclass of: abnormal cranial muscle
definition: Abnormality of branchial head muscle.
has_exact_synonym: abnormality of branchial head muscle

abnormal skeletal system
type: Class
subclass of: abnormal musculoskeletal system
definition: Abnormality of skeletal system.
has_exact_synonym: abnormality of skeletal system

abnormal limb bud
type: Class
subclass of: abnormal surface structure
definition: Abnormality of limb bud.
has_exact_synonym: abnormality of limb bud

abnormal tail somite 16
type: Class
subclass of: abnormal tail somite
definition: Abnormality of tail somite 16.
has_exact_synonym: abnormality of tail somite 16

abnormal muscular system
type: Class
subclass of: abnormal musculoskeletal system
definition: Abnormality of muscular system.
has_exact_synonym: abnormality of muscular system

abnormal mandibular crest
type: Class
subclass of: abnormal cranial neural crest
definition: Abnormality of mandibular crest.
has_exact_synonym: abnormality of mandibular crest

abnormal mandibular arch
type: Class
subclass of: abnormal splanchnocranium
subclass of: abnormal pharyngeal arch
definition: Abnormality of mandibular arch.
has_exact_synonym: abnormality of mandibular arch

abnormal trunk somite 8
type: Class
subclass of: abnormal trunk somite
definition: Abnormality of trunk somite 8.
has_exact_synonym: abnormality of trunk somite 8

abnormal ventral habenular nucleus
type: Class
subclass of: abnormal neural nucleus
subclass of: abnormal habenula
definition: Abnormality of ventral habenular nucleus.
has_exact_synonym: abnormality of ventral habenular nucleus

abnormal cartilage tissue
type: Class
subclass of: abnormal skeletal tissue
subclass of: abnormal endoskeleton
definition: Abnormality of cartilage tissue.
has_exact_synonym: abnormality of cartilage tissue

abnormal anteroventral tegmental nucleus
type: Class
subclass of: abnormal neural nucleus
subclass of: abnormal midbrain tegmentum
definition: Abnormality of anteroventral tegmental nucleus.
has_exact_synonym: abnormality of anteroventral tegmental nucleus

abnormal trunk somite 7
type: Class
subclass of: abnormal trunk somite
definition: Abnormality of trunk somite 7.
has_exact_synonym: abnormality of trunk somite 7

abnormal pericyte
type: Class
subclass of: abnormal cell
definition: Abnormality of pericyte.
has_exact_synonym: abnormality of pericyte

abnormal processus lateralis hyalis
type: Class
subclass of: abnormal cartilage element
subclass of: abnormal chondrocranium
definition: Abnormality of processus lateralis hyalis.
has_exact_synonym: abnormality of processus lateralis hyalis

abnormal lens placode
type: Class
subclass of: abnormal anterior placodal area
subclass of: XPO_0131672
definition: Abnormality of lens placode.
has_exact_synonym: abnormality of lens placode

abnormal midbrain-hindbrain boundary
type: Class
subclass of: abnormal neural plate
subclass of: abnormal brain
subclass of: abnormal anatomical line
definition: Abnormality of midbrain-hindbrain boundary.
has_exact_synonym: abnormality of midbrain-hindbrain boundary

abnormal anatomical line
type: Class
subclass of: Xenopus phenotype
definition: Abnormality of anatomical line.
has_exact_synonym: abnormality of anatomical line

abnormal Mullerian duct
type: Class
subclass of: abnormal duct
subclass of: abnormal urogenital system
definition: Abnormality of Mullerian duct.
has_exact_synonym: abnormality of Mullerian duct

abnormal cloaca
type: Class
subclass of: abnormal alimentary system
subclass of: abnormal tail bud
definition: Abnormality of cloaca.
has_exact_synonym: abnormality of cloaca

abnormal cement gland primordium
type: Class
subclass of: abnormal primordium
definition: Abnormality of cement gland primordium.
has_exact_synonym: abnormality of cement gland primordium

abnormal retina
type: Class
subclass of: abnormal multi-tissue structure
subclass of: abnormal eye
definition: Abnormality of retina.
has_exact_synonym: abnormality of retina

abnormal oral evagination
type: Class
subclass of: abnormal embryonic structure
subclass of: abnormal alimentary system
definition: Abnormality of oral evagination.
has_exact_synonym: abnormality of oral evagination

abnormal distal tubule
type: Class
subclass of: abnormal pronephric tubule
definition: Abnormality of distal tubule.
has_exact_synonym: abnormality of distal tubule

abnormal external jugular vein
type: Class
subclass of: abnormal vein
subclass of: abnormal head vasculature
definition: Abnormality of external jugular vein.
has_exact_synonym: abnormality of external jugular vein

abnormal vitelline vein
type: Class
subclass of: abnormal vein
subclass of: abnormal trunk vasculature
definition: Abnormality of vitelline vein.
has_exact_synonym: abnormality of vitelline vein

abnormal pars distalis
type: Class
subclass of: abnormal adenohypophysis
definition: Abnormality of pars distalis.
has_exact_synonym: abnormality of pars distalis

abnormal gall bladder primordium
type: Class
subclass of: abnormal primordium
subclass of: abnormal posterior foregut
definition: Abnormality of gall bladder primordium.
has_exact_synonym: abnormality of gall bladder primordium

abnormal liver and biliary system
type: Class
subclass of: abnormal alimentary system
definition: Abnormality of liver and biliary system.
has_exact_synonym: abnormality of liver and biliary system

abnormal liver diverticulum
type: Class
subclass of: abnormal foregut
definition: Abnormality of liver diverticulum.
has_exact_synonym: abnormality of liver diverticulum

abnormal hyoid head muscle
type: Class
subclass of: abnormal cranial muscle
definition: Abnormality of hyoid head muscle.
has_exact_synonym: abnormality of hyoid head muscle

abnormal otic placode
type: Class
subclass of: abnormal neurogenic placode
subclass of: abnormal vestibuloauditory system
definition: Abnormality of otic placode.
has_exact_synonym: abnormality of otic placode

abnormal endoskeleton
type: Class
subclass of: abnormal skeletal subdivision
definition: Abnormality of endoskeleton.
has_exact_synonym: abnormality of endoskeleton

abnormal glomerular layer of the olfactory bulb
type: Class
subclass of: abnormal tissue
subclass of: abnormal olfactory bulb
definition: Abnormality of glomerular layer of the olfactory bulb.
has_exact_synonym: abnormality of glomerular layer of the olfactory bulb

abnormal pronephric nephrostome
type: Class
subclass of: abnormal tissue
subclass of: abnormal pronephric kidney
definition: Abnormality of pronephric nephrostome.
has_exact_synonym: abnormality of pronephric nephrostome

abnormal urogenital system
type: Class
subclass of: abnormal anatomical system
definition: Abnormality of urogenital system.
has_exact_synonym: abnormality of urogenital system

abnormal posterior semicircular canal
type: Class
subclass of: abnormal semicircular canal
definition: Abnormality of posterior semicircular canal.
has_exact_synonym: abnormality of posterior semicircular canal

abnormal blastomere D2
type: Class
subclass of: abnormal blastomere
definition: Abnormality of blastomere D2.
has_exact_synonym: abnormality of blastomere D2

abnormal renal artery
type: Class
subclass of: abnormal artery
subclass of: abnormal trunk vasculature
subclass of: abnormal urogenital system
definition: Abnormality of renal artery.
has_exact_synonym: abnormality of renal artery

abnormal skin
type: Class
subclass of: abnormal surface structure
subclass of: abnormal dermal system
definition: Abnormality of skin.
has_exact_synonym: abnormality of skin

abnormal vagal neural crest
type: Class
subclass of: XPO_0141494
definition: Abnormality of vagal neural crest.
has_exact_synonym: abnormality of vagal neural crest

abnormal germ plasm
type: Class
subclass of: abnormal cell part
subclass of: abnormal vegetal hemisphere
definition: Abnormality of germ plasm.
has_exact_synonym: abnormality of germ plasm

abnormal forelimb stylopod
type: Class
subclass of: abnormal forelimb
subclass of: abnormal stylopod
definition: Abnormality of forelimb stylopod.
has_exact_synonym: abnormality of forelimb stylopod

abnormal stylopod
type: Class
subclass of: abnormal limb segment
definition: Abnormality of stylopod.
has_exact_synonym: abnormality of stylopod

abnormal cranial skeleton
type: Class
subclass of: abnormal axial skeleton
definition: Abnormality of cranial skeleton.
has_exact_synonym: abnormality of cranial skeleton

abnormal cranial neural crest
type: Class
subclass of: abnormal neural crest
definition: Abnormality of cranial neural crest.
has_exact_synonym: abnormality of cranial neural crest

abnormal beta cell
type: Class
subclass of: abnormal enteroendocrine cell
subclass of: abnormal islets of Langerhans
definition: Abnormality of beta cell.
has_exact_synonym: abnormality of beta cell

abnormal somatic stem cell
type: Class
subclass of: abnormal stem cell
definition: Abnormality of somatic stem cell.
has_exact_synonym: abnormality of somatic stem cell

abnormal cerebellum
type: Class
subclass of: abnormal hindbrain
definition: Abnormality of cerebellum.
has_exact_synonym: abnormality of cerebellum

abnormal mineralized bone tissue
type: Class
subclass of: abnormal bone tissue
subclass of: abnormal mineralized tissue
definition: Abnormality of mineralized bone tissue.
has_exact_synonym: abnormality of mineralized bone tissue

abnormal bone tissue
type: Class
subclass of: abnormal bone element
subclass of: abnormal skeletal tissue
definition: Abnormality of bone tissue.
has_exact_synonym: abnormality of bone tissue

abnormal mineralized tissue
type: Class
subclass of: abnormal skeletal tissue
definition: Abnormality of mineralized tissue.
has_exact_synonym: abnormality of mineralized tissue

abnormal blastomere D1.2
type: Class
subclass of: abnormal dorsal animal hemisphere blastomere
definition: Abnormality of blastomere D1.2.
has_exact_synonym: abnormality of blastomere D1.2

abnormal animal blastomere
type: Class
subclass of: abnormal animal hemisphere
subclass of: abnormal blastomere
definition: Abnormality of animal blastomere.
has_exact_synonym: abnormality of animal blastomere

abnormal subinterstitial vein
type: Class
subclass of: abnormal vein
definition: Abnormality of subinterstitial vein.
has_exact_synonym: abnormality of subinterstitial vein

abnormal midgut
type: Class
subclass of: abnormal embryonic structure
subclass of: abnormal alimentary system
definition: Abnormality of midgut.
has_exact_synonym: abnormality of midgut

abnormal intestine
type: Class
subclass of: abnormal alimentary system
subclass of: abnormal cavitated compound organ
subclass of: abnormal viscus
definition: Abnormality of intestine.
has_exact_synonym: abnormality of intestine

abnormal dorsomedial edge of myotome
type: Class
subclass of: abnormal myotome
definition: Abnormality of dorsomedial edge of myotome.
has_exact_synonym: abnormality of dorsomedial edge of myotome

abnormal cellular bone tissue
type: Class
subclass of: abnormal mineralized bone tissue
definition: Abnormality of cellular bone tissue.
has_exact_synonym: abnormality of cellular bone tissue

abnormal processus muscularis palatoquadrati
type: Class
subclass of: abnormal cartilage element
subclass of: abnormal chondrocranium
definition: Abnormality of processus muscularis palatoquadrati.
has_exact_synonym: abnormality of processus muscularis palatoquadrati

abnormal epicardial precursor cell
type: Class
subclass of: abnormal heart
subclass of: abnormal proepicardium
definition: Abnormality of epicardial precursor cell.
has_exact_synonym: abnormality of epicardial precursor cell

abnormal ciliary marginal zone
type: Class
subclass of: abnormal retina
subclass of: abnormal proliferative region
definition: Abnormality of ciliary marginal zone.
has_exact_synonym: abnormality of ciliary marginal zone

abnormal proliferative region
type: Class
subclass of: abnormal anatomical cluster
definition: Abnormality of proliferative region.
has_exact_synonym: abnormality of proliferative region

abnormal mandibular mesenchyme
type: Class
subclass of: abnormal mesenchyme
subclass of: abnormal cranial skeleton
definition: Abnormality of mandibular mesenchyme.
has_exact_synonym: abnormality of mandibular mesenchyme

abnormal melanoblast
type: Class
subclass of: abnormal cell
definition: Abnormality of melanoblast.
has_exact_synonym: abnormality of melanoblast

abnormal medial abdominal vein
type: Class
subclass of: abnormal vein
subclass of: abnormal trunk vasculature
definition: Abnormality of medial abdominal vein.
has_exact_synonym: abnormality of medial abdominal vein

abnormal cerebral vein
type: Class
subclass of: abnormal vein
subclass of: abnormal head vasculature
definition: Abnormality of cerebral vein.
has_exact_synonym: abnormality of cerebral vein

abnormal inner ear
type: Class
subclass of: abnormal anatomical cluster
subclass of: abnormal auditory apparatus
definition: Abnormality of inner ear.
has_exact_synonym: abnormality of inner ear

abnormal medium cavity
type: Class
subclass of: abnormal anatomical space
subclass of: abnormal olfactory system
definition: Abnormality of medium cavity.
has_exact_synonym: abnormality of medium cavity

abnormal archenteron floor
type: Class
subclass of: abnormal archenteron
definition: Abnormality of archenteron floor.
has_exact_synonym: abnormality of archenteron floor

abnormal somatic layer of lateral plate mesoderm
type: Class
subclass of: abnormal lateral plate mesoderm
definition: Abnormality of somatic layer of lateral plate mesoderm.
has_exact_synonym: abnormality of somatic layer of lateral plate mesoderm

abnormal left lymph heart
type: Class
subclass of: abnormal cavitated compound organ
subclass of: abnormal lymphatic system
definition: Abnormality of left lymph heart.
has_exact_synonym: abnormality of left lymph heart

abnormal nucleus reticularis superior
type: Class
subclass of: abnormal neural nucleus
subclass of: abnormal medulla oblongata
definition: Abnormality of nucleus reticularis superior.
has_exact_synonym: abnormality of nucleus reticularis superior

abnormal pallium
type: Class
subclass of: abnormal telencephalon
definition: Abnormality of pallium.
has_exact_synonym: abnormality of pallium

abnormal m. dilatator laryngis primordium
type: Class
subclass of: abnormal cranial muscle primordium
definition: Abnormality of m. dilatator laryngis primordium.
has_exact_synonym: abnormality of m. dilatator laryngis primordium

abnormal neuromast support cell
type: Class
subclass of: abnormal cell
subclass of: abnormal skin
definition: Abnormality of neuromast support cell.
has_exact_synonym: abnormality of neuromast support cell

abnormal male organism
type: Class
subclass of: abnormal whole organism
definition: Abnormality of male organism.
has_exact_synonym: abnormality of male organism

abnormal whole organism
type: Class
subclass of: abnormal anatomical structure
definition: Abnormality of whole organism.
has_exact_synonym: abnormality of whole organism

abnormal blastomere V2
type: Class
subclass of: abnormal blastomere
definition: Abnormality of blastomere V2.
has_exact_synonym: abnormality of blastomere V2

abnormal hindlimb digit 3
type: Class
subclass of: abnormal hindlimb digit
definition: Abnormality of hindlimb digit 3.
has_exact_synonym: abnormality of hindlimb digit 3

abnormal mitotic cell
type: Class
subclass of: abnormal cell
definition: Abnormality of mitotic cell.
has_exact_synonym: abnormality of mitotic cell

abnormal oocyte cortex
type: Class
subclass of: abnormal oocyte
subclass of: abnormal cell part
definition: Abnormality of oocyte cortex.
has_exact_synonym: abnormality of oocyte cortex

abnormal m. orbitohyoideus primordium
type: Class
subclass of: abnormal cranial muscle primordium
definition: Abnormality of m. orbitohyoideus primordium.
has_exact_synonym: abnormality of m. orbitohyoideus primordium

abnormal laryngeal muscle primordium
type: Class
subclass of: abnormal primordium
definition: Abnormality of laryngeal muscle primordium.
has_exact_synonym: abnormality of laryngeal muscle primordium

abnormal hatching gland
type: Class
subclass of: abnormal embryonic structure
subclass of: abnormal ectoderm
definition: Abnormality of hatching gland.
has_exact_synonym: abnormality of hatching gland

abnormal central endoderm
type: Class
subclass of: abnormal endoderm
definition: Abnormality of central endoderm.
has_exact_synonym: abnormality of central endoderm

abnormal head somite 3
type: Class
subclass of: abnormal head somite
definition: Abnormality of head somite 3.
has_exact_synonym: abnormality of head somite 3

abnormal prime meridian
type: Class
subclass of: abnormal embryo
subclass of: XPO_0141315
definition: Abnormality of prime meridian.
has_exact_synonym: abnormality of prime meridian

abnormal myocardium
type: Class
subclass of: abnormal heart
subclass of: abnormal muscle
definition: Abnormality of myocardium.
has_exact_synonym: abnormality of myocardium

abnormal telencephalon
type: Class
subclass of: abnormal forebrain
definition: Abnormality of telencephalon.
has_exact_synonym: abnormality of telencephalon

abnormal mm. levator arcuum branchialium IV primordium
type: Class
subclass of: abnormal cranial muscle primordium
definition: Abnormality of mm. levator arcuum branchialium IV primordium.
has_exact_synonym: abnormality of mm. levator arcuum branchialium IV primordium

abnormal myotome of head somite 2
type: Class
subclass of: abnormal myotome
definition: Abnormality of myotome of head somite 2.
has_exact_synonym: abnormality of myotome of head somite 2

abnormal eye primordium
type: Class
subclass of: abnormal primordium
subclass of: abnormal visual system
definition: Abnormality of eye primordium.
has_exact_synonym: abnormality of eye primordium

abnormal animal cap
type: Class
subclass of: abnormal embryonic structure
subclass of: abnormal ectoderm
definition: Abnormality of animal cap.
has_exact_synonym: abnormality of animal cap

abnormal central retina
type: Class
subclass of: abnormal retina
definition: Abnormality of central retina.
has_exact_synonym: abnormality of central retina

abnormal pronephric kidney
type: Class
subclass of: abnormal multi-tissue structure
subclass of: abnormal coelom
subclass of: abnormal embryonic kidney
definition: Abnormality of pronephric kidney.
has_exact_synonym: abnormality of pronephric kidney

abnormal kidney
type: Class
subclass of: abnormal urinary system
subclass of: abnormal cavitated compound organ
definition: Abnormality of kidney.
has_exact_synonym: abnormality of kidney

abnormal mesonephric collecting duct
type: Class
subclass of: abnormal mesonephric tubule
subclass of: abnormal duct
definition: Abnormality of mesonephric collecting duct.
has_exact_synonym: abnormality of mesonephric collecting duct

abnormal telencephalon septum
type: Class
subclass of: abnormal basal forebrain
subclass of: XPO_0141715
definition: Abnormality of telencephalon septum.
has_exact_synonym: abnormality of telencephalon septum

abnormal motor axon
type: Class
subclass of: abnormal axon
subclass of: abnormal motor neuron
definition: Abnormality of motor axon.
has_exact_synonym: abnormality of motor axon

abnormal axon
type: Class
subclass of: XPO_0131654
definition: Abnormality of axon.
has_exact_synonym: abnormality of axon

abnormal branchial arch 1
type: Class
subclass of: abnormal branchial arch
definition: Abnormality of branchial arch 1.
has_exact_synonym: abnormality of branchial arch 1

abnormal branchial arch
type: Class
subclass of: abnormal pharyngeal arch
definition: Abnormality of branchial arch.
has_exact_synonym: abnormality of branchial arch

abnormal extraembryonic structure
type: Class
subclass of: abnormal whole organism
definition: Abnormality of extraembryonic structure.
has_exact_synonym: abnormality of extraembryonic structure

abnormal gastrula cell
type: Class
subclass of: abnormal early embryonic cell
definition: Abnormality of gastrula cell.
has_exact_synonym: abnormality of gastrula cell

abnormal diencephalon
type: Class
subclass of: abnormal forebrain
definition: Abnormality of diencephalon.
has_exact_synonym: abnormality of diencephalon

abnormal mineralized cartilage tissue
type: Class
subclass of: abnormal cartilage tissue
definition: Abnormality of mineralized cartilage tissue.
has_exact_synonym: abnormality of mineralized cartilage tissue

abnormal planum trabeculare anticum
type: Class
subclass of: abnormal cartilage element
subclass of: abnormal chondrocranium
definition: Abnormality of planum trabeculare anticum.
has_exact_synonym: abnormality of planum trabeculare anticum

abnormal stomodeal-hypophyseal primordium
type: Class
subclass of: abnormal primordium
subclass of: abnormal ectoderm
definition: Abnormality of stomodeal-hypophyseal primordium.
has_exact_synonym: abnormality of stomodeal-hypophyseal primordium

abnormal biliary tree
type: Class
subclass of: abnormal multi-tissue structure
subclass of: abnormal liver and biliary system
definition: Abnormality of biliary tree.
has_exact_synonym: abnormality of biliary tree

abnormal globe
type: Class
subclass of: abnormal multi-tissue structure
subclass of: abnormal eye
definition: Abnormality of globe.
has_exact_synonym: abnormality of globe

abnormal immune system
type: Class
subclass of: abnormal anatomical system
definition: Abnormality of immune system.
has_exact_synonym: abnormality of immune system

abnormal forelimb digit
type: Class
subclass of: abnormal digit
subclass of: abnormal hand
subclass of: abnormal forelimb skeleton
definition: Abnormality of forelimb digit.
has_exact_synonym: abnormality of forelimb digit

abnormal mandibular arch skeleton
type: Class
subclass of: abnormal skeletal subdivision
subclass of: abnormal splanchnocranium
definition: Abnormality of mandibular arch skeleton.
has_exact_synonym: abnormality of mandibular arch skeleton

abnormal vertebral column
type: Class
subclass of: abnormal postcranial axial skeleton
definition: Abnormality of vertebral column.
has_exact_synonym: abnormality of vertebral column

abnormal elastica externa
type: Class
subclass of: abnormal tissue
definition: Abnormality of elastica externa.
has_exact_synonym: abnormality of elastica externa

abnormal thyroid primordium
type: Class
subclass of: abnormal multi-tissue structure
subclass of: abnormal endocrine system
definition: Abnormality of thyroid primordium.
has_exact_synonym: abnormality of thyroid primordium

abnormal vestibuloauditory system
type: Class
subclass of: abnormal sensory system
definition: Abnormality of vestibuloauditory system.
has_exact_synonym: abnormality of vestibuloauditory system

abnormal unicellular gland
type: Class
subclass of: abnormal surface structure
definition: Abnormality of unicellular gland.
has_exact_synonym: abnormality of unicellular gland

abnormal hyoid crest
type: Class
subclass of: abnormal cranial neural crest
definition: Abnormality of hyoid crest.
has_exact_synonym: abnormality of hyoid crest

abnormal hypothalamus
type: Class
subclass of: abnormal diencephalon
definition: Abnormality of hypothalamus.
has_exact_synonym: abnormality of hypothalamus

abnormal pharyngeal arch
type: Class
subclass of: abnormal multi-tissue structure
subclass of: abnormal pharyngeal region
definition: Abnormality of pharyngeal arch.
has_exact_synonym: abnormality of pharyngeal arch

abnormal auditory apparatus
type: Class
subclass of: abnormal cavitated compound organ
subclass of: abnormal vestibuloauditory system
definition: Abnormality of auditory apparatus.
has_exact_synonym: abnormality of auditory apparatus

abnormal cerebral artery
type: Class
subclass of: abnormal internal carotid artery
definition: Abnormality of cerebral artery.
has_exact_synonym: abnormality of cerebral artery

abnormal Jacobson's organ
type: Class
subclass of: abnormal multi-tissue structure
subclass of: abnormal olfactory system
definition: Abnormality of Jacobson's organ.
has_exact_synonym: abnormality of Jacobson's organ

abnormal cardiac myocyte
type: Class
subclass of: abnormal myocardium
subclass of: abnormal myocyte
definition: Abnormality of cardiac myocyte.
has_exact_synonym: abnormality of cardiac myocyte

abnormal myocyte
type: Class
subclass of: abnormal cell
subclass of: abnormal muscle
definition: Abnormality of myocyte.
has_exact_synonym: abnormality of myocyte

abnormal regenerating skeletal element
type: Class
subclass of: abnormal skeletal element
subclass of: abnormal endoskeleton
definition: Abnormality of regenerating skeletal element.
has_exact_synonym: abnormality of regenerating skeletal element

abnormal alpha cell
type: Class
subclass of: abnormal enteroendocrine cell
subclass of: abnormal islets of Langerhans
definition: Abnormality of alpha cell.
has_exact_synonym: abnormality of alpha cell

abnormal adult immune system
type: Class
subclass of: abnormal immune system
definition: Abnormality of adult immune system.
has_exact_synonym: abnormality of adult immune system

abnormal eye photoreceptor cell
type: Class
subclass of: abnormal cell
subclass of: abnormal photoreceptor layer
definition: Abnormality of eye photoreceptor cell.
has_exact_synonym: abnormality of eye photoreceptor cell

abnormal vascular endothelium
type: Class
subclass of: abnormal simple squamous epithelium
subclass of: abnormal cardiovascular system
definition: Abnormality of vascular endothelium.
has_exact_synonym: abnormality of vascular endothelium

abnormal right ventricle
type: Class
subclass of: abnormal lateral ventricle
definition: Abnormality of right ventricle.
has_exact_synonym: abnormality of right ventricle

abnormal lateral ventricle
type: Class
subclass of: abnormal brain ventricle
definition: Abnormality of lateral ventricle.
has_exact_synonym: abnormality of lateral ventricle

abnormal m. geniohyoideus primordium
type: Class
subclass of: abnormal cranial muscle primordium
definition: Abnormality of m. geniohyoideus primordium.
has_exact_synonym: abnormality of m. geniohyoideus primordium

abnormal prechordal plate
type: Class
subclass of: abnormal axial mesoderm
definition: Abnormality of prechordal plate.
has_exact_synonym: abnormality of prechordal plate

abnormal basal forebrain
type: Class
subclass of: abnormal telencephalon
definition: Abnormality of basal forebrain.
has_exact_synonym: abnormality of basal forebrain

abnormal retinal pigmented epithelium
type: Class
subclass of: abnormal epithelium
subclass of: abnormal retina
definition: Abnormality of retinal pigmented epithelium.
has_exact_synonym: abnormality of retinal pigmented epithelium

abnormal pancreas
type: Class
subclass of: abnormal alimentary system
subclass of: abnormal compound organ
subclass of: abnormal viscus
definition: Abnormality of pancreas.
has_exact_synonym: abnormality of pancreas

abnormal involuted ventral mesoderm
type: Class
subclass of: abnormal tissue
subclass of: abnormal circumblastoporal collar
definition: Abnormality of involuted ventral mesoderm.
has_exact_synonym: abnormality of involuted ventral mesoderm

abnormal appendage
type: Class
subclass of: abnormal organism subdivision
definition: Abnormality of appendage.
has_exact_synonym: abnormality of appendage

abnormal hypophysis
type: Class
subclass of: abnormal endocrine system
subclass of: abnormal forebrain
definition: Abnormality of hypophysis.
has_exact_synonym: abnormality of hypophysis

abnormal unilaminar epithelium
type: Class
subclass of: abnormal epithelium
definition: Abnormality of unilaminar epithelium.
has_exact_synonym: abnormality of unilaminar epithelium

abnormal periosteum (sensu osteogenic layer)
type: Class
subclass of: abnormal periosteum
definition: Abnormality of periosteum (sensu osteogenic layer).
has_exact_synonym: abnormality of periosteum (sensu osteogenic layer)

abnormal m. constrictor laryngis primordium
type: Class
subclass of: abnormal cranial muscle primordium
definition: Abnormality of m. constrictor laryngis primordium.
has_exact_synonym: abnormality of m. constrictor laryngis primordium

abnormal mitral cell layer of the olfactory bulb
type: Class
subclass of: abnormal tissue
subclass of: abnormal olfactory bulb
definition: Abnormality of mitral cell layer of the olfactory bulb.
has_exact_synonym: abnormality of mitral cell layer of the olfactory bulb

abnormal ventral blood island
type: Class
subclass of: abnormal tissue
subclass of: abnormal hematological system
definition: Abnormality of ventral blood island.
has_exact_synonym: abnormality of ventral blood island

abnormal forebrain
type: Class
subclass of: abnormal multi-tissue structure
subclass of: abnormal brain
definition: Abnormality of forebrain.
has_exact_synonym: abnormality of forebrain

abnormal locus coeruleus
type: Class
subclass of: abnormal hindbrain
subclass of: abnormal neural nucleus
definition: Abnormality of locus coeruleus.
has_exact_synonym: abnormality of locus coeruleus

abnormal interrenal vein
type: Class
subclass of: abnormal vein
subclass of: abnormal trunk vasculature
definition: Abnormality of interrenal vein.
has_exact_synonym: abnormality of interrenal vein

abnormal pericardium
type: Class
subclass of: abnormal heart
subclass of: abnormal peritoneum
definition: Abnormality of pericardium.
has_exact_synonym: abnormality of pericardium

abnormal peritoneum
type: Class
subclass of: abnormal alimentary system
subclass of: abnormal serous membrane
definition: Abnormality of peritoneum.
has_exact_synonym: abnormality of peritoneum

abnormal tail somite 18
type: Class
subclass of: abnormal tail somite
definition: Abnormality of tail somite 18.
has_exact_synonym: abnormality of tail somite 18

abnormal olfactory sensory neuron
type: Class
subclass of: abnormal olfactory epithelium
subclass of: abnormal neuron
definition: Abnormality of olfactory sensory neuron.
has_exact_synonym: abnormality of olfactory sensory neuron

abnormal neuroectoderm
type: Class
subclass of: abnormal ectoderm
definition: Abnormality of neuroectoderm.
has_exact_synonym: abnormality of neuroectoderm

abnormal dorsolateral placode region
type: Class
subclass of: abnormal tissue
definition: Abnormality of dorsolateral placode region.
has_exact_synonym: abnormality of dorsolateral placode region

abnormal primordial germ cell
type: Class
subclass of: abnormal germ cell
definition: Abnormality of primordial germ cell.
has_exact_synonym: abnormality of primordial germ cell

abnormal pharyngeal region
type: Class
subclass of: abnormal head
definition: Abnormality of pharyngeal region.
has_exact_synonym: abnormality of pharyngeal region

abnormal primary oogonium
type: Class
subclass of: abnormal germ cell
subclass of: abnormal ovary
definition: Abnormality of primary oogonium.
has_exact_synonym: abnormality of primary oogonium

abnormal branchial arch 2
type: Class
subclass of: abnormal branchial arch
definition: Abnormality of branchial arch 2.
has_exact_synonym: abnormality of branchial arch 2

abnormal neurocoel
type: Class
subclass of: abnormal anatomical space
subclass of: abnormal neuroectoderm
definition: Abnormality of neurocoel.
has_exact_synonym: abnormality of neurocoel

abnormal anterodorsal lateral line placode
type: Class
subclass of: abnormal lateral line placode
definition: Abnormality of anterodorsal lateral line placode.
has_exact_synonym: abnormality of anterodorsal lateral line placode

abnormal trunk somite 3
type: Class
subclass of: abnormal trunk somite
definition: Abnormality of trunk somite 3.
has_exact_synonym: abnormality of trunk somite 3

abnormal horizontal cell
type: Class
subclass of: abnormal neuron
subclass of: abnormal retinal neural layer
definition: Abnormality of horizontal cell.
has_exact_synonym: abnormality of horizontal cell

abnormal sympathetic chain
type: Class
subclass of: abnormal peripheral nervous system
subclass of: abnormal nerve
definition: Abnormality of sympathetic chain.
has_exact_synonym: abnormality of sympathetic chain

abnormal neuropil of the optic tectum
type: Class
subclass of: abnormal tissue
subclass of: abnormal optic tectum
definition: Abnormality of neuropil of the optic tectum.
has_exact_synonym: abnormality of neuropil of the optic tectum

abnormal m. levator mandibulae articularis primordium
type: Class
subclass of: abnormal cranial muscle primordium
definition: Abnormality of m. levator mandibulae articularis primordium.
has_exact_synonym: abnormality of m. levator mandibulae articularis primordium

abnormal polar body
type: Class
subclass of: abnormal cell
definition: Abnormality of polar body.
has_exact_synonym: abnormality of polar body

abnormal notochordal sheath
type: Class
subclass of: abnormal notochord
definition: Abnormality of notochordal sheath.
has_exact_synonym: abnormality of notochordal sheath

abnormal metencephalic vein
type: Class
subclass of: abnormal vein
subclass of: abnormal head vasculature
subclass of: abnormal brain
definition: Abnormality of metencephalic vein.
has_exact_synonym: abnormality of metencephalic vein

abnormal gustatory system
type: Class
subclass of: abnormal sensory system
definition: Abnormality of gustatory system.
has_exact_synonym: abnormality of gustatory system

abnormal thoracic region
type: Class
subclass of: XPO_0141315
definition: Abnormality of thoracic region.
has_exact_synonym: abnormality of thoracic region

abnormal smooth muscle myocyte
type: Class
subclass of: abnormal myocyte
subclass of: abnormal smooth muscle
definition: Abnormality of smooth muscle myocyte.
has_exact_synonym: abnormality of smooth muscle myocyte

abnormal hypaxial muscle
type: Class
subclass of: abnormal skeletal muscle
subclass of: abnormal trunk musculature
definition: Abnormality of hypaxial muscle.
has_exact_synonym: abnormality of hypaxial muscle

abnormal pre-dentine
type: Class
subclass of: abnormal odontoid tissue
definition: Abnormality of pre-dentine.
has_exact_synonym: abnormality of pre-dentine

abnormal mouth
type: Class
subclass of: abnormal head
subclass of: abnormal anatomical space
definition: Abnormality of mouth.
has_exact_synonym: abnormality of mouth

abnormal myotome of trunk somite 6
type: Class
subclass of: abnormal myotome
definition: Abnormality of myotome of trunk somite 6.
has_exact_synonym: abnormality of myotome of trunk somite 6

abnormal growth cone
type: Class
subclass of: XPO_0131654
definition: Abnormality of growth cone.
has_exact_synonym: abnormality of growth cone

abnormal prosomere
type: Class
subclass of: abnormal neuromere
subclass of: abnormal forebrain
definition: Abnormality of prosomere.
has_exact_synonym: abnormality of prosomere

abnormal rhombomere R4
type: Class
subclass of: abnormal rhombomere
definition: Abnormality of rhombomere R4.
has_exact_synonym: abnormality of rhombomere R4

abnormal medial cardinal vein
type: Class
subclass of: abnormal vein
subclass of: abnormal trunk vasculature
definition: Abnormality of medial cardinal vein.
has_exact_synonym: abnormality of medial cardinal vein

abnormal myoblast
type: Class
subclass of: abnormal cell
definition: Abnormality of myoblast.
has_exact_synonym: abnormality of myoblast

abnormal blastomere V2.1
type: Class
subclass of: abnormal ventral vegetal hemisphere blastomere
definition: Abnormality of blastomere V2.1.
has_exact_synonym: abnormality of blastomere V2.1

abnormal posteroventral tegmental nucleus
type: Class
subclass of: abnormal neural nucleus
subclass of: abnormal midbrain tegmentum
definition: Abnormality of posteroventral tegmental nucleus.
has_exact_synonym: abnormality of posteroventral tegmental nucleus

abnormal ventral hypothalamic nucleus
type: Class
subclass of: abnormal neural nucleus
subclass of: abnormal hypothalamus
definition: Abnormality of ventral hypothalamic nucleus.
has_exact_synonym: abnormality of ventral hypothalamic nucleus

abnormal m. rectus cervicis primordium
type: Class
subclass of: abnormal cranial muscle primordium
definition: Abnormality of m. rectus cervicis primordium.
has_exact_synonym: abnormality of m. rectus cervicis primordium

abnormal visceral pouch 3
type: Class
subclass of: abnormal visceral pouch
definition: Abnormality of visceral pouch 3.
has_exact_synonym: abnormality of visceral pouch 3

abnormal anterior cardinal vein
type: Class
subclass of: abnormal vein
definition: Abnormality of anterior cardinal vein.
has_exact_synonym: abnormality of anterior cardinal vein

abnormal gill primordium
type: Class
subclass of: abnormal primordium
subclass of: abnormal respiratory system
subclass of: abnormal pharyngeal region
definition: Abnormality of gill primordium.
has_exact_synonym: abnormality of gill primordium

abnormal lung primordium
type: Class
subclass of: abnormal multi-tissue structure
subclass of: abnormal respiratory system
subclass of: abnormal posterior foregut
definition: Abnormality of lung primordium.
has_exact_synonym: abnormality of lung primordium

abnormal enteric neuron
type: Class
subclass of: abnormal neuron
subclass of: abnormal small intestine
subclass of: abnormal cloaca
subclass of: abnormal hindgut
subclass of: abnormal large intestine
subclass of: abnormal enteric nervous system
definition: Abnormality of enteric neuron.
has_exact_synonym: abnormality of enteric neuron

abnormal periocular region
type: Class
subclass of: XPO_0141315
definition: Abnormality of periocular region.
has_exact_synonym: abnormality of periocular region

abnormal egg jelly
type: Class
subclass of: abnormal acellular anatomical structure
definition: Abnormality of egg jelly.
has_exact_synonym: abnormality of egg jelly

abnormal primary spermatogonium
type: Class
subclass of: abnormal germ cell
subclass of: abnormal testis
definition: Abnormality of primary spermatogonium.
has_exact_synonym: abnormality of primary spermatogonium

abnormal vegetal yolk mass
type: Class
subclass of: abnormal embryonic structure
definition: Abnormality of vegetal yolk mass.
has_exact_synonym: abnormality of vegetal yolk mass

abnormal posterior lateral line ganglion
type: Class
subclass of: abnormal lateral line ganglion
definition: Abnormality of posterior lateral line ganglion.
has_exact_synonym: abnormality of posterior lateral line ganglion

abnormal forelimb zeugopod
type: Class
subclass of: abnormal zeugopod
subclass of: abnormal forelimb
definition: Abnormality of forelimb zeugopod.
has_exact_synonym: abnormality of forelimb zeugopod

abnormal myotome of trunk somite 1
type: Class
subclass of: abnormal myotome
definition: Abnormality of myotome of trunk somite 1.
has_exact_synonym: abnormality of myotome of trunk somite 1

abnormal m. transversus ventralis II primordium
type: Class
subclass of: abnormal cranial muscle primordium
definition: Abnormality of m. transversus ventralis II primordium.
has_exact_synonym: abnormality of m. transversus ventralis II primordium

abnormal anterior dorsal lateral plate region
type: Class
subclass of: abnormal lateral plate mesoderm
subclass of: abnormal hematological system
definition: Abnormality of anterior dorsal lateral plate region.
has_exact_synonym: abnormality of anterior dorsal lateral plate region

abnormal secondary oogonium
type: Class
subclass of: abnormal germ cell
definition: Abnormality of secondary oogonium.
has_exact_synonym: abnormality of secondary oogonium

abnormal dorsal vegetal hemisphere blastomere
type: Class
subclass of: abnormal vegetal blastomere
definition: Abnormality of dorsal vegetal hemisphere blastomere.
has_exact_synonym: abnormality of dorsal vegetal hemisphere blastomere

abnormal blastomere D2.2
type: Class
subclass of: abnormal dorsal vegetal hemisphere blastomere
definition: Abnormality of blastomere D2.2.
has_exact_synonym: abnormality of blastomere D2.2

abnormal neural fold
type: Class
subclass of: abnormal neural plate
definition: Abnormality of neural fold.
has_exact_synonym: abnormality of neural fold

abnormal m. levator scapulae inferior
type: Class
subclass of: abnormal cranial muscle
definition: Abnormality of m. levator scapulae inferior.
has_exact_synonym: abnormality of m. levator scapulae inferior

abnormal left channel of ventral aorta
type: Class
subclass of: abnormal artery
subclass of: abnormal trunk vasculature
definition: Abnormality of left channel of ventral aorta.
has_exact_synonym: abnormality of left channel of ventral aorta

abnormal epidermis outer layer
type: Class
subclass of: abnormal epidermis
subclass of: abnormal epithelium
definition: Abnormality of epidermis outer layer.
has_exact_synonym: abnormality of epidermis outer layer

abnormal myotome of tail somite 16
type: Class
subclass of: abnormal myotome
definition: Abnormality of myotome of tail somite 16.
has_exact_synonym: abnormality of myotome of tail somite 16

abnormal iliofibularis
type: Class
subclass of: abnormal muscle
subclass of: abnormal hindlimb
definition: Abnormality of iliofibularis.
has_exact_synonym: abnormality of iliofibularis

abnormal trunk somite 1
type: Class
subclass of: abnormal trunk somite
definition: Abnormality of trunk somite 1.
has_exact_synonym: abnormality of trunk somite 1

abnormal dorsal tail fin
type: Class
subclass of: abnormal tail fin
definition: Abnormality of dorsal tail fin.
has_exact_synonym: abnormality of dorsal tail fin

abnormal m. quadrato-hyoangularis primordium
type: Class
subclass of: abnormal cranial muscle primordium
definition: Abnormality of m. quadrato-hyoangularis primordium.
has_exact_synonym: abnormality of m. quadrato-hyoangularis primordium

abnormal olfactory organ
type: Class
subclass of: abnormal cavitated compound organ
subclass of: abnormal olfactory system
definition: Abnormality of olfactory organ.
has_exact_synonym: abnormality of olfactory organ

abnormal periotic region
type: Class
subclass of: XPO_0141315
definition: Abnormality of periotic region.
has_exact_synonym: abnormality of periotic region

abnormal adipose tissue
type: Class
subclass of: abnormal tissue
definition: Abnormality of adipose tissue.
has_exact_synonym: abnormality of adipose tissue

abnormal involuting marginal zone epithelial layer
type: Class
subclass of: abnormal tissue
subclass of: abnormal involuting marginal zone
definition: Abnormality of involuting marginal zone epithelial layer.
has_exact_synonym: abnormality of involuting marginal zone epithelial layer

abnormal dorsal fin
type: Class
subclass of: abnormal fin
definition: Abnormality of dorsal fin.
has_exact_synonym: abnormality of dorsal fin

abnormal keratin accumulating cell
type: Class
subclass of: abnormal cell
definition: Abnormality of keratin accumulating cell.
has_exact_synonym: abnormality of keratin accumulating cell

abnormal vertebral centrum
type: Class
subclass of: abnormal vertebral element
definition: Abnormality of vertebral centrum.
has_exact_synonym: abnormality of vertebral centrum

abnormal lateral line primordium
type: Class
subclass of: abnormal primordium
subclass of: abnormal lateral line system
definition: Abnormality of lateral line primordium.
has_exact_synonym: abnormality of lateral line primordium

abnormal zona limitans intrathalamica
type: Class
subclass of: abnormal tissue
subclass of: abnormal diencephalon
definition: Abnormality of zona limitans intrathalamica.
has_exact_synonym: abnormality of zona limitans intrathalamica

abnormal sesamoid
type: Class
subclass of: abnormal ossicle
definition: Abnormality of sesamoid.
has_exact_synonym: abnormality of sesamoid

abnormal caudal artery
type: Class
subclass of: abnormal artery
subclass of: abnormal tail vasculature
definition: Abnormality of caudal artery.
has_exact_synonym: abnormality of caudal artery

abnormal optic stalk
type: Class
subclass of: abnormal tissue
subclass of: abnormal diencephalon
definition: Abnormality of optic stalk.
has_exact_synonym: abnormality of optic stalk

abnormal parachordal
type: Class
subclass of: abnormal cartilage element
subclass of: abnormal chondrocranium
definition: Abnormality of parachordal.
has_exact_synonym: abnormality of parachordal

abnormal sclerotome of tail somite 14
type: Class
subclass of: abnormal sclerotome
definition: Abnormality of sclerotome of tail somite 14.
has_exact_synonym: abnormality of sclerotome of tail somite 14

abnormal microglial cell
type: Class
subclass of: abnormal glial cell
definition: Abnormality of microglial cell.
has_exact_synonym: abnormality of microglial cell

abnormal glial cell
type: Class
subclass of: abnormal cell
subclass of: abnormal nervous system
definition: Abnormality of glial cell.
has_exact_synonym: abnormality of glial cell

abnormal Merkel cell
type: Class
subclass of: abnormal cell
definition: Abnormality of Merkel cell.
has_exact_synonym: abnormality of Merkel cell

abnormal processus retroarticularis of Meckel's cartilage
type: Class
subclass of: abnormal chondrocranium
subclass of: abnormal Meckel's cartilage
definition: Abnormality of processus retroarticularis of Meckel's cartilage.
has_exact_synonym: abnormality of processus retroarticularis of Meckel's cartilage

abnormal myotome of trunk somite 3
type: Class
subclass of: abnormal myotome
definition: Abnormality of myotome of trunk somite 3.
has_exact_synonym: abnormality of myotome of trunk somite 3

abnormal central vegetal yolk mass
type: Class
subclass of: abnormal vegetal yolk mass
definition: Abnormality of central vegetal yolk mass.
has_exact_synonym: abnormality of central vegetal yolk mass

abnormal laryngeal muscle
type: Class
subclass of: abnormal cranial muscle
definition: Abnormality of laryngeal muscle.
has_exact_synonym: abnormality of laryngeal muscle

abnormal pre-chordal neural plate
type: Class
subclass of: abnormal neural plate
definition: Abnormality of pre-chordal neural plate.
has_exact_synonym: abnormality of pre-chordal neural plate

abnormal hyaloid vein
type: Class
subclass of: abnormal hyaloid blood vessel
definition: Abnormality of hyaloid vein.
has_exact_synonym: abnormality of hyaloid vein

abnormal ischium
type: Class
subclass of: abnormal endochondral bone
subclass of: abnormal pelvic girdle
definition: Abnormality of ischium.
has_exact_synonym: abnormality of ischium

abnormal ciliated epidermal cell
type: Class
subclass of: abnormal epidermal cell
subclass of: abnormal ciliated cell
definition: Abnormality of ciliated epidermal cell.
has_exact_synonym: abnormality of ciliated epidermal cell

abnormal monociliated cell
type: Class
subclass of: abnormal gastrocoel roof plate
subclass of: abnormal ciliated cell
definition: Abnormality of monociliated cell.
has_exact_synonym: abnormality of monociliated cell

abnormal epidermal cell
type: Class
subclass of: abnormal epidermis
subclass of: abnormal epithelial cell
definition: Abnormality of epidermal cell.
has_exact_synonym: abnormality of epidermal cell

abnormal ciliated cell
type: Class
subclass of: abnormal cell
definition: Abnormality of ciliated cell.
has_exact_synonym: abnormality of ciliated cell

abnormal aortic arch 3
type: Class
subclass of: abnormal aortic arch
definition: Abnormality of aortic arch 3.
has_exact_synonym: abnormality of aortic arch 3

abnormal metacarpus
type: Class
subclass of: abnormal bone element
subclass of: abnormal hand
subclass of: abnormal forelimb skeleton
definition: Abnormality of metacarpus.
has_exact_synonym: abnormality of metacarpus

abnormal ventral pancreatic bud
type: Class
subclass of: abnormal multi-tissue structure
subclass of: abnormal alimentary system
definition: Abnormality of ventral pancreatic bud.
has_exact_synonym: abnormality of ventral pancreatic bud

abnormal sphenoid region
type: Class
subclass of: abnormal cranium
definition: Abnormality of sphenoid region.
has_exact_synonym: abnormality of sphenoid region

abnormal ilium
type: Class
subclass of: abnormal endochondral bone
subclass of: abnormal pelvic girdle
definition: Abnormality of ilium.
has_exact_synonym: abnormality of ilium

abnormal centromere
type: Class
subclass of: abnormal cell part
definition: Abnormality of centromere.
has_exact_synonym: abnormality of centromere

abnormal barbel
type: Class
subclass of: abnormal surface structure
definition: Abnormality of barbel.
has_exact_synonym: abnormality of barbel

abnormal lateral postcardinal vein
type: Class
subclass of: abnormal vein
subclass of: abnormal trunk vasculature
definition: Abnormality of lateral postcardinal vein.
has_exact_synonym: abnormality of lateral postcardinal vein

abnormal kinetochore
type: Class
subclass of: abnormal cell part
definition: Abnormality of kinetochore.
has_exact_synonym: abnormality of kinetochore

abnormal subpallium
type: Class
subclass of: abnormal telencephalon
definition: Abnormality of subpallium.
has_exact_synonym: abnormality of subpallium

abnormal tail
type: Class
subclass of: abnormal organism subdivision
subclass of: abnormal tail region
definition: Abnormality of tail.
has_exact_synonym: abnormality of tail

abnormal odontogenic papilla
type: Class
subclass of: abnormal cell condensation
definition: Abnormality of odontogenic papilla.
has_exact_synonym: abnormality of odontogenic papilla

abnormal cell condensation
type: Class
subclass of: abnormal whole organism
definition: Abnormality of cell condensation.
has_exact_synonym: abnormality of cell condensation

abnormal thalamus
type: Class
subclass of: abnormal diencephalon
definition: Abnormality of thalamus.
has_exact_synonym: abnormality of thalamus

abnormal m. subarcualis rectus I
type: Class
subclass of: abnormal branchial head muscle
definition: Abnormality of m. subarcualis rectus I.
has_exact_synonym: abnormality of m. subarcualis rectus I

abnormal arterial endothelium
type: Class
subclass of: abnormal artery
subclass of: abnormal epithelium
definition: Abnormality of arterial endothelium.
has_exact_synonym: abnormality of arterial endothelium

abnormal tendon fibroblast
type: Class
subclass of: abnormal fibroblast
definition: Abnormality of tendon fibroblast.
has_exact_synonym: abnormality of tendon fibroblast

abnormal fibroblast
type: Class
subclass of: abnormal mesodermal cell
definition: Abnormality of fibroblast.
has_exact_synonym: abnormality of fibroblast

abnormal lateral line system
type: Class
subclass of: abnormal peripheral nervous system
subclass of: abnormal sensory system
definition: Abnormality of lateral line system.
has_exact_synonym: abnormality of lateral line system

abnormal hindgut
type: Class
subclass of: abnormal embryonic structure
subclass of: abnormal alimentary system
definition: Abnormality of hindgut.
has_exact_synonym: abnormality of hindgut

abnormal cardiac ventricle
type: Class
subclass of: abnormal heart
definition: Abnormality of cardiac ventricle.
has_exact_synonym: abnormality of cardiac ventricle

abnormal epiphysis
type: Class
subclass of: abnormal organ part
subclass of: abnormal humerus
subclass of: abnormal radio-ulna
subclass of: abnormal tibia-fibula
subclass of: abnormal femur
definition: Abnormality of epiphysis.
has_exact_synonym: abnormality of epiphysis

abnormal trunk somite 5
type: Class
subclass of: abnormal trunk somite
definition: Abnormality of trunk somite 5.
has_exact_synonym: abnormality of trunk somite 5

abnormal hypoglossal nerve
type: Class
subclass of: abnormal cranial nerve
definition: Abnormality of hypoglossal nerve.
has_exact_synonym: abnormality of hypoglossal nerve

abnormal profundal placode
type: Class
subclass of: abnormal neurogenic placode
definition: Abnormality of profundal placode.
has_exact_synonym: abnormality of profundal placode

abnormal blastopore
type: Class
subclass of: abnormal marginal zone
subclass of: abnormal vegetal yolk mass
definition: Abnormality of blastopore.
has_exact_synonym: abnormality of blastopore

abnormal musculoskeletal system
type: Class
subclass of: abnormal anatomical system
definition: Abnormality of musculoskeletal system.
has_exact_synonym: abnormality of musculoskeletal system

abnormal mm. levator arcuum branchialium I primordium
type: Class
subclass of: abnormal cranial muscle primordium
definition: Abnormality of mm. levator arcuum branchialium I primordium.
has_exact_synonym: abnormality of mm. levator arcuum branchialium I primordium

abnormal chordal neural plate border
type: Class
subclass of: abnormal neural plate border
subclass of: abnormal chordal neural plate
definition: Abnormality of chordal neural plate border.
has_exact_synonym: abnormality of chordal neural plate border

abnormal anterior lymph sac
type: Class
subclass of: abnormal tissue
subclass of: abnormal lymphatic system
definition: Abnormality of anterior lymph sac.
has_exact_synonym: abnormality of anterior lymph sac

abnormal smooth muscle
type: Class
subclass of: abnormal muscle
definition: Abnormality of smooth muscle.
has_exact_synonym: abnormality of smooth muscle

abnormal basilar papilla
type: Class
subclass of: abnormal tissue
subclass of: abnormal inner ear
definition: Abnormality of basilar papilla.
has_exact_synonym: abnormality of basilar papilla

abnormal rhombic lip
type: Class
subclass of: abnormal primordium
subclass of: abnormal hindbrain
definition: Abnormality of rhombic lip.
has_exact_synonym: abnormality of rhombic lip

abnormal mucociliary epithelium
type: Class
subclass of: abnormal epidermis
subclass of: abnormal epithelium
definition: Abnormality of mucociliary epithelium.
has_exact_synonym: abnormality of mucociliary epithelium

abnormal regenerating fin
type: Class
subclass of: abnormal blastema
definition: Abnormality of regenerating fin.
has_exact_synonym: abnormality of regenerating fin

abnormal coracoid bone
type: Class
subclass of: abnormal endochondral bone
subclass of: abnormal pectoral girdle
definition: Abnormality of coracoid bone.
has_exact_synonym: abnormality of coracoid bone

abnormal chordal neural plate
type: Class
subclass of: abnormal neural plate
definition: Abnormality of chordal neural plate.
has_exact_synonym: abnormality of chordal neural plate

abnormal stria terminalis
type: Class
subclass of: abnormal anatomical cluster
subclass of: abnormal brain
definition: Abnormality of stria terminalis.
has_exact_synonym: abnormality of stria terminalis

abnormal electrically active cell
type: Class
subclass of: abnormal cell
definition: Abnormality of electrically active cell.
has_exact_synonym: abnormality of electrically active cell

abnormal wound epidermis outer layer
type: Class
subclass of: abnormal wound epidermis
definition: Abnormality of wound epidermis outer layer.
has_exact_synonym: abnormality of wound epidermis outer layer

abnormal adrenal medulla
type: Class
subclass of: abnormal tissue
subclass of: abnormal adrenal gland
definition: Abnormality of adrenal medulla.
has_exact_synonym: abnormality of adrenal medulla

abnormal bed nucleus of the stria terminalis
type: Class
subclass of: abnormal neural nucleus
subclass of: abnormal basal forebrain
definition: Abnormality of bed nucleus of the stria terminalis.
has_exact_synonym: abnormality of bed nucleus of the stria terminalis

abnormal tail bud
type: Class
subclass of: abnormal multi-tissue structure
subclass of: abnormal tail region
definition: Abnormality of tail bud.
has_exact_synonym: abnormality of tail bud

abnormal Stirnorgan
type: Class
subclass of: abnormal multi-tissue structure
subclass of: abnormal visual system
definition: Abnormality of Stirnorgan.
has_exact_synonym: abnormality of Stirnorgan

abnormal ureter
type: Class
subclass of: abnormal multi-tissue structure
subclass of: abnormal urinary system
definition: Abnormality of ureter.
has_exact_synonym: abnormality of ureter

abnormal intersomitic region
type: Class
subclass of: XPO_0141315
definition: Abnormality of intersomitic region.
has_exact_synonym: abnormality of intersomitic region

abnormal pretectum
type: Class
subclass of: abnormal diencephalon
definition: Abnormality of pretectum.
has_exact_synonym: abnormality of pretectum

abnormal paraxial mesoderm
type: Class
subclass of: abnormal embryonic structure
subclass of: abnormal mesoderm
definition: Abnormality of paraxial mesoderm.
has_exact_synonym: abnormality of paraxial mesoderm

abnormal male genitalia
type: Class
subclass of: abnormal genital system
subclass of: abnormal male organism
definition: Abnormality of male genitalia.
has_exact_synonym: abnormality of male genitalia

abnormal Meckel's cartilage
type: Class
subclass of: abnormal lower jaw
subclass of: abnormal cartilage element
subclass of: abnormal mandibular arch
definition: Abnormality of Meckel's cartilage.
has_exact_synonym: abnormality of Meckel's cartilage

abnormal late distal tubule
type: Class
subclass of: abnormal distal tubule
definition: Abnormality of late distal tubule.
has_exact_synonym: abnormality of late distal tubule

abnormal pectoral girdle
type: Class
subclass of: abnormal appendicular skeleton
definition: Abnormality of pectoral girdle.
has_exact_synonym: abnormality of pectoral girdle

abnormal neurocranium
type: Class
subclass of: abnormal cranium
definition: Abnormality of neurocranium.
has_exact_synonym: abnormality of neurocranium

abnormal m. rectus superior primordium
type: Class
subclass of: abnormal cranial muscle primordium
definition: Abnormality of m. rectus superior primordium.
has_exact_synonym: abnormality of m. rectus superior primordium

abnormal distal stomach
type: Class
subclass of: abnormal multi-tissue structure
subclass of: abnormal stomach
definition: Abnormality of distal stomach.
has_exact_synonym: abnormality of distal stomach

abnormal animal cap inner layer
type: Class
subclass of: abnormal animal cap
definition: Abnormality of animal cap inner layer.
has_exact_synonym: abnormality of animal cap inner layer

abnormal profundus ganglion
type: Class
subclass of: abnormal ganglion
definition: Abnormality of profundus ganglion.
has_exact_synonym: abnormality of profundus ganglion

abnormal m. levator mandibulae articularis
type: Class
subclass of: abnormal mandibular head muscle
definition: Abnormality of m. levator mandibulae articularis.
has_exact_synonym: abnormality of m. levator mandibulae articularis

abnormal rectal diverticulum
type: Class
subclass of: abnormal urinary system
subclass of: abnormal cloaca
definition: Abnormality of rectal diverticulum.
has_exact_synonym: abnormality of rectal diverticulum

abnormal fin crest
type: Class
subclass of: abnormal epidermis
subclass of: abnormal tail
definition: Abnormality of fin crest.
has_exact_synonym: abnormality of fin crest

abnormal posterior cerebral vein
type: Class
subclass of: abnormal cerebral vein
definition: Abnormality of posterior cerebral vein.
has_exact_synonym: abnormality of posterior cerebral vein

abnormal mesonephric kidney
type: Class
subclass of: abnormal trunk
subclass of: abnormal adult kidney
definition: Abnormality of mesonephric kidney.
has_exact_synonym: abnormality of mesonephric kidney

abnormal optic choroid vascular plexus
type: Class
subclass of: abnormal head vasculature
subclass of: abnormal vascular plexus
definition: Abnormality of optic choroid vascular plexus.
has_exact_synonym: abnormality of optic choroid vascular plexus

abnormal vascular plexus
type: Class
subclass of: abnormal blood vessel
definition: Abnormality of vascular plexus.
has_exact_synonym: abnormality of vascular plexus

abnormal presumptive ectoderm
type: Class
subclass of: abnormal embryonic structure
definition: Abnormality of presumptive ectoderm.
has_exact_synonym: abnormality of presumptive ectoderm

abnormal suprarostral plate
type: Class
subclass of: abnormal cartilage element
subclass of: abnormal chondrocranium
definition: Abnormality of suprarostral plate.
has_exact_synonym: abnormality of suprarostral plate

abnormal supraoptoparaventricular region
type: Class
subclass of: abnormal neural nucleus
subclass of: abnormal anterior hypothalamus
definition: Abnormality of supraoptoparaventricular region.
has_exact_synonym: abnormality of supraoptoparaventricular region

abnormal left blastomere
type: Class
subclass of: abnormal blastomere
definition: Abnormality of left blastomere.
has_exact_synonym: abnormality of left blastomere

abnormal mesencephalic artery
type: Class
subclass of: abnormal head vasculature
subclass of: abnormal artery
subclass of: abnormal midbrain
definition: Abnormality of mesencephalic artery.
has_exact_synonym: abnormality of mesencephalic artery

abnormal presumptive axial mesoderm
type: Class
subclass of: abnormal embryonic structure
definition: Abnormality of presumptive axial mesoderm.
has_exact_synonym: abnormality of presumptive axial mesoderm

abnormal posterior neural tube
type: Class
subclass of: abnormal neural tube
definition: Abnormality of posterior neural tube.
has_exact_synonym: abnormality of posterior neural tube

abnormal branchial arch 4
type: Class
subclass of: abnormal branchial arch
definition: Abnormality of branchial arch 4.
has_exact_synonym: abnormality of branchial arch 4

abnormal occipitovertebral artery
type: Class
subclass of: abnormal artery
definition: Abnormality of occipitovertebral artery.
has_exact_synonym: abnormality of occipitovertebral artery

abnormal splanchnic layer of lateral plate mesoderm
type: Class
subclass of: abnormal lateral plate mesoderm
definition: Abnormality of splanchnic layer of lateral plate mesoderm.
has_exact_synonym: abnormality of splanchnic layer of lateral plate mesoderm

abnormal multiciliated cell precursor
type: Class
subclass of: abnormal cell
definition: Abnormality of multiciliated cell precursor.
has_exact_synonym: abnormality of multiciliated cell precursor

abnormal capillary
type: Class
subclass of: abnormal blood vessel
definition: Abnormality of capillary.
has_exact_synonym: abnormality of capillary

abnormal omphalomesenteric vein
type: Class
subclass of: abnormal vein
definition: Abnormality of omphalomesenteric vein.
has_exact_synonym: abnormality of omphalomesenteric vein

abnormal liver
type: Class
subclass of: abnormal solid compound organ
subclass of: abnormal viscus
subclass of: abnormal liver and biliary system
definition: Abnormality of liver.
has_exact_synonym: abnormality of liver

abnormal posterior wall of neurenteric canal
type: Class
subclass of: abnormal neurenteric canal
definition: Abnormality of posterior wall of neurenteric canal.
has_exact_synonym: abnormality of posterior wall of neurenteric canal

abnormal pseudoblastema
type: Class
subclass of: abnormal regenerating tissue
definition: Abnormality of pseudoblastema.
has_exact_synonym: abnormality of pseudoblastema

abnormal esophagus
type: Class
subclass of: abnormal multi-tissue structure
subclass of: abnormal alimentary system
definition: Abnormality of esophagus.
has_exact_synonym: abnormality of esophagus

abnormal mm. levator arcuum branchialium I
type: Class
subclass of: abnormal branchial head muscle
definition: Abnormality of mm. levator arcuum branchialium I.
has_exact_synonym: abnormality of mm. levator arcuum branchialium I

abnormal genital ridge
type: Class
subclass of: abnormal tissue
subclass of: abnormal urogenital system
definition: Abnormality of genital ridge.
has_exact_synonym: abnormality of genital ridge

abnormal ventral marginal zone
type: Class
subclass of: abnormal marginal zone
definition: Abnormality of ventral marginal zone.
has_exact_synonym: abnormality of ventral marginal zone

abnormal vena capitis lateralis
type: Class
subclass of: abnormal vein
subclass of: abnormal head vasculature
definition: Abnormality of vena capitis lateralis.
has_exact_synonym: abnormality of vena capitis lateralis

abnormal exocrine cell
type: Class
subclass of: abnormal cell
definition: Abnormality of exocrine cell.
has_exact_synonym: abnormality of exocrine cell

abnormal sclerotomal mesenchyme
type: Class
subclass of: abnormal mesenchyme
subclass of: abnormal sclerotome
definition: Abnormality of sclerotomal mesenchyme.
has_exact_synonym: abnormality of sclerotomal mesenchyme

abnormal larynx
type: Class
subclass of: abnormal cavitated compound organ
subclass of: abnormal respiratory system
definition: Abnormality of larynx.
has_exact_synonym: abnormality of larynx

abnormal lower blastopore lip
type: Class
subclass of: abnormal blastopore lip
definition: Abnormality of lower blastopore lip.
has_exact_synonym: abnormality of lower blastopore lip

abnormal osteoid
type: Class
subclass of: abnormal bone tissue
subclass of: abnormal matrix-based tissue
definition: Abnormality of osteoid.
has_exact_synonym: abnormality of osteoid

abnormal matrix-based tissue
type: Class
subclass of: abnormal tissue
definition: Abnormality of matrix-based tissue.
has_exact_synonym: abnormality of matrix-based tissue

abnormal cardiac jelly
type: Class
subclass of: abnormal heart
subclass of: abnormal extracellular matrix
definition: Abnormality of cardiac jelly.
has_exact_synonym: abnormality of cardiac jelly

abnormal retinal inner plexiform layer
type: Class
subclass of: abnormal tissue
subclass of: abnormal retinal neural layer
definition: Abnormality of retinal inner plexiform layer.
has_exact_synonym: abnormality of retinal inner plexiform layer

abnormal medial pallium
type: Class
subclass of: abnormal pallium
definition: Abnormality of medial pallium.
has_exact_synonym: abnormality of medial pallium

abnormal vena capitis medialis
type: Class
subclass of: abnormal vein
subclass of: abnormal head vasculature
definition: Abnormality of vena capitis medialis.
has_exact_synonym: abnormality of vena capitis medialis

abnormal sulcus limitans of neural tube
type: Class
subclass of: abnormal surface structure
subclass of: abnormal neural tube
definition: Abnormality of sulcus limitans of neural tube.
has_exact_synonym: abnormality of sulcus limitans of neural tube

abnormal branchial arch 3
type: Class
subclass of: abnormal branchial arch
definition: Abnormality of branchial arch 3.
has_exact_synonym: abnormality of branchial arch 3

abnormal natural killer cell
type: Class
subclass of: abnormal T cell
definition: Abnormality of natural killer cell.
has_exact_synonym: abnormality of natural killer cell

abnormal presumptive paraxial mesoderm
type: Class
subclass of: abnormal embryonic structure
subclass of: abnormal mesoderm
definition: Abnormality of presumptive paraxial mesoderm.
has_exact_synonym: abnormality of presumptive paraxial mesoderm

abnormal blastocoel anlage
type: Class
subclass of: abnormal primordium
definition: Abnormality of blastocoel anlage.
has_exact_synonym: abnormality of blastocoel anlage

abnormal intersomitic neuron
type: Class
subclass of: abnormal neuron
subclass of: abnormal intersomitic region
definition: Abnormality of intersomitic neuron.
has_exact_synonym: abnormality of intersomitic neuron

abnormal retinal stem cell
type: Class
subclass of: abnormal stem cell
subclass of: abnormal retinal stem cell region
definition: Abnormality of retinal stem cell.
has_exact_synonym: abnormality of retinal stem cell

abnormal sclerotome of trunk somite 6
type: Class
subclass of: abnormal sclerotome
definition: Abnormality of sclerotome of trunk somite 6.
has_exact_synonym: abnormality of sclerotome of trunk somite 6

abnormal hindgut primordium
type: Class
subclass of: abnormal endoderm
subclass of: abnormal primordium
definition: Abnormality of hindgut primordium.
has_exact_synonym: abnormality of hindgut primordium

abnormal hindlimb zeugopod
type: Class
subclass of: abnormal zeugopod
subclass of: abnormal hindlimb
definition: Abnormality of hindlimb zeugopod.
has_exact_synonym: abnormality of hindlimb zeugopod

abnormal blood
type: Class
subclass of: abnormal portion of organism substance
subclass of: abnormal hematological system
definition: Abnormality of blood.
has_exact_synonym: abnormality of blood

abnormal rhombomere R2
type: Class
subclass of: abnormal rhombomere
definition: Abnormality of rhombomere R2.
has_exact_synonym: abnormality of rhombomere R2

abnormal claw of hindlimb digit 2
type: Class
subclass of: abnormal claw
subclass of: abnormal hindlimb digit 2
definition: Abnormality of claw of hindlimb digit 2.
has_exact_synonym: abnormality of claw of hindlimb digit 2

abnormal m. rectus inferior primordium
type: Class
subclass of: abnormal cranial muscle primordium
definition: Abnormality of m. rectus inferior primordium.
has_exact_synonym: abnormality of m. rectus inferior primordium

abnormal atypical epithelium
type: Class
subclass of: abnormal epithelium
definition: Abnormality of atypical epithelium.
has_exact_synonym: abnormality of atypical epithelium

abnormal atrioventricular valve leaflet
type: Class
subclass of: XPO_0131653
definition: Abnormality of atrioventricular valve leaflet.
has_exact_synonym: abnormality of atrioventricular valve leaflet

abnormal postcranial axial skeleton
type: Class
subclass of: abnormal axial skeleton
definition: Abnormality of postcranial axial skeleton.
has_exact_synonym: abnormality of postcranial axial skeleton

abnormal midgut primordium
type: Class
subclass of: abnormal endoderm
subclass of: abnormal primordium
definition: Abnormality of midgut primordium.
has_exact_synonym: abnormality of midgut primordium

abnormal bladder
type: Class
subclass of: abnormal urinary system
subclass of: abnormal cavitated compound organ
subclass of: abnormal viscus
definition: Abnormality of bladder.
has_exact_synonym: abnormality of bladder

abnormal sciatic nerve
type: Class
subclass of: abnormal nerve
subclass of: abnormal hindlimb
definition: Abnormality of sciatic nerve.
has_exact_synonym: abnormality of sciatic nerve

abnormal archenteron roof midline
type: Class
subclass of: abnormal gastrocoel roof plate
subclass of: abnormal anatomical line
definition: Abnormality of archenteron roof midline.
has_exact_synonym: abnormality of archenteron roof midline

abnormal ventral lateral line
type: Class
subclass of: abnormal lateral line
definition: Abnormality of ventral lateral line.
has_exact_synonym: abnormality of ventral lateral line

abnormal pronephric tubule
type: Class
subclass of: abnormal tissue
subclass of: abnormal pronephric nephron
definition: Abnormality of pronephric tubule.
has_exact_synonym: abnormality of pronephric tubule

abnormal dorsal fin vasculature
type: Class
subclass of: abnormal fin vasculature
subclass of: abnormal dorsal fin
definition: Abnormality of dorsal fin vasculature.
has_exact_synonym: abnormality of dorsal fin vasculature

abnormal atrioventricular canal
type: Class
subclass of: abnormal multi-tissue structure
subclass of: abnormal heart
definition: Abnormality of atrioventricular canal.
has_exact_synonym: abnormality of atrioventricular canal

abnormal m. rectus posterior primordium
type: Class
subclass of: abnormal cranial muscle primordium
definition: Abnormality of m. rectus posterior primordium.
has_exact_synonym: abnormality of m. rectus posterior primordium

abnormal skeletal myocyte
type: Class
subclass of: abnormal skeletal muscle
subclass of: abnormal myocyte
definition: Abnormality of skeletal myocyte.
has_exact_synonym: abnormality of skeletal myocyte

abnormal thyroid
type: Class
subclass of: abnormal endocrine system
subclass of: abnormal compound organ
definition: Abnormality of thyroid.
has_exact_synonym: abnormality of thyroid

abnormal large intestine
type: Class
subclass of: abnormal multi-tissue structure
subclass of: abnormal intestine
definition: Abnormality of large intestine.
has_exact_synonym: abnormality of large intestine

abnormal left-dorsal blastomere
type: Class
subclass of: abnormal blastomere
definition: Abnormality of left-dorsal blastomere.
has_exact_synonym: abnormality of left-dorsal blastomere

abnormal fasciculated network of fibrils
type: Class
subclass of: abnormal tissue
subclass of: abnormal oocyte
subclass of: abnormal extraembryonic structure
definition: Abnormality of fasciculated network of fibrils.
has_exact_synonym: abnormality of fasciculated network of fibrils

abnormal lens transitional zone
type: Class
subclass of: abnormal tissue
subclass of: abnormal lens
definition: Abnormality of lens transitional zone.
has_exact_synonym: abnormality of lens transitional zone

abnormal basihyal
type: Class
subclass of: abnormal cartilage element
subclass of: abnormal chondrocranium
definition: Abnormality of basihyal.
has_exact_synonym: abnormality of basihyal

abnormal hindlimb
type: Class
subclass of: abnormal pelvic appendage
subclass of: abnormal limb
definition: Abnormality of hindlimb.
has_exact_synonym: abnormality of hindlimb

abnormal stomach
type: Class
subclass of: abnormal foregut
subclass of: abnormal cavitated compound organ
subclass of: abnormal viscus
definition: Abnormality of stomach.
has_exact_synonym: abnormality of stomach

abnormal glossopharyngeal epibranchial placode
type: Class
subclass of: abnormal epibranchial placode
definition: Abnormality of glossopharyngeal epibranchial placode.
has_exact_synonym: abnormality of glossopharyngeal epibranchial placode

abnormal abducens nerve
type: Class
subclass of: abnormal cranial nerve
definition: Abnormality of abducens nerve.
has_exact_synonym: abnormality of abducens nerve

abnormal auditory tube
type: Class
subclass of: abnormal multi-tissue structure
subclass of: abnormal auditory apparatus
definition: Abnormality of auditory tube.
has_exact_synonym: abnormality of auditory tube

abnormal infraorbital lateral line primordium
type: Class
subclass of: abnormal lateral line primordium
definition: Abnormality of infraorbital lateral line primordium.
has_exact_synonym: abnormality of infraorbital lateral line primordium

abnormal interdigital region
type: Class
subclass of: XPO_0141315
definition: Abnormality of interdigital region.
has_exact_synonym: abnormality of interdigital region

abnormal osseous labyrinth
type: Class
subclass of: abnormal multi-tissue structure
subclass of: abnormal inner ear
definition: Abnormality of osseous labyrinth.
has_exact_synonym: abnormality of osseous labyrinth

abnormal spiracle
type: Class
subclass of: abnormal surface structure
definition: Abnormality of spiracle.
has_exact_synonym: abnormality of spiracle

abnormal posterior placodal area
type: Class
subclass of: abnormal preplacodal ectoderm
definition: Abnormality of posterior placodal area.
has_exact_synonym: abnormality of posterior placodal area

abnormal simple organ
type: Class
subclass of: abnormal multi-tissue structure
definition: Abnormality of simple organ.
has_exact_synonym: abnormality of simple organ

abnormal periosteum (sensu fibrous layer)
type: Class
subclass of: abnormal periosteum
definition: Abnormality of periosteum (sensu fibrous layer).
has_exact_synonym: abnormality of periosteum (sensu fibrous layer)

abnormal presumptive midbrain-hindbrain boundary
type: Class
subclass of: abnormal central nervous system
subclass of: abnormal embryonic structure
definition: Abnormality of presumptive midbrain-hindbrain boundary.
has_exact_synonym: abnormality of presumptive midbrain-hindbrain boundary

abnormal blastomere V1.1.2
type: Class
subclass of: abnormal ventral animal hemisphere blastomere
definition: Abnormality of blastomere V1.1.2.
has_exact_synonym: abnormality of blastomere V1.1.2

abnormal parathyroid
type: Class
subclass of: abnormal multi-tissue structure
subclass of: abnormal endocrine system
definition: Abnormality of parathyroid.
has_exact_synonym: abnormality of parathyroid

abnormal blastomere D2.2.2
type: Class
subclass of: abnormal dorsal vegetal hemisphere blastomere
definition: Abnormality of blastomere D2.2.2.
has_exact_synonym: abnormality of blastomere D2.2.2

abnormal blastomere V1
type: Class
subclass of: abnormal blastomere
definition: Abnormality of blastomere V1.
has_exact_synonym: abnormality of blastomere V1

abnormal spinal neuron
type: Class
subclass of: abnormal neuron
subclass of: abnormal spinal cord
definition: Abnormality of spinal neuron.
has_exact_synonym: abnormality of spinal neuron

abnormal dorsolateral ascending neuron
type: Class
subclass of: abnormal neuron
definition: Abnormality of dorsolateral ascending neuron.
has_exact_synonym: abnormality of dorsolateral ascending neuron

abnormal trunk musculature
type: Class
subclass of: abnormal anatomical cluster
subclass of: abnormal trunk
definition: Abnormality of trunk musculature.
has_exact_synonym: abnormality of trunk musculature

abnormal liver primordium
type: Class
subclass of: abnormal primordium
subclass of: abnormal posterior foregut
definition: Abnormality of liver primordium.
has_exact_synonym: abnormality of liver primordium

abnormal apical mesenchyme
type: Class
subclass of: abnormal blastema
definition: Abnormality of apical mesenchyme.
has_exact_synonym: abnormality of apical mesenchyme

abnormal transporting epithelium
type: Class
subclass of: abnormal epithelium
definition: Abnormality of transporting epithelium.
has_exact_synonym: abnormality of transporting epithelium

abnormal m. transversus anterior primordium
type: Class
subclass of: abnormal cranial muscle primordium
definition: Abnormality of m. transversus anterior primordium.
has_exact_synonym: abnormality of m. transversus anterior primordium

abnormal pulmonary epithelium
type: Class
subclass of: abnormal epithelium
subclass of: abnormal lung bud
subclass of: abnormal lung primordium
subclass of: abnormal lung
definition: Abnormality of pulmonary epithelium.
has_exact_synonym: abnormality of pulmonary epithelium

abnormal posterior palatine artery
type: Class
subclass of: abnormal internal carotid artery
definition: Abnormality of posterior palatine artery.
has_exact_synonym: abnormality of posterior palatine artery

abnormal neuroendocrine cell
type: Class
subclass of: abnormal endocrine cell
definition: Abnormality of neuroendocrine cell.
has_exact_synonym: abnormality of neuroendocrine cell

abnormal retinal stem cell region
type: Class
subclass of: abnormal ciliary marginal zone
definition: Abnormality of retinal stem cell region.
has_exact_synonym: abnormality of retinal stem cell region

abnormal occipital lateral line
type: Class
subclass of: abnormal lateral line
definition: Abnormality of occipital lateral line.
has_exact_synonym: abnormality of occipital lateral line

abnormal oropharynx
type: Class
subclass of: abnormal anatomical cluster
subclass of: abnormal pharynx
definition: Abnormality of oropharynx.
has_exact_synonym: abnormality of oropharynx

abnormal m. levator mandibulae longus superior primordium
type: Class
subclass of: abnormal cranial muscle primordium
definition: Abnormality of m. levator mandibulae longus superior primordium.
has_exact_synonym: abnormality of m. levator mandibulae longus superior primordium

abnormal lateral septum
type: Class
subclass of: abnormal telencephalon septum
definition: Abnormality of lateral septum.
has_exact_synonym: abnormality of lateral septum

abnormal right atrium
type: Class
subclass of: abnormal cardiac atrium
definition: Abnormality of right atrium.
has_exact_synonym: abnormality of right atrium

abnormal m. depressor mandibulae
type: Class
subclass of: abnormal cranial muscle
definition: Abnormality of m. depressor mandibulae.
has_exact_synonym: abnormality of m. depressor mandibulae

abnormal head mesoderm
type: Class
subclass of: abnormal head
subclass of: abnormal mesoderm
definition: Abnormality of head mesoderm.
has_exact_synonym: abnormality of head mesoderm

abnormal sclera
type: Class
subclass of: abnormal multi-tissue structure
subclass of: abnormal eye
definition: Abnormality of sclera.
has_exact_synonym: abnormality of sclera

abnormal perichondrial cell
type: Class
subclass of: abnormal cell
subclass of: abnormal perichondrium
definition: Abnormality of perichondrial cell.
has_exact_synonym: abnormality of perichondrial cell

abnormal acellular bone tissue
type: Class
subclass of: abnormal mineralized bone tissue
definition: Abnormality of acellular bone tissue.
has_exact_synonym: abnormality of acellular bone tissue

abnormal dorsal fin margin
type: Class
subclass of: abnormal fin margin
subclass of: abnormal dorsal tail fin
subclass of: abnormal dorsal fin
definition: Abnormality of dorsal fin margin.
has_exact_synonym: abnormality of dorsal fin margin

abnormal m. subarcualis rectus I primordium
type: Class
subclass of: abnormal cranial muscle primordium
definition: Abnormality of m. subarcualis rectus I primordium.
has_exact_synonym: abnormality of m. subarcualis rectus I primordium

abnormal myotome of tail somite 18
type: Class
subclass of: abnormal myotome
definition: Abnormality of myotome of tail somite 18.
has_exact_synonym: abnormality of myotome of tail somite 18

abnormal right-dorsal blastomere
type: Class
subclass of: abnormal blastomere
definition: Abnormality of right-dorsal blastomere.
has_exact_synonym: abnormality of right-dorsal blastomere

abnormal microtubule
type: Class
subclass of: abnormal cell part
definition: Abnormality of microtubule.
has_exact_synonym: abnormality of microtubule

abnormal epaxial muscle
type: Class
subclass of: abnormal skeletal muscle
subclass of: abnormal trunk musculature
definition: Abnormality of epaxial muscle.
has_exact_synonym: abnormality of epaxial muscle

abnormal pharyngeal cavity
type: Class
subclass of: abnormal anatomical space
subclass of: abnormal alimentary system
definition: Abnormality of pharyngeal cavity.
has_exact_synonym: abnormality of pharyngeal cavity

abnormal dorsal lateral line
type: Class
subclass of: abnormal lateral line
definition: Abnormality of dorsal lateral line.
has_exact_synonym: abnormality of dorsal lateral line

abnormal hyoid arch
type: Class
subclass of: abnormal pharyngeal arch
definition: Abnormality of hyoid arch.
has_exact_synonym: abnormality of hyoid arch

abnormal nucleus
type: Class
subclass of: abnormal cell part
definition: Abnormality of nucleus.
has_exact_synonym: abnormality of nucleus

abnormal presacral vertebra
type: Class
subclass of: abnormal vertebra
definition: Abnormality of presacral vertebra.
has_exact_synonym: abnormality of presacral vertebra

abnormal bronchus
type: Class
subclass of: abnormal cavitated compound organ
subclass of: abnormal respiratory system
definition: Abnormality of bronchus.
has_exact_synonym: abnormality of bronchus

abnormal forelimb digit 4
type: Class
subclass of: abnormal forelimb digit
definition: Abnormality of forelimb digit 4.
has_exact_synonym: abnormality of forelimb digit 4

abnormal hindlimb stylopod
type: Class
subclass of: abnormal stylopod
subclass of: abnormal hindlimb
definition: Abnormality of hindlimb stylopod.
has_exact_synonym: abnormality of hindlimb stylopod

abnormal secondary spermatogonium
type: Class
subclass of: abnormal germ cell
definition: Abnormality of secondary spermatogonium.
has_exact_synonym: abnormality of secondary spermatogonium

abnormal angioblast
type: Class
subclass of: abnormal cell
subclass of: abnormal cardiovascular system
definition: Abnormality of angioblast.
has_exact_synonym: abnormality of angioblast

abnormal blastomere D1.2.2
type: Class
subclass of: abnormal dorsal animal hemisphere blastomere
definition: Abnormality of blastomere D1.2.2.
has_exact_synonym: abnormality of blastomere D1.2.2

abnormal spermatocyte
type: Class
subclass of: abnormal germ cell
definition: Abnormality of spermatocyte.
has_exact_synonym: abnormality of spermatocyte

abnormal dorsal pancreatic bud
type: Class
subclass of: abnormal primordium
subclass of: abnormal posterior foregut
definition: Abnormality of dorsal pancreatic bud.
has_exact_synonym: abnormality of dorsal pancreatic bud

abnormal sensorial layer of neurectoderm
type: Class
subclass of: abnormal neuroectoderm
definition: Abnormality of sensorial layer of neurectoderm.
has_exact_synonym: abnormality of sensorial layer of neurectoderm

abnormal left-right organizer primordium
type: Class
subclass of: abnormal primordium
subclass of: abnormal gastrocoel roof plate
definition: Abnormality of left-right organizer primordium.
has_exact_synonym: abnormality of left-right organizer primordium

abnormal lateral nasal prominence
type: Class
subclass of: abnormal head
subclass of: abnormal embryonic structure
definition: Abnormality of lateral nasal prominence.
has_exact_synonym: abnormality of lateral nasal prominence

abnormal cytoplasm
type: Class
subclass of: abnormal cell part
definition: Abnormality of cytoplasm.
has_exact_synonym: abnormality of cytoplasm

abnormal dorsal tegmentum
type: Class
subclass of: abnormal midbrain tegmentum
definition: Abnormality of dorsal tegmentum.
has_exact_synonym: abnormality of dorsal tegmentum

abnormal choroid fissure
type: Class
subclass of: abnormal embryonic structure
subclass of: abnormal eye
definition: Abnormality of choroid fissure.
has_exact_synonym: abnormality of choroid fissure

abnormal vacuolated notochordal tissue
type: Class
subclass of: abnormal connective tissue
subclass of: abnormal notochord
definition: Abnormality of vacuolated notochordal tissue.
has_exact_synonym: abnormality of vacuolated notochordal tissue

abnormal pre-enamel
type: Class
subclass of: abnormal odontoid tissue
definition: Abnormality of pre-enamel.
has_exact_synonym: abnormality of pre-enamel

abnormal trabecula
type: Class
subclass of: abnormal tissue
definition: Abnormality of trabecula.
has_exact_synonym: abnormality of trabecula

abnormal Brachet's cleft
type: Class
subclass of: abnormal embryonic structure
definition: Abnormality of Brachet's cleft.
has_exact_synonym: abnormality of Brachet's cleft

abnormal pars intermedia
type: Class
subclass of: abnormal organ part
subclass of: abnormal hypophysis
definition: Abnormality of pars intermedia.
has_exact_synonym: abnormality of pars intermedia

abnormal dermal system
type: Class
subclass of: abnormal anatomical system
definition: Abnormality of dermal system.
has_exact_synonym: abnormality of dermal system

abnormal principal cavity
type: Class
subclass of: abnormal anatomical space
subclass of: abnormal olfactory system
definition: Abnormality of principal cavity.
has_exact_synonym: abnormality of principal cavity

abnormal stage III oocyte
type: Class
subclass of: abnormal oocyte
definition: Abnormality of stage III oocyte.
has_exact_synonym: abnormality of stage III oocyte

abnormal lens
type: Class
subclass of: abnormal multi-tissue structure
subclass of: abnormal eye
definition: Abnormality of lens.
has_exact_synonym: abnormality of lens

abnormal branchial arch skeleton 1
type: Class
subclass of: abnormal branchial arch 1
subclass of: abnormal branchial arch skeleton
definition: Abnormality of branchial arch skeleton 1.
has_exact_synonym: abnormality of branchial arch skeleton 1

abnormal branchial arch skeleton
type: Class
subclass of: abnormal skeletal subdivision
subclass of: abnormal splanchnocranium
subclass of: abnormal branchial arch
definition: Abnormality of branchial arch skeleton.
has_exact_synonym: abnormality of branchial arch skeleton

abnormal dorsal caudal lymphatic vessel
type: Class
subclass of: abnormal lymph vessel
definition: Abnormality of dorsal caudal lymphatic vessel.
has_exact_synonym: abnormality of dorsal caudal lymphatic vessel

abnormal lymph vessel
type: Class
subclass of: abnormal multi-tissue structure
subclass of: abnormal lymphatic system
subclass of: abnormal circulatory system
definition: Abnormality of lymph vessel.
has_exact_synonym: abnormality of lymph vessel

abnormal granule cell layer of the cerebellum
type: Class
subclass of: abnormal tissue
subclass of: abnormal cerebellum
definition: Abnormality of granule cell layer of the cerebellum.
has_exact_synonym: abnormality of granule cell layer of the cerebellum

abnormal spermatozoon
type: Class
subclass of: abnormal gamete
definition: Abnormality of spermatozoon.
has_exact_synonym: abnormality of spermatozoon

abnormal visceral pouch 5
type: Class
subclass of: abnormal visceral pouch
definition: Abnormality of visceral pouch 5.
has_exact_synonym: abnormality of visceral pouch 5

abnormal mm. constrictores branchiales II primordium
type: Class
subclass of: abnormal cranial muscle primordium
definition: Abnormality of mm. constrictores branchiales II primordium.
has_exact_synonym: abnormality of mm. constrictores branchiales II primordium

abnormal sacral vertebra
type: Class
subclass of: abnormal vertebra
definition: Abnormality of sacral vertebra.
has_exact_synonym: abnormality of sacral vertebra

abnormal m. levator mandibulae externus
type: Class
subclass of: abnormal mandibular head muscle
definition: Abnormality of m. levator mandibulae externus.
has_exact_synonym: abnormality of m. levator mandibulae externus

abnormal dermis
type: Class
subclass of: abnormal multi-tissue structure
subclass of: abnormal skin
definition: Abnormality of dermis.
has_exact_synonym: abnormality of dermis

abnormal anterior tectum
type: Class
subclass of: abnormal optic tectum
definition: Abnormality of anterior tectum.
has_exact_synonym: abnormality of anterior tectum

abnormal hyoid arch skeleton
type: Class
subclass of: abnormal skeletal subdivision
subclass of: abnormal splanchnocranium
subclass of: abnormal hyoid arch
definition: Abnormality of hyoid arch skeleton.
has_exact_synonym: abnormality of hyoid arch skeleton

abnormal olfactory region
type: Class
subclass of: abnormal cranium
definition: Abnormality of olfactory region.
has_exact_synonym: abnormality of olfactory region

abnormal branchial vein
type: Class
subclass of: abnormal vein
definition: Abnormality of branchial vein.
has_exact_synonym: abnormality of branchial vein

abnormal claw primordium
type: Class
subclass of: abnormal tissue
subclass of: abnormal hindlimb digit
definition: Abnormality of claw primordium.
has_exact_synonym: abnormality of claw primordium

abnormal skeleton
type: Class
subclass of: abnormal anatomical cluster
subclass of: abnormal skeletal system
definition: Abnormality of skeleton.
has_exact_synonym: abnormality of skeleton

abnormal osteoblast
type: Class
subclass of: abnormal cell
subclass of: abnormal osteoid
definition: Abnormality of osteoblast.
has_exact_synonym: abnormality of osteoblast

abnormal duct of Cuvier
type: Class
subclass of: abnormal vein
definition: Abnormality of duct of Cuvier.
has_exact_synonym: abnormality of duct of Cuvier

abnormal ceratobranchial II
type: Class
subclass of: abnormal cartilage element
subclass of: abnormal chondrocranium
definition: Abnormality of ceratobranchial II.
has_exact_synonym: abnormality of ceratobranchial II

abnormal hatching gland primordium
type: Class
subclass of: abnormal head
subclass of: abnormal primordium
definition: Abnormality of hatching gland primordium.
has_exact_synonym: abnormality of hatching gland primordium

abnormal secondary heart field
type: Class
subclass of: abnormal tissue
subclass of: abnormal cardiovascular system
definition: Abnormality of secondary heart field.
has_exact_synonym: abnormality of secondary heart field

abnormal regenerating forelimb
type: Class
subclass of: abnormal regenerating limb
definition: Abnormality of regenerating forelimb.
has_exact_synonym: abnormality of regenerating forelimb

abnormal caudal vein
type: Class
subclass of: abnormal vein
subclass of: abnormal tail vasculature
definition: Abnormality of caudal vein.
has_exact_synonym: abnormality of caudal vein

abnormal ethmoid bone
type: Class
subclass of: abnormal endochondral bone
subclass of: abnormal ethmoid region
subclass of: abnormal craniofacial skeleton
definition: Abnormality of ethmoid bone.
has_exact_synonym: abnormality of ethmoid bone

abnormal sclerotome of trunk somite 13
type: Class
subclass of: abnormal sclerotome
definition: Abnormality of sclerotome of trunk somite 13.
has_exact_synonym: abnormality of sclerotome of trunk somite 13

abnormal melanotrope
type: Class
subclass of: abnormal cell
subclass of: abnormal hypophysis
definition: Abnormality of melanotrope.
has_exact_synonym: abnormality of melanotrope

abnormal middle lateral line placode
type: Class
subclass of: abnormal lateral line placode
definition: Abnormality of middle lateral line placode.
has_exact_synonym: abnormality of middle lateral line placode

abnormal m. petrohyoideus
type: Class
subclass of: abnormal cranial muscle
definition: Abnormality of m. petrohyoideus.
has_exact_synonym: abnormality of m. petrohyoideus

abnormal outer limiting membrane
type: Class
subclass of: abnormal tissue
subclass of: abnormal retinal neural layer
definition: Abnormality of outer limiting membrane.
has_exact_synonym: abnormality of outer limiting membrane

abnormal pronephric nephron
type: Class
subclass of: abnormal pronephric kidney
definition: Abnormality of pronephric nephron.
has_exact_synonym: abnormality of pronephric nephron

abnormal adenohypophysis
type: Class
subclass of: abnormal hypophysis
definition: Abnormality of adenohypophysis.
has_exact_synonym: abnormality of adenohypophysis

abnormal dorsal septum
type: Class
subclass of: abnormal telencephalon septum
definition: Abnormality of dorsal septum.
has_exact_synonym: abnormality of dorsal septum

abnormal mesonephric duct
type: Class
subclass of: abnormal duct
subclass of: abnormal mesonephric kidney
definition: Abnormality of mesonephric duct.
has_exact_synonym: abnormality of mesonephric duct

abnormal neural progenitor cell
type: Class
subclass of: abnormal nervous system
subclass of: abnormal progenitor cell
definition: Abnormality of neural progenitor cell.
has_exact_synonym: abnormality of neural progenitor cell

abnormal internal jugular vein
type: Class
subclass of: abnormal vein
subclass of: abnormal head vasculature
definition: Abnormality of internal jugular vein.
has_exact_synonym: abnormality of internal jugular vein

abnormal centrosome
type: Class
subclass of: abnormal cell part
definition: Abnormality of centrosome.
has_exact_synonym: abnormality of centrosome

abnormal tail somite 14
type: Class
subclass of: abnormal tail somite
definition: Abnormality of tail somite 14.
has_exact_synonym: abnormality of tail somite 14

abnormal monociliated epidermal cell
type: Class
subclass of: abnormal ciliated epidermal cell
subclass of: abnormal monociliated cell
definition: Abnormality of monociliated epidermal cell.
has_exact_synonym: abnormality of monociliated epidermal cell

abnormal postmigratory neural crest cell
type: Class
subclass of: abnormal cell
subclass of: abnormal neural crest
definition: Abnormality of postmigratory neural crest cell.
has_exact_synonym: abnormality of postmigratory neural crest cell

abnormal dorsal thalamus
type: Class
subclass of: abnormal thalamus
definition: Abnormality of dorsal thalamus.
has_exact_synonym: abnormality of dorsal thalamus

abnormal trunk somite 4
type: Class
subclass of: abnormal trunk somite
definition: Abnormality of trunk somite 4.
has_exact_synonym: abnormality of trunk somite 4

abnormal follicle layer
type: Class
subclass of: abnormal tissue
subclass of: abnormal ovary
definition: Abnormality of follicle layer.
has_exact_synonym: abnormality of follicle layer

abnormal blastomere V2.2
type: Class
subclass of: abnormal ventral vegetal hemisphere blastomere
definition: Abnormality of blastomere V2.2.
has_exact_synonym: abnormality of blastomere V2.2

abnormal forelimb digit 3
type: Class
subclass of: abnormal forelimb digit
definition: Abnormality of forelimb digit 3.
has_exact_synonym: abnormality of forelimb digit 3

abnormal blastomere V2.1.2
type: Class
subclass of: abnormal ventral vegetal hemisphere blastomere
definition: Abnormality of blastomere V2.1.2.
has_exact_synonym: abnormality of blastomere V2.1.2

abnormal cervical vertebra
type: Class
subclass of: abnormal vertebra
definition: Abnormality of cervical vertebra.
has_exact_synonym: abnormality of cervical vertebra

abnormal disaggregated/reaggregated ectoderm treated with activin
type: Class
subclass of: abnormal anatomical entity in vitro
definition: Abnormality of disaggregated/reaggregated ectoderm treated with activin.
has_exact_synonym: abnormality of disaggregated/reaggregated ectoderm treated with activin

abnormal carpus
type: Class
subclass of: abnormal bone element
subclass of: abnormal hand
subclass of: abnormal forelimb skeleton
definition: Abnormality of carpus.
has_exact_synonym: abnormality of carpus

abnormal prethalamus basal plate
type: Class
subclass of: abnormal tissue
subclass of: abnormal prethalamus
definition: Abnormality of prethalamus basal plate.
has_exact_synonym: abnormality of prethalamus basal plate

abnormal ventral pallidum
type: Class
subclass of: abnormal pallidum
definition: Abnormality of ventral pallidum.
has_exact_synonym: abnormality of ventral pallidum

abnormal dermal skeleton
type: Class
subclass of: abnormal skeletal subdivision
definition: Abnormality of dermal skeleton.
has_exact_synonym: abnormality of dermal skeleton

abnormal cardiac mesoderm
type: Class
subclass of: abnormal embryonic structure
definition: Abnormality of cardiac mesoderm.
has_exact_synonym: abnormality of cardiac mesoderm

abnormal multiciliated epidermal cell
type: Class
subclass of: abnormal ciliated epidermal cell
subclass of: abnormal multiciliated cell
definition: Abnormality of multiciliated epidermal cell.
has_exact_synonym: abnormality of multiciliated epidermal cell

abnormal multiciliated cell
type: Class
subclass of: abnormal ciliated cell
definition: Abnormality of multiciliated cell.
has_exact_synonym: abnormality of multiciliated cell

abnormal m. obliquus inferior
type: Class
subclass of: abnormal eye muscle
definition: Abnormality of m. obliquus inferior.
has_exact_synonym: abnormality of m. obliquus inferior

abnormal mm. levator arcuum branchialium II primordium
type: Class
subclass of: abnormal cranial muscle primordium
definition: Abnormality of mm. levator arcuum branchialium II primordium.
has_exact_synonym: abnormality of mm. levator arcuum branchialium II primordium

abnormal neuroectoderm inner layer
type: Class
subclass of: abnormal neuroectoderm
definition: Abnormality of neuroectoderm inner layer.
has_exact_synonym: abnormality of neuroectoderm inner layer

abnormal dorsal longitudinal anastomosing vessel - left branch
type: Class
subclass of: abnormal dorsal longitudinal anastomosing vessel
definition: Abnormality of dorsal longitudinal anastomosing vessel - left branch.
has_exact_synonym: abnormality of dorsal longitudinal anastomosing vessel - left branch

abnormal dorsal longitudinal anastomosing vessel
type: Class
subclass of: abnormal blood vessel
definition: Abnormality of dorsal longitudinal anastomosing vessel.
has_exact_synonym: abnormality of dorsal longitudinal anastomosing vessel

abnormal stapes
type: Class
subclass of: abnormal cartilage element
subclass of: abnormal auditory ossicle
subclass of: abnormal middle ear
definition: Abnormality of stapes.
has_exact_synonym: abnormality of stapes

abnormal skin gland
type: Class
subclass of: abnormal skin
definition: Abnormality of skin gland.
has_exact_synonym: abnormality of skin gland

abnormal adult intestinal epithelium
type: Class
subclass of: abnormal intestine
subclass of: abnormal simple columnar epithelium
subclass of: abnormal gut epithelium
definition: Abnormality of adult intestinal epithelium.
has_exact_synonym: abnormality of adult intestinal epithelium

abnormal simple columnar epithelium
type: Class
subclass of: abnormal unilaminar epithelium
definition: Abnormality of simple columnar epithelium.
has_exact_synonym: abnormality of simple columnar epithelium

abnormal gut epithelium
type: Class
subclass of: abnormal alimentary system
subclass of: abnormal epithelium
definition: Abnormality of gut epithelium.
has_exact_synonym: abnormality of gut epithelium

abnormal larval aorta
type: Class
subclass of: abnormal artery
definition: Abnormality of larval aorta.
has_exact_synonym: abnormality of larval aorta

abnormal habenula
type: Class
subclass of: abnormal dorsal thalamus
definition: Abnormality of habenula.
has_exact_synonym: abnormality of habenula

abnormal right blastomere
type: Class
subclass of: abnormal blastomere
definition: Abnormality of right blastomere.
has_exact_synonym: abnormality of right blastomere

abnormal myotome of head somite 4
type: Class
subclass of: abnormal myotome
definition: Abnormality of myotome of head somite 4.
has_exact_synonym: abnormality of myotome of head somite 4

abnormal iliac process primordium
type: Class
subclass of: abnormal multi-tissue structure
definition: Abnormality of iliac process primordium.
has_exact_synonym: abnormality of iliac process primordium

abnormal visceral pouch 6
type: Class
subclass of: abnormal visceral pouch
definition: Abnormality of visceral pouch 6.
has_exact_synonym: abnormality of visceral pouch 6

abnormal ligament cell
type: Class
subclass of: abnormal cell
subclass of: abnormal ligament
definition: Abnormality of ligament cell.
has_exact_synonym: abnormality of ligament cell

abnormal granular gland
type: Class
subclass of: abnormal skin gland
definition: Abnormality of granular gland.
has_exact_synonym: abnormality of granular gland

abnormal otic vesicle
type: Class
subclass of: abnormal tissue
subclass of: abnormal vestibuloauditory system
definition: Abnormality of otic vesicle.
has_exact_synonym: abnormality of otic vesicle

abnormal palatoquadrati
type: Class
subclass of: abnormal cartilage element
subclass of: abnormal chondrocranium
definition: Abnormality of palatoquadrati.
has_exact_synonym: abnormality of palatoquadrati

obsolete abnormal equatorial belt
type: Class
deprecated: true

abnormal rostral tuberal region
type: Class
subclass of: abnormal tuberal region
definition: Abnormality of rostral tuberal region.
has_exact_synonym: abnormality of rostral tuberal region

abnormal serous membrane
type: Class
subclass of: abnormal multi-tissue structure
definition: Abnormality of serous membrane.
has_exact_synonym: abnormality of serous membrane

abnormal planum hypobranchiale
type: Class
subclass of: abnormal cartilage element
subclass of: abnormal chondrocranium
definition: Abnormality of planum hypobranchiale.
has_exact_synonym: abnormality of planum hypobranchiale

abnormal ventricular zone
type: Class
subclass of: abnormal brain
definition: Abnormality of ventricular zone.
has_exact_synonym: abnormality of ventricular zone

abnormal ventral mesoderm
type: Class
subclass of: abnormal lateral plate mesoderm
definition: Abnormality of ventral mesoderm.
has_exact_synonym: abnormality of ventral mesoderm

abnormal acid secreting cell
type: Class
subclass of: abnormal cell
definition: Abnormality of acid secreting cell.
has_exact_synonym: abnormality of acid secreting cell

abnormal middle ear
type: Class
subclass of: abnormal anatomical cluster
subclass of: abnormal auditory apparatus
definition: Abnormality of middle ear.
has_exact_synonym: abnormality of middle ear

abnormal rhombomere R6
type: Class
subclass of: abnormal rhombomere
definition: Abnormality of rhombomere R6.
has_exact_synonym: abnormality of rhombomere R6

abnormal trunk somite 6
type: Class
subclass of: abnormal trunk somite
definition: Abnormality of trunk somite 6.
has_exact_synonym: abnormality of trunk somite 6

abnormal stomach body
type: Class
subclass of: abnormal proximal stomach
definition: Abnormality of stomach body.
has_exact_synonym: abnormality of stomach body

abnormal blastomere D1.1.1
type: Class
subclass of: abnormal dorsal animal hemisphere blastomere
definition: Abnormality of blastomere D1.1.1.
has_exact_synonym: abnormality of blastomere D1.1.1

abnormal dorsal marginal zone
type: Class
subclass of: abnormal marginal zone
definition: Abnormality of dorsal marginal zone.
has_exact_synonym: abnormality of dorsal marginal zone

abnormal facial epibranchial placode
type: Class
subclass of: abnormal epibranchial placode
definition: Abnormality of facial epibranchial placode.
has_exact_synonym: abnormality of facial epibranchial placode

abnormal sub-blastoporal endoderm
type: Class
subclass of: abnormal endoderm
definition: Abnormality of sub-blastoporal endoderm.
has_exact_synonym: abnormality of sub-blastoporal endoderm

abnormal ventral caudal lymphatic vessel
type: Class
subclass of: abnormal lymph vessel
definition: Abnormality of ventral caudal lymphatic vessel.
has_exact_synonym: abnormality of ventral caudal lymphatic vessel

abnormal goblet cell
type: Class
subclass of: abnormal epithelial cell
subclass of: abnormal skin
definition: Abnormality of goblet cell.
has_exact_synonym: abnormality of goblet cell

abnormal proximal tubule
type: Class
subclass of: abnormal pronephric tubule
definition: Abnormality of proximal tubule.
has_exact_synonym: abnormality of proximal tubule

abnormal egg
type: Class
subclass of: abnormal gamete
definition: Abnormality of egg.
has_exact_synonym: abnormality of egg

abnormal outflow tract
type: Class
subclass of: abnormal multi-tissue structure
subclass of: abnormal heart
definition: Abnormality of outflow tract.
has_exact_synonym: abnormality of outflow tract

abnormal m. rectus inferior
type: Class
subclass of: abnormal eye muscle
definition: Abnormality of m. rectus inferior.
has_exact_synonym: abnormality of m. rectus inferior

abnormal endocardial tube
type: Class
subclass of: abnormal heart
subclass of: abnormal embryonic structure
definition: Abnormality of endocardial tube.
has_exact_synonym: abnormality of endocardial tube

abnormal subocular cartilage
type: Class
subclass of: abnormal cartilage element
definition: Abnormality of subocular cartilage.
has_exact_synonym: abnormality of subocular cartilage

abnormal dorsal foregut
type: Class
subclass of: abnormal foregut
definition: Abnormality of dorsal foregut.
has_exact_synonym: abnormality of dorsal foregut

abnormal blastomere V1.2
type: Class
subclass of: abnormal ventral animal hemisphere blastomere
definition: Abnormality of blastomere V1.2.
has_exact_synonym: abnormality of blastomere V1.2

abnormal ultimobranchial body
type: Class
subclass of: abnormal tissue
subclass of: abnormal endocrine system
definition: Abnormality of ultimobranchial body.
has_exact_synonym: abnormality of ultimobranchial body

abnormal posterior branchial crest
type: Class
subclass of: abnormal branchial crest
definition: Abnormality of posterior branchial crest.
has_exact_synonym: abnormality of posterior branchial crest

abnormal conjunctiva
type: Class
subclass of: abnormal tissue
subclass of: abnormal eye
definition: Abnormality of conjunctiva.
has_exact_synonym: abnormality of conjunctiva

abnormal m. constrictor laryngis
type: Class
subclass of: abnormal laryngeal muscle
definition: Abnormality of m. constrictor laryngis.
has_exact_synonym: abnormality of m. constrictor laryngis

abnormal anterior branchial crest
type: Class
subclass of: abnormal branchial crest
definition: Abnormality of anterior branchial crest.
has_exact_synonym: abnormality of anterior branchial crest

abnormal sacculus
type: Class
subclass of: abnormal auditory ossicle
definition: Abnormality of sacculus.
has_exact_synonym: abnormality of sacculus

abnormal right spleen primordium
type: Class
subclass of: abnormal primordium
subclass of: abnormal immune system
definition: Abnormality of right spleen primordium.
has_exact_synonym: abnormality of right spleen primordium

abnormal spinal nerve
type: Class
subclass of: abnormal peripheral nervous system
subclass of: abnormal nerve
definition: Abnormality of spinal nerve.
has_exact_synonym: abnormality of spinal nerve

abnormal retinal progenitor cell
type: Class
subclass of: abnormal progenitor cell
subclass of: abnormal retinal progenitor cell region
definition: Abnormality of retinal progenitor cell.
has_exact_synonym: abnormality of retinal progenitor cell

abnormal myotome of trunk somite 8
type: Class
subclass of: abnormal myotome
definition: Abnormality of myotome of trunk somite 8.
has_exact_synonym: abnormality of myotome of trunk somite 8

abnormal suspensorium
type: Class
subclass of: abnormal splanchnocranium
definition: Abnormality of suspensorium.
has_exact_synonym: abnormality of suspensorium

abnormal caudal fin skeleton
type: Class
subclass of: abnormal median fin skeleton
subclass of: abnormal tail fin
definition: Abnormality of caudal fin skeleton.
has_exact_synonym: abnormality of caudal fin skeleton

abnormal ventrolateral neural tube
type: Class
subclass of: abnormal neural tube
definition: Abnormality of ventrolateral neural tube.
has_exact_synonym: abnormality of ventrolateral neural tube

abnormal pharynx
type: Class
subclass of: abnormal multi-tissue structure
subclass of: abnormal alimentary system
definition: Abnormality of pharynx.
has_exact_synonym: abnormality of pharynx

abnormal hatching gland cell
type: Class
subclass of: abnormal cell
subclass of: abnormal hatching gland
definition: Abnormality of hatching gland cell.
has_exact_synonym: abnormality of hatching gland cell

abnormal hyomandibular lateral line
type: Class
subclass of: abnormal lateral line
definition: Abnormality of hyomandibular lateral line.
has_exact_synonym: abnormality of hyomandibular lateral line

abnormal glomeral nexus
type: Class
subclass of: abnormal tissue
subclass of: abnormal glomus
definition: Abnormality of glomeral nexus.
has_exact_synonym: abnormality of glomeral nexus

abnormal axial mesoderm
type: Class
subclass of: abnormal embryonic structure
definition: Abnormality of axial mesoderm.
has_exact_synonym: abnormality of axial mesoderm

abnormal anterior cerebral vein
type: Class
subclass of: abnormal cerebral vein
definition: Abnormality of anterior cerebral vein.
has_exact_synonym: abnormality of anterior cerebral vein

abnormal filter chamber
type: Class
subclass of: abnormal anatomical space
subclass of: abnormal lateral plate mesoderm
definition: Abnormality of filter chamber.
has_exact_synonym: abnormality of filter chamber

abnormal rhombomere R7
type: Class
subclass of: abnormal rhombomere
definition: Abnormality of rhombomere R7.
has_exact_synonym: abnormality of rhombomere R7

abnormal apical ectodermal ridge
type: Class
subclass of: abnormal limb bud
subclass of: abnormal proliferative region
definition: Abnormality of apical ectodermal ridge.
has_exact_synonym: abnormality of apical ectodermal ridge

abnormal ventricular layer of the optic tectum
type: Class
subclass of: abnormal tissue
subclass of: abnormal optic tectum
definition: Abnormality of ventricular layer of the optic tectum.
has_exact_synonym: abnormality of ventricular layer of the optic tectum

abnormal mm. constrictores branchiales IV
type: Class
subclass of: abnormal branchial head muscle
definition: Abnormality of mm. constrictores branchiales IV.
has_exact_synonym: abnormality of mm. constrictores branchiales IV

abnormal visceral pouch 1
type: Class
subclass of: abnormal visceral pouch
definition: Abnormality of visceral pouch 1.
has_exact_synonym: abnormality of visceral pouch 1

abnormal cardia
type: Class
subclass of: abnormal proximal stomach
definition: Abnormality of cardia.
has_exact_synonym: abnormality of cardia

abnormal caudal presomitic mesoderm
type: Class
subclass of: abnormal presomitic mesoderm
definition: Abnormality of caudal presomitic mesoderm.
has_exact_synonym: abnormality of caudal presomitic mesoderm

abnormal intersomitic vein
type: Class
subclass of: abnormal intersomitic vessel
definition: Abnormality of intersomitic vein.
has_exact_synonym: abnormality of intersomitic vein

abnormal ophthalmic artery
type: Class
subclass of: abnormal internal carotid artery
definition: Abnormality of ophthalmic artery.
has_exact_synonym: abnormality of ophthalmic artery

abnormal anterior hypothalamus
type: Class
subclass of: abnormal hypothalamus
definition: Abnormality of anterior hypothalamus.
has_exact_synonym: abnormality of anterior hypothalamus

abnormal astrocyte
type: Class
subclass of: abnormal brain
subclass of: abnormal spinal cord
subclass of: abnormal glial cell
definition: Abnormality of astrocyte.
has_exact_synonym: abnormality of astrocyte

abnormal m. intermandibularis primordium
type: Class
subclass of: abnormal cranial muscle primordium
definition: Abnormality of m. intermandibularis primordium.
has_exact_synonym: abnormality of m. intermandibularis primordium

abnormal anterior ventral blood island
type: Class
subclass of: abnormal ventral blood island
definition: Abnormality of anterior ventral blood island.
has_exact_synonym: abnormality of anterior ventral blood island

abnormal vegetal pole
type: Class
subclass of: abnormal vegetal hemisphere
definition: Abnormality of vegetal pole.
has_exact_synonym: abnormality of vegetal pole

abnormal dorsal hyoid arch skeleton
type: Class
subclass of: abnormal tissue
subclass of: abnormal hyoid arch skeleton
definition: Abnormality of dorsal hyoid arch skeleton.
has_exact_synonym: abnormality of dorsal hyoid arch skeleton

abnormal non-involuting marginal zone
type: Class
subclass of: abnormal ectoderm
subclass of: abnormal marginal zone
definition: Abnormality of non-involuting marginal zone.
has_exact_synonym: abnormality of non-involuting marginal zone

abnormal m. rectus superior
type: Class
subclass of: abnormal eye muscle
definition: Abnormality of m. rectus superior.
has_exact_synonym: abnormality of m. rectus superior

abnormal plasma membrane
type: Class
subclass of: abnormal cell part
definition: Abnormality of plasma membrane.
has_exact_synonym: abnormality of plasma membrane

abnormal animal part, late involuting
type: Class
subclass of: abnormal tissue
subclass of: abnormal involuting marginal zone
definition: Abnormality of animal part, late involuting.
has_exact_synonym: abnormality of animal part, late involuting

abnormal metencephalic artery
type: Class
subclass of: abnormal head vasculature
subclass of: abnormal artery
subclass of: abnormal brain
definition: Abnormality of metencephalic artery.
has_exact_synonym: abnormality of metencephalic artery

abnormal accessory olfactory bulb
type: Class
subclass of: abnormal olfactory bulb
definition: Abnormality of accessory olfactory bulb.
has_exact_synonym: abnormality of accessory olfactory bulb

abnormal visceral pouch 4
type: Class
subclass of: abnormal visceral pouch
definition: Abnormality of visceral pouch 4.
has_exact_synonym: abnormality of visceral pouch 4

abnormal sclerotome of tail somite 15
type: Class
subclass of: abnormal sclerotome
definition: Abnormality of sclerotome of tail somite 15.
has_exact_synonym: abnormality of sclerotome of tail somite 15

abnormal myotome of tail somite 14
type: Class
subclass of: abnormal myotome
definition: Abnormality of myotome of tail somite 14.
has_exact_synonym: abnormality of myotome of tail somite 14

abnormal pineal gland
type: Class
subclass of: abnormal endocrine system
subclass of: abnormal visual system
subclass of: abnormal midbrain
definition: Abnormality of pineal gland.
has_exact_synonym: abnormality of pineal gland

abnormal rhombomere R5
type: Class
subclass of: abnormal rhombomere
definition: Abnormality of rhombomere R5.
has_exact_synonym: abnormality of rhombomere R5

abnormal rib
type: Class
subclass of: abnormal vertebra
subclass of: abnormal process
definition: Abnormality of rib.
has_exact_synonym: abnormality of rib

abnormal endoplasmic reticulum
type: Class
subclass of: abnormal cell part
definition: Abnormality of endoplasmic reticulum.
has_exact_synonym: abnormality of endoplasmic reticulum

abnormal mitochondrial cloud
type: Class
subclass of: abnormal oocyte
subclass of: abnormal cell part
definition: Abnormality of mitochondrial cloud.
has_exact_synonym: abnormality of mitochondrial cloud

abnormal Bowman's gland
type: Class
subclass of: abnormal multi-tissue structure
subclass of: abnormal olfactory epithelium
definition: Abnormality of Bowman's gland.
has_exact_synonym: abnormality of Bowman's gland

abnormal germinal vesicle
type: Class
subclass of: abnormal oocyte
subclass of: abnormal nucleus
definition: Abnormality of germinal vesicle.
has_exact_synonym: abnormality of germinal vesicle

abnormal mammilary region
type: Class
subclass of: abnormal posterior hypothalamus
definition: Abnormality of mammilary region.
has_exact_synonym: abnormality of mammilary region

abnormal footplate of the stapes
type: Class
subclass of: abnormal stapes
definition: Abnormality of footplate of the stapes.
has_exact_synonym: abnormality of footplate of the stapes

abnormal ventral abdominal vein
type: Class
subclass of: abnormal vein
subclass of: abnormal trunk vasculature
definition: Abnormality of ventral abdominal vein.
has_exact_synonym: abnormality of ventral abdominal vein

abnormal mucous gland
type: Class
subclass of: abnormal multi-tissue structure
definition: Abnormality of mucous gland.
has_exact_synonym: abnormality of mucous gland

abnormal blastomere D1.1.2
type: Class
subclass of: abnormal dorsal animal hemisphere blastomere
definition: Abnormality of blastomere D1.1.2.
has_exact_synonym: abnormality of blastomere D1.1.2

abnormal posterior cardinal vein
type: Class
subclass of: abnormal vein
subclass of: abnormal trunk vasculature
definition: Abnormality of posterior cardinal vein.
has_exact_synonym: abnormality of posterior cardinal vein

abnormal myotome of trunk somite 11
type: Class
subclass of: abnormal myotome
definition: Abnormality of myotome of trunk somite 11.
has_exact_synonym: abnormality of myotome of trunk somite 11

abnormal mineralized hyaline cartilage tissue
type: Class
subclass of: abnormal mineralized tissue
definition: Abnormality of mineralized hyaline cartilage tissue.
has_exact_synonym: abnormality of mineralized hyaline cartilage tissue

abnormal T cell
type: Class
subclass of: abnormal lymphocyte
definition: Abnormality of T cell.
has_exact_synonym: abnormality of T cell

abnormal mesentery
type: Class
subclass of: abnormal alimentary system
subclass of: abnormal epithelium
definition: Abnormality of mesentery.
has_exact_synonym: abnormality of mesentery

abnormal forelimb bud tip
type: Class
subclass of: abnormal tissue
subclass of: abnormal forelimb bud
definition: Abnormality of forelimb bud tip.
has_exact_synonym: abnormality of forelimb bud tip

abnormal mm. levator arcuum branchialium II
type: Class
subclass of: abnormal branchial head muscle
definition: Abnormality of mm. levator arcuum branchialium II.
has_exact_synonym: abnormality of mm. levator arcuum branchialium II

abnormal dermatocranium
type: Class
subclass of: abnormal cranium
definition: Abnormality of dermatocranium.
has_exact_synonym: abnormality of dermatocranium

abnormal pylorus
type: Class
subclass of: abnormal distal stomach
definition: Abnormality of pylorus.
has_exact_synonym: abnormality of pylorus

abnormal adrenal gland
type: Class
subclass of: abnormal solid compound organ
subclass of: abnormal endocrine system
definition: Abnormality of adrenal gland.
has_exact_synonym: abnormality of adrenal gland

abnormal lower eyelid
type: Class
subclass of: abnormal surface structure
subclass of: abnormal eye
definition: Abnormality of lower eyelid.
has_exact_synonym: abnormality of lower eyelid

abnormal dorso-lateral marginal zone
type: Class
subclass of: abnormal marginal zone
definition: Abnormality of dorso-lateral marginal zone.
has_exact_synonym: abnormality of dorso-lateral marginal zone

abnormal lateral crista
type: Class
subclass of: abnormal sensory epithelial cell
subclass of: abnormal inner ear
definition: Abnormality of lateral crista.
has_exact_synonym: abnormality of lateral crista

abnormal blastomere V2.2.1
type: Class
subclass of: abnormal ventral vegetal hemisphere blastomere
definition: Abnormality of blastomere V2.2.1.
has_exact_synonym: abnormality of blastomere V2.2.1

abnormal skin seromucous gland
type: Class
subclass of: abnormal skin gland
definition: Abnormality of skin seromucous gland.
has_exact_synonym: abnormality of skin seromucous gland

abnormal tendon
type: Class
subclass of: abnormal dense regular connective tissue
definition: Abnormality of tendon.
has_exact_synonym: abnormality of tendon

abnormal mineralized avascular GAG-rich matrix
type: Class
subclass of: abnormal avascular GAG-rich matrix
subclass of: abnormal mineralized cartilage tissue
subclass of: abnormal mineralized extracellular matrix
definition: Abnormality of mineralized avascular GAG-rich matrix.
has_exact_synonym: abnormality of mineralized avascular GAG-rich matrix

abnormal mineralized extracellular matrix
type: Class
subclass of: abnormal proteinaceous extracellular matrix
definition: Abnormality of mineralized extracellular matrix.
has_exact_synonym: abnormality of mineralized extracellular matrix

abnormal ventro-lateral marginal zone
type: Class
subclass of: abnormal marginal zone
definition: Abnormality of ventro-lateral marginal zone.
has_exact_synonym: abnormality of ventro-lateral marginal zone

abnormal inner fin
type: Class
subclass of: abnormal fin
definition: Abnormality of inner fin.
has_exact_synonym: abnormality of inner fin

abnormal posterior foregut
type: Class
subclass of: abnormal foregut
definition: Abnormality of posterior foregut.
has_exact_synonym: abnormality of posterior foregut

abnormal craniofacial region
type: Class
subclass of: abnormal head
subclass of: abnormal anatomical cluster
definition: Abnormality of craniofacial region.
has_exact_synonym: abnormality of craniofacial region

abnormal pharyngeal mesenchyme
type: Class
subclass of: abnormal mesenchyme
subclass of: abnormal pharyngeal region
definition: Abnormality of pharyngeal mesenchyme.
has_exact_synonym: abnormality of pharyngeal mesenchyme

abnormal anteroventral lateral line placode
type: Class
subclass of: abnormal lateral line placode
definition: Abnormality of anteroventral lateral line placode.
has_exact_synonym: abnormality of anteroventral lateral line placode

abnormal pre-chordal neural plate border
type: Class
subclass of: abnormal neural plate border
subclass of: abnormal pre-chordal neural plate
definition: Abnormality of pre-chordal neural plate border.
has_exact_synonym: abnormality of pre-chordal neural plate border

abnormal caudal tuberal region
type: Class
subclass of: abnormal tuberal region
definition: Abnormality of caudal tuberal region.
has_exact_synonym: abnormality of caudal tuberal region

abnormal erythroid cell
type: Class
subclass of: abnormal cell
subclass of: abnormal hematological system
definition: Abnormality of erythroid cell.
has_exact_synonym: abnormality of erythroid cell

abnormal hypobranchial head muscle
type: Class
subclass of: abnormal cranial muscle
definition: Abnormality of hypobranchial head muscle.
has_exact_synonym: abnormality of hypobranchial head muscle

abnormal egg cell-free extract
type: Class
subclass of: abnormal cell-free extract
definition: Abnormality of egg cell-free extract.
has_exact_synonym: abnormality of egg cell-free extract

abnormal cell-free extract
type: Class
subclass of: abnormal anatomical entity in vitro
definition: Abnormality of cell-free extract.
has_exact_synonym: abnormality of cell-free extract

abnormal mesonephric late distal tubule
type: Class
subclass of: abnormal mesonephric tubule
definition: Abnormality of mesonephric late distal tubule.
has_exact_synonym: abnormality of mesonephric late distal tubule

abnormal antrum
type: Class
subclass of: abnormal distal stomach
definition: Abnormality of antrum.
has_exact_synonym: abnormality of antrum

abnormal stage IV oocyte
type: Class
subclass of: abnormal oocyte
definition: Abnormality of stage IV oocyte.
has_exact_synonym: abnormality of stage IV oocyte

abnormal forelimb digit 2
type: Class
subclass of: abnormal forelimb digit
definition: Abnormality of forelimb digit 2.
has_exact_synonym: abnormality of forelimb digit 2

abnormal trunk lateral line
type: Class
subclass of: abnormal lateral line
definition: Abnormality of trunk lateral line.
has_exact_synonym: abnormality of trunk lateral line

abnormal lateral vein
type: Class
subclass of: abnormal vein
subclass of: abnormal trunk vasculature
definition: Abnormality of lateral vein.
has_exact_synonym: abnormality of lateral vein

abnormal tuberal region
type: Class
subclass of: abnormal posterior hypothalamus
definition: Abnormality of tuberal region.
has_exact_synonym: abnormality of tuberal region

abnormal trochlear nerve
type: Class
subclass of: abnormal cranial nerve
definition: Abnormality of trochlear nerve.
has_exact_synonym: abnormality of trochlear nerve

abnormal trabecula carnea
type: Class
subclass of: abnormal heart
subclass of: abnormal trabecula
definition: Abnormality of trabecula carnea.
has_exact_synonym: abnormality of trabecula carnea

abnormal cardiac progenitor cell
type: Class
subclass of: abnormal progenitor cell
subclass of: abnormal heart primordium
definition: Abnormality of cardiac progenitor cell.
has_exact_synonym: abnormality of cardiac progenitor cell

abnormal Rathke's pouch
type: Class
subclass of: abnormal embryonic structure
subclass of: abnormal mouth primordium
definition: Abnormality of Rathke's pouch.
has_exact_synonym: abnormality of Rathke's pouch

abnormal middle cerebral vein
type: Class
subclass of: abnormal cerebral vein
definition: Abnormality of middle cerebral vein.
has_exact_synonym: abnormality of middle cerebral vein

abnormal third ventricle
type: Class
subclass of: abnormal brain ventricle
subclass of: abnormal diencephalon
definition: Abnormality of third ventricle.
has_exact_synonym: abnormality of third ventricle

abnormal Muller cell
type: Class
subclass of: abnormal retina
subclass of: abnormal glial cell
definition: Abnormality of Muller cell.
has_exact_synonym: abnormality of Muller cell

abnormal radial glial cell
type: Class
subclass of: abnormal glial cell
subclass of: abnormal ventricular layer of the optic tectum
definition: Abnormality of radial glial cell.
has_exact_synonym: abnormality of radial glial cell

abnormal primary heart field
type: Class
subclass of: abnormal tissue
subclass of: abnormal cardiovascular system
definition: Abnormality of primary heart field.
has_exact_synonym: abnormality of primary heart field

abnormal cornua trabecula
type: Class
subclass of: abnormal cartilage element
subclass of: abnormal chondrocranium
definition: Abnormality of cornua trabecula.
has_exact_synonym: abnormality of cornua trabecula

abnormal dorsal pallidum
type: Class
subclass of: abnormal pallidum
definition: Abnormality of dorsal pallidum.
has_exact_synonym: abnormality of dorsal pallidum

abnormal cartilaginous condensation
type: Class
subclass of: abnormal cell condensation
subclass of: abnormal skeleton
definition: Abnormality of cartilaginous condensation.
has_exact_synonym: abnormality of cartilaginous condensation

abnormal visceral pouch 2
type: Class
subclass of: abnormal visceral pouch
definition: Abnormality of visceral pouch 2.
has_exact_synonym: abnormality of visceral pouch 2

abnormal hepatocyte
type: Class
subclass of: abnormal epithelial cell
subclass of: abnormal liver
definition: Abnormality of hepatocyte.
has_exact_synonym: abnormality of hepatocyte

abnormal apoptotic cell
type: Class
subclass of: abnormal cell
definition: Abnormality of apoptotic cell.
has_exact_synonym: abnormality of apoptotic cell

abnormal motor neuron
type: Class
subclass of: abnormal neuron
definition: Abnormality of motor neuron.
has_exact_synonym: abnormality of motor neuron

abnormal nucleus reticularis inferior
type: Class
subclass of: abnormal neural nucleus
subclass of: abnormal medulla oblongata
definition: Abnormality of nucleus reticularis inferior.
has_exact_synonym: abnormality of nucleus reticularis inferior

abnormal ooplasm
type: Class
subclass of: abnormal oocyte
subclass of: abnormal cell part
definition: Abnormality of ooplasm.
has_exact_synonym: abnormality of ooplasm

abnormal cardiac valve
type: Class
subclass of: abnormal heart
subclass of: abnormal tissue
definition: Abnormality of cardiac valve.
has_exact_synonym: abnormality of cardiac valve

abnormal m. rectus cervicus
type: Class
subclass of: abnormal hypobranchial head muscle
definition: Abnormality of m. rectus cervicus.
has_exact_synonym: abnormality of m. rectus cervicus

abnormal mitral cell
type: Class
subclass of: abnormal neuron
subclass of: abnormal mitral cell layer of the olfactory bulb
definition: Abnormality of mitral cell.
has_exact_synonym: abnormality of mitral cell

abnormal ventrolateral thalamic nucleus
type: Class
subclass of: abnormal neural nucleus
subclass of: abnormal thalamus
definition: Abnormality of ventrolateral thalamic nucleus.
has_exact_synonym: abnormality of ventrolateral thalamic nucleus

abnormal Keller explant
type: Class
subclass of: abnormal anatomical entity in vitro
definition: Abnormality of Keller explant.
has_exact_synonym: abnormality of Keller explant

abnormal prepollex
type: Class
subclass of: abnormal cartilage element
subclass of: abnormal hand
definition: Abnormality of prepollex.
has_exact_synonym: abnormality of prepollex

abnormal cell body layer of the optic tectum
type: Class
subclass of: abnormal tissue
subclass of: abnormal optic tectum
definition: Abnormality of cell body layer of the optic tectum.
has_exact_synonym: abnormality of cell body layer of the optic tectum

abnormal fenestra subocularis
type: Class
subclass of: abnormal chondrocranium
subclass of: abnormal anatomical space
definition: Abnormality of fenestra subocularis.
has_exact_synonym: abnormality of fenestra subocularis

abnormal maxillary artery
type: Class
subclass of: abnormal head vasculature
subclass of: abnormal artery
definition: Abnormality of maxillary artery.
has_exact_synonym: abnormality of maxillary artery

abnormal odontode tissue
type: Class
subclass of: abnormal odontoid tissue
definition: Abnormality of odontode tissue.
has_exact_synonym: abnormality of odontode tissue

abnormal mm. constrictores branchiales III primordium
type: Class
subclass of: abnormal cranial muscle primordium
definition: Abnormality of mm. constrictores branchiales III primordium.
has_exact_synonym: abnormality of mm. constrictores branchiales III primordium

abnormal suprablastoporal endoderm
type: Class
subclass of: abnormal endoderm
definition: Abnormality of suprablastoporal endoderm.
has_exact_synonym: abnormality of suprablastoporal endoderm

abnormal amputated limb
type: Class
subclass of: abnormal amputated tissue
definition: Abnormality of amputated limb.
has_exact_synonym: abnormality of amputated limb

abnormal infrarostral
type: Class
subclass of: abnormal cartilage element
subclass of: abnormal chondrocranium
definition: Abnormality of infrarostral.
has_exact_synonym: abnormality of infrarostral

abnormal atrioventricular canal endocardium
type: Class
subclass of: abnormal endocardium
subclass of: abnormal atrioventricular canal
definition: Abnormality of atrioventricular canal endocardium.
has_exact_synonym: abnormality of atrioventricular canal endocardium

abnormal retinal progenitor cell region
type: Class
subclass of: abnormal ciliary marginal zone
definition: Abnormality of retinal progenitor cell region.
has_exact_synonym: abnormality of retinal progenitor cell region

abnormal musculature of face
type: Class
subclass of: abnormal head
subclass of: abnormal muscle
definition: Abnormality of musculature of face.
has_exact_synonym: abnormality of musculature of face

abnormal external carotid artery
type: Class
subclass of: abnormal artery
subclass of: abnormal filter chamber
definition: Abnormality of external carotid artery.
has_exact_synonym: abnormality of external carotid artery

abnormal forelimb digit 5
type: Class
subclass of: abnormal forelimb digit
definition: Abnormality of forelimb digit 5.
has_exact_synonym: abnormality of forelimb digit 5

abnormal typhlosole
type: Class
subclass of: abnormal tissue
subclass of: abnormal intestine
definition: Abnormality of typhlosole.
has_exact_synonym: abnormality of typhlosole

abnormal female organism
type: Class
subclass of: abnormal whole organism
definition: Abnormality of female organism.
has_exact_synonym: abnormality of female organism

abnormal blastomere V2.2.2
type: Class
subclass of: abnormal ventral vegetal hemisphere blastomere
definition: Abnormality of blastomere V2.2.2.
has_exact_synonym: abnormality of blastomere V2.2.2

abnormal gastric vein
type: Class
subclass of: abnormal vein
subclass of: abnormal trunk vasculature
subclass of: abnormal alimentary system
definition: Abnormality of gastric vein.
has_exact_synonym: abnormality of gastric vein

abnormal ventral funiculus
type: Class
subclass of: abnormal anatomical cluster
subclass of: abnormal spinal cord
definition: Abnormality of ventral funiculus.
has_exact_synonym: abnormality of ventral funiculus

abnormal anterodorsal tegmental nucleus
type: Class
subclass of: abnormal neural nucleus
subclass of: abnormal midbrain tegmentum
definition: Abnormality of anterodorsal tegmental nucleus.
has_exact_synonym: abnormality of anterodorsal tegmental nucleus

abnormal stromal cell
type: Class
subclass of: abnormal cell
subclass of: abnormal connective tissue
definition: Abnormality of stromal cell.
has_exact_synonym: abnormality of stromal cell

abnormal branchial basket
type: Class
subclass of: abnormal head
subclass of: abnormal cartilage element
definition: Abnormality of branchial basket.
has_exact_synonym: abnormality of branchial basket

abnormal m. cucullaris
type: Class
subclass of: abnormal cranial muscle
definition: Abnormality of m. cucullaris.
has_exact_synonym: abnormality of m. cucullaris

abnormal claw of hindlimb digit 3
type: Class
subclass of: abnormal claw
subclass of: abnormal hindlimb digit 3
definition: Abnormality of claw of hindlimb digit 3.
has_exact_synonym: abnormality of claw of hindlimb digit 3

abnormal premigratory neural crest cell
type: Class
subclass of: abnormal cell
subclass of: abnormal neural crest
definition: Abnormality of premigratory neural crest cell.
has_exact_synonym: abnormality of premigratory neural crest cell

abnormal dermatome
type: Class
subclass of: abnormal dermomyotome
definition: Abnormality of dermatome.
has_exact_synonym: abnormality of dermatome

abnormal circulating cell
type: Class
subclass of: abnormal cell
subclass of: abnormal circulatory system
definition: Abnormality of circulating cell.
has_exact_synonym: abnormality of circulating cell

abnormal hepato-pancreatic duct
type: Class
subclass of: abnormal duct
subclass of: abnormal liver and biliary system
definition: Abnormality of hepato-pancreatic duct.
has_exact_synonym: abnormality of hepato-pancreatic duct

abnormal arteria subclavia
type: Class
subclass of: abnormal artery
subclass of: abnormal trunk vasculature
definition: Abnormality of arteria subclavia.
has_exact_synonym: abnormality of arteria subclavia

abnormal tail somite 17
type: Class
subclass of: abnormal tail somite
definition: Abnormality of tail somite 17.
has_exact_synonym: abnormality of tail somite 17

abnormal pharyngeal pouch
type: Class
subclass of: abnormal multi-tissue structure
subclass of: abnormal pharyngeal region
definition: Abnormality of pharyngeal pouch.
has_exact_synonym: abnormality of pharyngeal pouch

abnormal retinal layer
type: Class
subclass of: abnormal tissue
subclass of: abnormal optic vesicle
definition: Abnormality of retinal layer.
has_exact_synonym: abnormality of retinal layer

abnormal articular system
type: Class
subclass of: abnormal skeletal system
definition: Abnormality of articular system.
has_exact_synonym: abnormality of articular system

abnormal proximal tubule branch
type: Class
subclass of: abnormal proximal tubule
definition: Abnormality of proximal tubule branch.
has_exact_synonym: abnormality of proximal tubule branch

abnormal non-ciliated epithelial cell
type: Class
subclass of: abnormal epithelial cell
definition: Abnormality of non-ciliated epithelial cell.
has_exact_synonym: abnormality of non-ciliated epithelial cell

abnormal m. obliquus superior
type: Class
subclass of: abnormal eye muscle
definition: Abnormality of m. obliquus superior.
has_exact_synonym: abnormality of m. obliquus superior

abnormal m. levator mandibulae longus profundus
type: Class
subclass of: abnormal mandibular head muscle
definition: Abnormality of m. levator mandibulae longus profundus.
has_exact_synonym: abnormality of m. levator mandibulae longus profundus

abnormal pars interna of the stapes
type: Class
subclass of: abnormal stapes
definition: Abnormality of pars interna of the stapes.
has_exact_synonym: abnormality of pars interna of the stapes

abnormal sclerotome of tail somite 17
type: Class
subclass of: abnormal sclerotome
definition: Abnormality of sclerotome of tail somite 17.
has_exact_synonym: abnormality of sclerotome of tail somite 17

abnormal regenerating hindlimb
type: Class
subclass of: abnormal regenerating limb
definition: Abnormality of regenerating hindlimb.
has_exact_synonym: abnormality of regenerating hindlimb

abnormal late proximal tubule
type: Class
subclass of: abnormal proximal tubule
definition: Abnormality of late proximal tubule.
has_exact_synonym: abnormality of late proximal tubule

abnormal retinal ganglion cell
type: Class
subclass of: abnormal neuron
subclass of: abnormal retinal ganglion cell layer
definition: Abnormality of retinal ganglion cell.
has_exact_synonym: abnormality of retinal ganglion cell

abnormal suprachiasmatic nucleus
type: Class
subclass of: abnormal neural nucleus
subclass of: abnormal anterior hypothalamus
definition: Abnormality of suprachiasmatic nucleus.
has_exact_synonym: abnormality of suprachiasmatic nucleus

abnormal vestibulocochlear nerve
type: Class
subclass of: abnormal cranial nerve
subclass of: abnormal vestibuloauditory system
definition: Abnormality of vestibulocochlear nerve.
has_exact_synonym: abnormality of vestibulocochlear nerve

abnormal optic chiasm
type: Class
subclass of: abnormal diencephalon
definition: Abnormality of optic chiasm.
has_exact_synonym: abnormality of optic chiasm

abnormal dorsolateral commissural neuron
type: Class
subclass of: abnormal neuron
definition: Abnormality of dorsolateral commissural neuron.
has_exact_synonym: abnormality of dorsolateral commissural neuron

abnormal posterior ventral blood island
type: Class
subclass of: abnormal ventral blood island
definition: Abnormality of posterior ventral blood island.
has_exact_synonym: abnormality of posterior ventral blood island

abnormal forelimb bud
type: Class
subclass of: abnormal limb bud
definition: Abnormality of forelimb bud.
has_exact_synonym: abnormality of forelimb bud

abnormal myotome of head somite 1
type: Class
subclass of: abnormal myotome
definition: Abnormality of myotome of head somite 1.
has_exact_synonym: abnormality of myotome of head somite 1

abnormal palatoquadrate
type: Class
subclass of: abnormal tissue
subclass of: abnormal mandibular arch
definition: Abnormality of palatoquadrate.
has_exact_synonym: abnormality of palatoquadrate

abnormal blastomere D2.1
type: Class
subclass of: abnormal dorsal vegetal hemisphere blastomere
definition: Abnormality of blastomere D2.1.
has_exact_synonym: abnormality of blastomere D2.1

abnormal bile duct
type: Class
subclass of: abnormal duct
subclass of: abnormal liver and biliary system
definition: Abnormality of bile duct.
has_exact_synonym: abnormality of bile duct

abnormal anterior commissure
type: Class
subclass of: abnormal anatomical cluster
subclass of: abnormal telencephalon
definition: Abnormality of anterior commissure.
has_exact_synonym: abnormality of anterior commissure

abnormal femur rudiment
type: Class
subclass of: abnormal cartilage element
definition: Abnormality of femur rudiment.
has_exact_synonym: abnormality of femur rudiment

abnormal occipital region
type: Class
subclass of: abnormal cranium
definition: Abnormality of occipital region.
has_exact_synonym: abnormality of occipital region

abnormal sclerotome of head somite 4
type: Class
subclass of: abnormal sclerotome
definition: Abnormality of sclerotome of head somite 4.
has_exact_synonym: abnormality of sclerotome of head somite 4

abnormal digestive enzyme secreting cell
type: Class
subclass of: abnormal cell
subclass of: abnormal alimentary system
definition: Abnormality of digestive enzyme secreting cell.
has_exact_synonym: abnormality of digestive enzyme secreting cell

abnormal optic disc
type: Class
subclass of: abnormal eye
definition: Abnormality of optic disc.
has_exact_synonym: abnormality of optic disc

abnormal joint region
type: Class
subclass of: XPO_0141315
definition: Abnormality of joint region.
has_exact_synonym: abnormality of joint region

abnormal isthmic nucleus
type: Class
subclass of: abnormal neural nucleus
subclass of: abnormal midbrain-hindbrain boundary
definition: Abnormality of isthmic nucleus.
has_exact_synonym: abnormality of isthmic nucleus

abnormal thymus
type: Class
subclass of: abnormal endocrine system
subclass of: abnormal compound organ
subclass of: abnormal immune system
definition: Abnormality of thymus.
has_exact_synonym: abnormality of thymus

abnormal vestibule
type: Class
subclass of: abnormal tissue
subclass of: abnormal osseous labyrinth
definition: Abnormality of vestibule.
has_exact_synonym: abnormality of vestibule

abnormal peripheral nerve
type: Class
subclass of: abnormal nerve
subclass of: abnormal peripheral ganglion
definition: Abnormality of peripheral nerve.
has_exact_synonym: abnormality of peripheral nerve

abnormal glomerular epithelial cell
type: Class
subclass of: abnormal epithelial cell
subclass of: abnormal glomus
definition: Abnormality of glomerular epithelial cell.
has_exact_synonym: abnormality of glomerular epithelial cell

abnormal ischiadic vein
type: Class
subclass of: abnormal vein
definition: Abnormality of ischiadic vein.
has_exact_synonym: abnormality of ischiadic vein

abnormal glossopharyngeal nerve
type: Class
subclass of: abnormal cranial nerve
subclass of: abnormal gustatory system
definition: Abnormality of glossopharyngeal nerve.
has_exact_synonym: abnormality of glossopharyngeal nerve

abnormal stratum spongiosum
type: Class
subclass of: abnormal tissue
subclass of: abnormal dermis
definition: Abnormality of stratum spongiosum.
has_exact_synonym: abnormality of stratum spongiosum

abnormal pre-enameloid
type: Class
subclass of: abnormal odontoid tissue
definition: Abnormality of pre-enameloid.
has_exact_synonym: abnormality of pre-enameloid

abnormal aortic arch 2
type: Class
subclass of: abnormal aortic arch
definition: Abnormality of aortic arch 2.
has_exact_synonym: abnormality of aortic arch 2

abnormal sclerotome of trunk somite 3
type: Class
subclass of: abnormal sclerotome
definition: Abnormality of sclerotome of trunk somite 3.
has_exact_synonym: abnormality of sclerotome of trunk somite 3

abnormal glomeral mesenchyme
type: Class
subclass of: abnormal embryonic structure
subclass of: abnormal urogenital system
definition: Abnormality of glomeral mesenchyme.
has_exact_synonym: abnormality of glomeral mesenchyme

abnormal myotome of trunk somite 2
type: Class
subclass of: abnormal myotome
definition: Abnormality of myotome of trunk somite 2.
has_exact_synonym: abnormality of myotome of trunk somite 2

abnormal ophthalmic vein
type: Class
subclass of: abnormal vena capitis medialis
definition: Abnormality of ophthalmic vein.
has_exact_synonym: abnormality of ophthalmic vein

abnormal migrating macrophage
type: Class
subclass of: abnormal epidermis
subclass of: abnormal mesoderm
subclass of: abnormal ventral blood island
subclass of: abnormal macrophage
definition: Abnormality of migrating macrophage.
has_exact_synonym: abnormality of migrating macrophage

abnormal macrophage
type: Class
subclass of: abnormal immune system
subclass of: abnormal blood
subclass of: abnormal circulating cell
definition: Abnormality of macrophage.
has_exact_synonym: abnormality of macrophage

abnormal tail vein
type: Class
subclass of: abnormal vein
subclass of: abnormal tail vasculature
definition: Abnormality of tail vein.
has_exact_synonym: abnormality of tail vein

abnormal ceratobranchial III
type: Class
subclass of: abnormal cartilage element
subclass of: abnormal chondrocranium
definition: Abnormality of ceratobranchial III.
has_exact_synonym: abnormality of ceratobranchial III

abnormal retinal rod cell
type: Class
subclass of: abnormal eye photoreceptor cell
definition: Abnormality of retinal rod cell.
has_exact_synonym: abnormality of retinal rod cell

abnormal centriole
type: Class
subclass of: abnormal centrosome
definition: Abnormality of centriole.
has_exact_synonym: abnormality of centriole

abnormal larval immune system
type: Class
subclass of: abnormal immune system
definition: Abnormality of larval immune system.
has_exact_synonym: abnormality of larval immune system

abnormal medial septum
type: Class
subclass of: abnormal telencephalon septum
definition: Abnormality of medial septum.
has_exact_synonym: abnormality of medial septum

abnormal Mauthner cell
type: Class
subclass of: abnormal hindbrain
subclass of: abnormal neuron
definition: Abnormality of Mauthner cell.
has_exact_synonym: abnormality of Mauthner cell

abnormal dorsal involuting marginal zone
type: Class
subclass of: abnormal marginal zone
definition: Abnormality of dorsal involuting marginal zone.
has_exact_synonym: abnormality of dorsal involuting marginal zone

abnormal m. obliquus inferior primordium
type: Class
subclass of: abnormal cranial muscle primordium
definition: Abnormality of m. obliquus inferior primordium.
has_exact_synonym: abnormality of m. obliquus inferior primordium

abnormal postsacral vertebra
type: Class
subclass of: abnormal vertebra
definition: Abnormality of postsacral vertebra.
has_exact_synonym: abnormality of postsacral vertebra

abnormal sclerotome of trunk somite 2
type: Class
subclass of: abnormal sclerotome
definition: Abnormality of sclerotome of trunk somite 2.
has_exact_synonym: abnormality of sclerotome of trunk somite 2

abnormal mesenchymal stem cell
type: Class
subclass of: abnormal stem cell
definition: Abnormality of mesenchymal stem cell.
has_exact_synonym: abnormality of mesenchymal stem cell

abnormal cementum
type: Class
subclass of: abnormal odontoid tissue
definition: Abnormality of cementum.
has_exact_synonym: abnormality of cementum

abnormal iris
type: Class
subclass of: abnormal multi-tissue structure
subclass of: abnormal eye
subclass of: abnormal uveal tract
definition: Abnormality of iris.
has_exact_synonym: abnormality of iris

abnormal taste bud
type: Class
subclass of: abnormal tissue
subclass of: abnormal gustatory system
definition: Abnormality of taste bud.
has_exact_synonym: abnormality of taste bud

abnormal female genitalia
type: Class
subclass of: abnormal genital system
subclass of: abnormal female organism
definition: Abnormality of female genitalia.
has_exact_synonym: abnormality of female genitalia

abnormal scapula
type: Class
subclass of: abnormal endochondral bone
subclass of: abnormal pectoral girdle
definition: Abnormality of scapula.
has_exact_synonym: abnormality of scapula

abnormal gasserian ganglion
type: Class
subclass of: abnormal ganglion
definition: Abnormality of gasserian ganglion.
has_exact_synonym: abnormality of gasserian ganglion

abnormal lagena
type: Class
subclass of: abnormal osseous labyrinth
definition: Abnormality of lagena.
has_exact_synonym: abnormality of lagena

abnormal cutaneous femoral vein
type: Class
subclass of: abnormal vein
subclass of: abnormal hindlimb stylopod
definition: Abnormality of cutaneous femoral vein.
has_exact_synonym: abnormality of cutaneous femoral vein

abnormal mucus secreting cell
type: Class
subclass of: abnormal cell
definition: Abnormality of mucus secreting cell.
has_exact_synonym: abnormality of mucus secreting cell

abnormal olfactory epithelial support cell
type: Class
subclass of: abnormal cell
subclass of: abnormal olfactory system
definition: Abnormality of olfactory epithelial support cell.
has_exact_synonym: abnormality of olfactory epithelial support cell

abnormal ciliated non-epidermal cell
type: Class
subclass of: abnormal ciliated cell
definition: Abnormality of ciliated non-epidermal cell.
has_exact_synonym: abnormality of ciliated non-epidermal cell

abnormal nucleate erythrocyte
type: Class
subclass of: abnormal cell
definition: Abnormality of nucleate erythrocyte.
has_exact_synonym: abnormality of nucleate erythrocyte

abnormal endocardial cushion
type: Class
subclass of: abnormal endocardium
definition: Abnormality of endocardial cushion.
has_exact_synonym: abnormality of endocardial cushion

abnormal vertebral artery
type: Class
subclass of: abnormal artery
definition: Abnormality of vertebral artery.
has_exact_synonym: abnormality of vertebral artery

abnormal hindlimb digit 4
type: Class
subclass of: abnormal hindlimb digit
definition: Abnormality of hindlimb digit 4.
has_exact_synonym: abnormality of hindlimb digit 4

abnormal ventricular outflow tract
type: Class
subclass of: abnormal outflow tract
definition: Abnormality of ventricular outflow tract.
has_exact_synonym: abnormality of ventricular outflow tract

abnormal Rohon-Beard neuron
type: Class
subclass of: abnormal neural plate
subclass of: abnormal neuron
definition: Abnormality of Rohon-Beard neuron.
has_exact_synonym: abnormality of Rohon-Beard neuron

abnormal mesonephric early proximal tubule
type: Class
subclass of: abnormal mesonephric tubule
definition: Abnormality of mesonephric early proximal tubule.
has_exact_synonym: abnormality of mesonephric early proximal tubule

abnormal digit-joint region
type: Class
subclass of: abnormal digit
subclass of: abnormal joint region
definition: Abnormality of digit-joint region.
has_exact_synonym: abnormality of digit-joint region

abnormal myotome of trunk somite 12
type: Class
subclass of: abnormal myotome
definition: Abnormality of myotome of trunk somite 12.
has_exact_synonym: abnormality of myotome of trunk somite 12

abnormal retinal cone cell
type: Class
subclass of: abnormal eye photoreceptor cell
definition: Abnormality of retinal cone cell.
has_exact_synonym: abnormality of retinal cone cell

abnormal auditory hair cell
type: Class
subclass of: abnormal sensory epithelial cell
subclass of: abnormal inner ear
definition: Abnormality of auditory hair cell.
has_exact_synonym: abnormality of auditory hair cell

abnormal sclerotome of trunk somite 11
type: Class
subclass of: abnormal sclerotome
definition: Abnormality of sclerotome of trunk somite 11.
has_exact_synonym: abnormality of sclerotome of trunk somite 11

abnormal stratum compactum
type: Class
subclass of: abnormal tissue
subclass of: abnormal dermis
definition: Abnormality of stratum compactum.
has_exact_synonym: abnormality of stratum compactum

abnormal mesencephalic vein
type: Class
subclass of: abnormal vein
subclass of: abnormal head vasculature
subclass of: abnormal midbrain
definition: Abnormality of mesencephalic vein.
has_exact_synonym: abnormality of mesencephalic vein

abnormal head endoderm
type: Class
subclass of: abnormal head
subclass of: abnormal endoderm
definition: Abnormality of head endoderm.
has_exact_synonym: abnormality of head endoderm

abnormal coeliaco-mesenteric artery
type: Class
subclass of: abnormal artery
subclass of: abnormal trunk vasculature
definition: Abnormality of coeliaco-mesenteric artery.
has_exact_synonym: abnormality of coeliaco-mesenteric artery

abnormal dentine
type: Class
subclass of: abnormal odontoid tissue
definition: Abnormality of dentine.
has_exact_synonym: abnormality of dentine

abnormal central canal
type: Class
subclass of: abnormal anatomical cluster
subclass of: abnormal spinal cord
definition: Abnormality of central canal.
has_exact_synonym: abnormality of central canal

abnormal m. dilatator laryngis
type: Class
subclass of: abnormal laryngeal muscle
definition: Abnormality of m. dilatator laryngis.
has_exact_synonym: abnormality of m. dilatator laryngis

abnormal oviduct
type: Class
subclass of: abnormal duct
subclass of: abnormal female genitalia
definition: Abnormality of oviduct.
has_exact_synonym: abnormality of oviduct

abnormal blastocoel floor
type: Class
subclass of: abnormal tissue
subclass of: abnormal blastocoel
definition: Abnormality of blastocoel floor.
has_exact_synonym: abnormality of blastocoel floor

abnormal mitotic spindle
type: Class
subclass of: abnormal cell part
definition: Abnormality of mitotic spindle.
has_exact_synonym: abnormality of mitotic spindle

abnormal nucleus reticularis medialis
type: Class
subclass of: abnormal neural nucleus
subclass of: abnormal medulla oblongata
definition: Abnormality of nucleus reticularis medialis.
has_exact_synonym: abnormality of nucleus reticularis medialis

abnormal posterior commissure
type: Class
subclass of: abnormal anatomical cluster
subclass of: abnormal midbrain
definition: Abnormality of posterior commissure.
has_exact_synonym: abnormality of posterior commissure

abnormal branchial arch skeleton 4
type: Class
subclass of: abnormal branchial arch 4
subclass of: abnormal branchial arch skeleton
definition: Abnormality of branchial arch skeleton 4.
has_exact_synonym: abnormality of branchial arch skeleton 4

abnormal lateral hypothalamic nucleus
type: Class
subclass of: abnormal neural nucleus
subclass of: abnormal hypothalamus
definition: Abnormality of lateral hypothalamic nucleus.
has_exact_synonym: abnormality of lateral hypothalamic nucleus

abnormal mesodermal cell
type: Class
subclass of: abnormal cell
subclass of: abnormal mesoderm
definition: Abnormality of mesodermal cell.
has_exact_synonym: abnormality of mesodermal cell

abnormal caudal lateral line
type: Class
subclass of: abnormal lateral line
definition: Abnormality of caudal lateral line.
has_exact_synonym: abnormality of caudal lateral line

abnormal roof plate
type: Class
subclass of: abnormal multi-tissue structure
subclass of: abnormal spinal cord
definition: Abnormality of roof plate.
has_exact_synonym: abnormality of roof plate

abnormal lateral abdominal vein
type: Class
subclass of: abnormal vein
subclass of: abnormal trunk vasculature
definition: Abnormality of lateral abdominal vein.
has_exact_synonym: abnormality of lateral abdominal vein

abnormal pubis
type: Class
subclass of: abnormal endochondral bone
subclass of: abnormal pelvic girdle
definition: Abnormality of pubis.
has_exact_synonym: abnormality of pubis

abnormal notoplate
type: Class
subclass of: abnormal neural plate
definition: Abnormality of notoplate.
has_exact_synonym: abnormality of notoplate

abnormal hypochord
type: Class
subclass of: abnormal endoderm
definition: Abnormality of hypochord.
has_exact_synonym: abnormality of hypochord

abnormal mm. levator arcuum branchialium IV
type: Class
subclass of: abnormal branchial head muscle
definition: Abnormality of mm. levator arcuum branchialium IV.
has_exact_synonym: abnormality of mm. levator arcuum branchialium IV

abnormal glomerulus
type: Class
subclass of: abnormal mesonephric nephron
definition: Abnormality of glomerulus.
has_exact_synonym: abnormality of glomerulus

abnormal pigment cell
type: Class
subclass of: abnormal cell
subclass of: abnormal skin
definition: Abnormality of pigment cell.
has_exact_synonym: abnormality of pigment cell

abnormal hindlimb bud tip
type: Class
subclass of: abnormal tissue
subclass of: abnormal hindlimb bud
definition: Abnormality of hindlimb bud tip.
has_exact_synonym: abnormality of hindlimb bud tip

abnormal enameloid
type: Class
subclass of: abnormal odontoid tissue
definition: Abnormality of enameloid.
has_exact_synonym: abnormality of enameloid

abnormal tympanic disk
type: Class
subclass of: abnormal cartilage element
subclass of: abnormal auditory apparatus
definition: Abnormality of tympanic disk.
has_exact_synonym: abnormality of tympanic disk

abnormal metatarsus
type: Class
subclass of: abnormal bone element
subclass of: abnormal hindlimb skeleton
subclass of: abnormal foot
definition: Abnormality of metatarsus.
has_exact_synonym: abnormality of metatarsus

abnormal left-ventral blastomere
type: Class
subclass of: abnormal blastomere
definition: Abnormality of left-ventral blastomere.
has_exact_synonym: abnormality of left-ventral blastomere

abnormal ventromedial thalamic nucleus
type: Class
subclass of: abnormal neural nucleus
subclass of: abnormal thalamus
definition: Abnormality of ventromedial thalamic nucleus.
has_exact_synonym: abnormality of ventromedial thalamic nucleus

abnormal rostral presomitic mesoderm
type: Class
subclass of: abnormal presomitic mesoderm
definition: Abnormality of rostral presomitic mesoderm.
has_exact_synonym: abnormality of rostral presomitic mesoderm

abnormal keratinocyte
type: Class
subclass of: abnormal epidermis
subclass of: abnormal blastema
subclass of: abnormal keratin accumulating cell
definition: Abnormality of keratinocyte.
has_exact_synonym: abnormality of keratinocyte

abnormal neuroectoderm outer layer
type: Class
subclass of: abnormal neuroectoderm
definition: Abnormality of neuroectoderm outer layer.
has_exact_synonym: abnormality of neuroectoderm outer layer

abnormal external coil of the small intestine
type: Class
subclass of: abnormal small intestine
definition: Abnormality of external coil of the small intestine.
has_exact_synonym: abnormality of external coil of the small intestine

abnormal orbital region
type: Class
subclass of: abnormal cranium
definition: Abnormality of orbital region.
has_exact_synonym: abnormality of orbital region

abnormal mm. levator arcuum branchialium III
type: Class
subclass of: abnormal branchial head muscle
definition: Abnormality of mm. levator arcuum branchialium III.
has_exact_synonym: abnormality of mm. levator arcuum branchialium III

abnormal oculomotor motornucleus
type: Class
subclass of: abnormal neural nucleus
subclass of: abnormal cranial ganglion
subclass of: abnormal midbrain
definition: Abnormality of oculomotor motornucleus.
has_exact_synonym: abnormality of oculomotor motornucleus

abnormal solitary tract
type: Class
subclass of: abnormal nucleus of the solitary tract
subclass of: abnormal spinal cord
definition: Abnormality of solitary tract.
has_exact_synonym: abnormality of solitary tract

abnormal posterior hypothalamus
type: Class
subclass of: abnormal hypothalamus
definition: Abnormality of posterior hypothalamus.
has_exact_synonym: abnormality of posterior hypothalamus

abnormal branchial arch skeleton 2
type: Class
subclass of: abnormal branchial arch 2
subclass of: abnormal branchial arch skeleton
definition: Abnormality of branchial arch skeleton 2.
has_exact_synonym: abnormality of branchial arch skeleton 2

abnormal claw of hindlimb digit 1
type: Class
subclass of: abnormal claw
subclass of: abnormal hindlimb digit 1
definition: Abnormality of claw of hindlimb digit 1.
has_exact_synonym: abnormality of claw of hindlimb digit 1

abnormal m. rectus abdominis
type: Class
subclass of: abnormal muscle
definition: Abnormality of m. rectus abdominis.
has_exact_synonym: abnormality of m. rectus abdominis

abnormal barrier cell
type: Class
subclass of: abnormal cell
definition: Abnormality of barrier cell.
has_exact_synonym: abnormality of barrier cell

abnormal posterior lateral line placode
type: Class
subclass of: abnormal lateral line placode
definition: Abnormality of posterior lateral line placode.
has_exact_synonym: abnormality of posterior lateral line placode

abnormal sacral neural crest
type: Class
subclass of: XPO_0141494
definition: Abnormality of sacral neural crest.
has_exact_synonym: abnormality of sacral neural crest

abnormal lung
type: Class
subclass of: abnormal cavitated compound organ
subclass of: abnormal respiratory system
subclass of: abnormal viscus
definition: Abnormality of lung.
has_exact_synonym: abnormality of lung

abnormal utricle
type: Class
subclass of: abnormal auditory ossicle
definition: Abnormality of utricle.
has_exact_synonym: abnormality of utricle

abnormal subcortical cytoplasm
type: Class
subclass of: abnormal oocyte
subclass of: abnormal cell part
definition: Abnormality of subcortical cytoplasm.
has_exact_synonym: abnormality of subcortical cytoplasm

abnormal bulbous arteriosis
type: Class
subclass of: abnormal multi-tissue structure
subclass of: abnormal cardiovascular system
definition: Abnormality of bulbous arteriosis.
has_exact_synonym: abnormality of bulbous arteriosis

abnormal myotome of trunk somite 7
type: Class
subclass of: abnormal myotome
definition: Abnormality of myotome of trunk somite 7.
has_exact_synonym: abnormality of myotome of trunk somite 7

abnormal ileum
type: Class
subclass of: abnormal small intestine
definition: Abnormality of ileum.
has_exact_synonym: abnormality of ileum

abnormal retinal ganglion cell layer
type: Class
subclass of: abnormal tissue
subclass of: abnormal retinal neural layer
definition: Abnormality of retinal ganglion cell layer.
has_exact_synonym: abnormality of retinal ganglion cell layer

abnormal processus articularis palatoquadrati
type: Class
subclass of: abnormal cartilage element
subclass of: abnormal chondrocranium
definition: Abnormality of processus articularis palatoquadrati.
has_exact_synonym: abnormality of processus articularis palatoquadrati

abnormal colon
type: Class
subclass of: abnormal large intestine
definition: Abnormality of colon.
has_exact_synonym: abnormality of colon

abnormal pigment layer
type: Class
subclass of: abnormal tissue
subclass of: abnormal optic vesicle
definition: Abnormality of pigment layer.
has_exact_synonym: abnormality of pigment layer

abnormal bottle cell
type: Class
subclass of: abnormal gastrula cell
definition: Abnormality of bottle cell.
has_exact_synonym: abnormality of bottle cell

abnormal trigeminal ganglion
type: Class
subclass of: abnormal ganglion
definition: Abnormality of trigeminal ganglion.
has_exact_synonym: abnormality of trigeminal ganglion

abnormal Eberth-Kastschenko layer
type: Class
subclass of: abnormal tissue
subclass of: abnormal dermis
definition: Abnormality of Eberth-Kastschenko layer.
has_exact_synonym: abnormality of Eberth-Kastschenko layer

abnormal retinal inner nuclear layer
type: Class
subclass of: abnormal tissue
subclass of: abnormal retinal neural layer
definition: Abnormality of retinal inner nuclear layer.
has_exact_synonym: abnormality of retinal inner nuclear layer

abnormal hyaloid vascular plexus
type: Class
subclass of: abnormal hyaloid blood vessel
definition: Abnormality of hyaloid vascular plexus.
has_exact_synonym: abnormality of hyaloid vascular plexus

abnormal hindlimb digit 5
type: Class
subclass of: abnormal hindlimb digit
definition: Abnormality of hindlimb digit 5.
has_exact_synonym: abnormality of hindlimb digit 5

abnormal amphibian papilla
type: Class
subclass of: abnormal tissue
subclass of: abnormal inner ear
definition: Abnormality of amphibian papilla.
has_exact_synonym: abnormality of amphibian papilla

abnormal dermal bone
type: Class
subclass of: abnormal membrane bone
subclass of: abnormal dermal skeleton
definition: Abnormality of dermal bone.
has_exact_synonym: abnormality of dermal bone

abnormal lateral amygdala
type: Class
subclass of: abnormal neural nucleus
subclass of: abnormal amygdala
definition: Abnormality of lateral amygdala.
has_exact_synonym: abnormality of lateral amygdala

abnormal processus ascendens palatoquadrate
type: Class
subclass of: abnormal cartilage element
subclass of: abnormal chondrocranium
definition: Abnormality of processus ascendens palatoquadrate.
has_exact_synonym: abnormality of processus ascendens palatoquadrate

abnormal duodenum
type: Class
subclass of: abnormal small intestine
definition: Abnormality of duodenum.
has_exact_synonym: abnormality of duodenum

abnormal iridophore
type: Class
subclass of: abnormal pigment cell
definition: Abnormality of iridophore.
has_exact_synonym: abnormality of iridophore

abnormal facies hyoidis of the palatoquadrate
type: Class
subclass of: abnormal cartilage element
subclass of: abnormal chondrocranium
definition: Abnormality of facies hyoidis of the palatoquadrate.
has_exact_synonym: abnormality of facies hyoidis of the palatoquadrate

abnormal m. transversus anterior
type: Class
subclass of: abnormal branchial head muscle
definition: Abnormality of m. transversus anterior.
has_exact_synonym: abnormality of m. transversus anterior

abnormal blastomere D2.1.1
type: Class
subclass of: abnormal dorsal vegetal hemisphere blastomere
definition: Abnormality of blastomere D2.1.1.
has_exact_synonym: abnormality of blastomere D2.1.1

abnormal cementoblast
type: Class
subclass of: abnormal cell
definition: Abnormality of cementoblast.
has_exact_synonym: abnormality of cementoblast

abnormal blastomere V1.2.1
type: Class
subclass of: abnormal ventral animal hemisphere blastomere
definition: Abnormality of blastomere V1.2.1.
has_exact_synonym: abnormality of blastomere V1.2.1

abnormal oral epithelium
type: Class
subclass of: abnormal epithelium
subclass of: abnormal mouth
definition: Abnormality of oral epithelium.
has_exact_synonym: abnormality of oral epithelium

abnormal pharyngeal epithelium
type: Class
subclass of: abnormal unilaminar epithelium
definition: Abnormality of pharyngeal epithelium.
has_exact_synonym: abnormality of pharyngeal epithelium

abnormal postcaval vein
type: Class
subclass of: abnormal vein
subclass of: abnormal trunk vasculature
definition: Abnormality of postcaval vein.
has_exact_synonym: abnormality of postcaval vein

abnormal retinal outer nuclear layer
type: Class
subclass of: abnormal tissue
subclass of: abnormal retinal neural layer
definition: Abnormality of retinal outer nuclear layer.
has_exact_synonym: abnormality of retinal outer nuclear layer

abnormal left spleen primordium
type: Class
subclass of: abnormal multi-tissue structure
subclass of: abnormal immune system
definition: Abnormality of left spleen primordium.
has_exact_synonym: abnormality of left spleen primordium

abnormal barrier epithelial cell
type: Class
subclass of: abnormal cell
definition: Abnormality of barrier epithelial cell.
has_exact_synonym: abnormality of barrier epithelial cell

abnormal olfactory pit
type: Class
subclass of: abnormal anatomical space
subclass of: abnormal olfactory system
definition: Abnormality of olfactory pit.
has_exact_synonym: abnormality of olfactory pit

abnormal vagus nerve
type: Class
subclass of: abnormal cranial nerve
subclass of: abnormal gustatory system
definition: Abnormality of vagus nerve.
has_exact_synonym: abnormality of vagus nerve

abnormal medial ganglionic eminence
type: Class
subclass of: abnormal tissue
subclass of: abnormal subpallium
definition: Abnormality of medial ganglionic eminence.
has_exact_synonym: abnormality of medial ganglionic eminence

abnormal posterior-proximal mesenchyme
type: Class
subclass of: abnormal mesenchyme
subclass of: abnormal limb bud
definition: Abnormality of posterior-proximal mesenchyme.
has_exact_synonym: abnormality of posterior-proximal mesenchyme

abnormal rhombomere R1
type: Class
subclass of: abnormal rhombomere
definition: Abnormality of rhombomere R1.
has_exact_synonym: abnormality of rhombomere R1

abnormal myotome of trunk somite 10
type: Class
subclass of: abnormal myotome
definition: Abnormality of myotome of trunk somite 10.
has_exact_synonym: abnormality of myotome of trunk somite 10

abnormal lateral forebrain bundle
type: Class
subclass of: abnormal anatomical cluster
subclass of: abnormal forebrain
definition: Abnormality of lateral forebrain bundle.
has_exact_synonym: abnormality of lateral forebrain bundle

abnormal involuting marginal zone mesenchymal layer
type: Class
subclass of: abnormal tissue
subclass of: abnormal involuting marginal zone
definition: Abnormality of involuting marginal zone mesenchymal layer.
has_exact_synonym: abnormality of involuting marginal zone mesenchymal layer

abnormal trachea
type: Class
subclass of: abnormal cavitated compound organ
subclass of: abnormal respiratory system
definition: Abnormality of trachea.
has_exact_synonym: abnormality of trachea

abnormal myotome of trunk somite 5
type: Class
subclass of: abnormal myotome
definition: Abnormality of myotome of trunk somite 5.
has_exact_synonym: abnormality of myotome of trunk somite 5

abnormal saccular macula
type: Class
subclass of: abnormal tissue
subclass of: abnormal inner ear
definition: Abnormality of saccular macula.
has_exact_synonym: abnormality of saccular macula

abnormal ascending interneuron
type: Class
subclass of: abnormal interneuron
definition: Abnormality of ascending interneuron.
has_exact_synonym: abnormality of ascending interneuron

abnormal prosomere 6
type: Class
subclass of: abnormal telencephalon
subclass of: abnormal prosomere
definition: Abnormality of prosomere 6.
has_exact_synonym: abnormality of prosomere 6

abnormal hindlimb region
type: Class
subclass of: XPO_0141315
definition: Abnormality of hindlimb region.
has_exact_synonym: abnormality of hindlimb region

abnormal perichordal tissue
type: Class
subclass of: abnormal connective tissue
subclass of: abnormal notochord
definition: Abnormality of perichordal tissue.
has_exact_synonym: abnormality of perichordal tissue

abnormal trunk region
type: Class
subclass of: XPO_0141315
definition: Abnormality of trunk region.
has_exact_synonym: abnormality of trunk region

abnormal blastomere D2.1.2
type: Class
subclass of: abnormal dorsal vegetal hemisphere blastomere
definition: Abnormality of blastomere D2.1.2.
has_exact_synonym: abnormality of blastomere D2.1.2

abnormal dorsal habenular nucleus
type: Class
subclass of: abnormal neural nucleus
subclass of: abnormal habenula
definition: Abnormality of dorsal habenular nucleus.
has_exact_synonym: abnormality of dorsal habenular nucleus

abnormal fourth ventricle
type: Class
subclass of: abnormal hindbrain
subclass of: abnormal brain ventricle
definition: Abnormality of fourth ventricle.
has_exact_synonym: abnormality of fourth ventricle

abnormal branchial arch skeleton 3
type: Class
subclass of: abnormal branchial arch 3
subclass of: abnormal branchial arch skeleton
definition: Abnormality of branchial arch skeleton 3.
has_exact_synonym: abnormality of branchial arch skeleton 3

abnormal eminentia thalami
type: Class
subclass of: abnormal diencephalon
definition: Abnormality of eminentia thalami.
has_exact_synonym: abnormality of eminentia thalami

abnormal left omphalomesenteric vein
type: Class
subclass of: abnormal omphalomesenteric vein
definition: Abnormality of left omphalomesenteric vein.
has_exact_synonym: abnormality of left omphalomesenteric vein

abnormal exocrine pancreas
type: Class
subclass of: abnormal multi-tissue structure
subclass of: abnormal pancreas
definition: Abnormality of exocrine pancreas.
has_exact_synonym: abnormality of exocrine pancreas

abnormal m. intermandibularis
type: Class
subclass of: abnormal mandibular head muscle
definition: Abnormality of m. intermandibularis.
has_exact_synonym: abnormality of m. intermandibularis

abnormal endothelial cell
type: Class
subclass of: abnormal cell
subclass of: abnormal vascular endothelium
definition: Abnormality of endothelial cell.
has_exact_synonym: abnormality of endothelial cell

abnormal hyaloid artery
type: Class
subclass of: abnormal hyaloid blood vessel
definition: Abnormality of hyaloid artery.
has_exact_synonym: abnormality of hyaloid artery

abnormal interstitial cell of Leydig
type: Class
subclass of: abnormal testis
subclass of: abnormal stromal cell
definition: Abnormality of interstitial cell of Leydig.
has_exact_synonym: abnormality of interstitial cell of Leydig

abnormal musculoabdominal vein
type: Class
subclass of: abnormal vein
subclass of: abnormal trunk vasculature
definition: Abnormality of musculoabdominal vein.
has_exact_synonym: abnormality of musculoabdominal vein

abnormal vegetal cortex
type: Class
subclass of: abnormal oocyte cortex
definition: Abnormality of vegetal cortex.
has_exact_synonym: abnormality of vegetal cortex

abnormal infraorbital lateral line
type: Class
subclass of: abnormal lateral line
definition: Abnormality of infraorbital lateral line.
has_exact_synonym: abnormality of infraorbital lateral line

abnormal optic fiber layer
type: Class
subclass of: abnormal tissue
subclass of: abnormal retinal neural layer
definition: Abnormality of optic fiber layer.
has_exact_synonym: abnormality of optic fiber layer

abnormal larval intestinal epithelium
type: Class
subclass of: abnormal intestine
subclass of: abnormal simple columnar epithelium
subclass of: abnormal gut epithelium
definition: Abnormality of larval intestinal epithelium.
has_exact_synonym: abnormality of larval intestinal epithelium

abnormal morula cell
type: Class
subclass of: abnormal early embryonic cell
definition: Abnormality of morula cell.
has_exact_synonym: abnormality of morula cell

abnormal vestibular apparatus
type: Class
subclass of: abnormal multi-tissue structure
subclass of: abnormal inner ear
definition: Abnormality of vestibular apparatus.
has_exact_synonym: abnormality of vestibular apparatus

abnormal regenerating eye
type: Class
subclass of: abnormal blastema
definition: Abnormality of regenerating eye.
has_exact_synonym: abnormality of regenerating eye

abnormal nasociliary artery
type: Class
subclass of: abnormal head vasculature
subclass of: abnormal artery
definition: Abnormality of nasociliary artery.
has_exact_synonym: abnormality of nasociliary artery

abnormal floor plate
type: Class
subclass of: abnormal multi-tissue structure
subclass of: abnormal spinal cord
definition: Abnormality of floor plate.
has_exact_synonym: abnormality of floor plate

abnormal facial vein
type: Class
subclass of: abnormal vein
subclass of: abnormal head vasculature
definition: Abnormality of facial vein.
has_exact_synonym: abnormality of facial vein

abnormal seminiferous tubule
type: Class
subclass of: abnormal tissue
subclass of: abnormal testis
definition: Abnormality of seminiferous tubule.
has_exact_synonym: abnormality of seminiferous tubule

abnormal oxygen accumulating cell
type: Class
subclass of: abnormal cell
definition: Abnormality of oxygen accumulating cell.
has_exact_synonym: abnormality of oxygen accumulating cell

abnormal migratory neural crest cell
type: Class
subclass of: abnormal cell
subclass of: abnormal neural crest
definition: Abnormality of migratory neural crest cell.
has_exact_synonym: abnormality of migratory neural crest cell

abnormal spike
type: Class
subclass of: abnormal regenerating limb
definition: Abnormality of spike.
has_exact_synonym: abnormality of spike

abnormal iliac process
type: Class
subclass of: abnormal process
subclass of: abnormal ilium
definition: Abnormality of iliac process.
has_exact_synonym: abnormality of iliac process

abnormal manicotto glandulare
type: Class
subclass of: abnormal multi-tissue structure
subclass of: abnormal alimentary system
definition: Abnormality of manicotto glandulare.
has_exact_synonym: abnormality of manicotto glandulare

abnormal blastomere D1
type: Class
subclass of: abnormal blastomere
definition: Abnormality of blastomere D1.
has_exact_synonym: abnormality of blastomere D1

abnormal mm. constrictores branchiales II
type: Class
subclass of: abnormal branchial head muscle
definition: Abnormality of mm. constrictores branchiales II.
has_exact_synonym: abnormality of mm. constrictores branchiales II

abnormal fibrocartilage
type: Class
subclass of: abnormal cartilage tissue
definition: Abnormality of fibrocartilage.
has_exact_synonym: abnormality of fibrocartilage

abnormal ventral foregut
type: Class
subclass of: abnormal foregut
definition: Abnormality of ventral foregut.
has_exact_synonym: abnormality of ventral foregut

abnormal chordoneural hinge
type: Class
subclass of: abnormal tail tip
subclass of: abnormal neural tube
subclass of: abnormal tail bud
definition: Abnormality of chordoneural hinge.
has_exact_synonym: abnormality of chordoneural hinge

abnormal anterior semicircular canal
type: Class
subclass of: abnormal semicircular canal
definition: Abnormality of anterior semicircular canal.
has_exact_synonym: abnormality of anterior semicircular canal

abnormal posterior tectum
type: Class
subclass of: abnormal optic tectum
definition: Abnormality of posterior tectum.
has_exact_synonym: abnormality of posterior tectum

abnormal myotome of trunk somite 9
type: Class
subclass of: abnormal myotome
definition: Abnormality of myotome of trunk somite 9.
has_exact_synonym: abnormality of myotome of trunk somite 9

abnormal gall bladder
type: Class
subclass of: abnormal foregut
subclass of: abnormal compound organ
subclass of: abnormal viscus
subclass of: abnormal liver and biliary system
definition: Abnormality of gall bladder.
has_exact_synonym: abnormality of gall bladder

abnormal melanophore
type: Class
subclass of: abnormal pigment cell
definition: Abnormality of melanophore.
has_exact_synonym: abnormality of melanophore

abnormal wedge region
type: Class
subclass of: abnormal oocyte
subclass of: abnormal cell part
definition: Abnormality of wedge region.
has_exact_synonym: abnormality of wedge region

abnormal ciliary body
type: Class
subclass of: abnormal eye
subclass of: abnormal uveal tract
definition: Abnormality of ciliary body.
has_exact_synonym: abnormality of ciliary body

abnormal sclerotome of trunk somite 4
type: Class
subclass of: abnormal sclerotome
definition: Abnormality of sclerotome of trunk somite 4.
has_exact_synonym: abnormality of sclerotome of trunk somite 4

abnormal sinus venosus
type: Class
subclass of: abnormal multi-tissue structure
subclass of: abnormal heart
definition: Abnormality of sinus venosus.
has_exact_synonym: abnormality of sinus venosus

abnormal dorsolateral neural tube
type: Class
subclass of: abnormal neural tube
definition: Abnormality of dorsolateral neural tube.
has_exact_synonym: abnormality of dorsolateral neural tube

abnormal parotic crest
type: Class
subclass of: abnormal cartilage element
subclass of: abnormal chondrocranium
definition: Abnormality of parotic crest.
has_exact_synonym: abnormality of parotic crest

abnormal m. geniohyoideus
type: Class
subclass of: abnormal hypobranchial head muscle
definition: Abnormality of m. geniohyoideus.
has_exact_synonym: abnormality of m. geniohyoideus

abnormal apical epithelial cap
type: Class
subclass of: abnormal blastema
definition: Abnormality of apical epithelial cap.
has_exact_synonym: abnormality of apical epithelial cap

abnormal vegetal part, early involuting
type: Class
subclass of: abnormal tissue
subclass of: abnormal involuting marginal zone
definition: Abnormality of vegetal part, early involuting.
has_exact_synonym: abnormality of vegetal part, early involuting

abnormal non-mineralized avascular GAG-rich matrix
type: Class
subclass of: abnormal avascular GAG-rich matrix
subclass of: abnormal non-mineralized cartilage tissue
definition: Abnormality of non-mineralized avascular GAG-rich matrix.
has_exact_synonym: abnormality of non-mineralized avascular GAG-rich matrix

abnormal regenerating zeugopod skeleton
type: Class
subclass of: abnormal regenerating limb
definition: Abnormality of regenerating zeugopod skeleton.
has_exact_synonym: abnormality of regenerating zeugopod skeleton

abnormal spiral septum
type: Class
subclass of: abnormal ventricular outflow tract
subclass of: XPO_0141715
definition: Abnormality of spiral septum.
has_exact_synonym: abnormality of spiral septum

abnormal neural groove
type: Class
subclass of: abnormal neural plate
definition: Abnormality of neural groove.
has_exact_synonym: abnormality of neural groove

abnormal oropharyngeal papilla
type: Class
subclass of: abnormal odontogenic papilla
definition: Abnormality of oropharyngeal papilla.
has_exact_synonym: abnormality of oropharyngeal papilla

abnormal basal lamina
type: Class
subclass of: abnormal epithelium
subclass of: abnormal acellular anatomical structure
definition: Abnormality of basal lamina.
has_exact_synonym: abnormality of basal lamina

abnormal m. interhyoideus
type: Class
subclass of: abnormal hyoid head muscle
definition: Abnormality of m. interhyoideus.
has_exact_synonym: abnormality of m. interhyoideus

abnormal ring structure
type: Class
subclass of: abnormal oocyte
subclass of: abnormal cell part
definition: Abnormality of ring structure.
has_exact_synonym: abnormality of ring structure

abnormal cleavage furrow
type: Class
subclass of: abnormal embryonic structure
definition: Abnormality of cleavage furrow.
has_exact_synonym: abnormality of cleavage furrow

abnormal enamel
type: Class
subclass of: abnormal odontoid tissue
definition: Abnormality of enamel.
has_exact_synonym: abnormality of enamel

abnormal nucleus of the diagonal band
type: Class
subclass of: abnormal neural nucleus
subclass of: abnormal basal forebrain
definition: Abnormality of nucleus of the diagonal band.
has_exact_synonym: abnormality of nucleus of the diagonal band

abnormal perivitelline space
type: Class
subclass of: abnormal zygote
subclass of: abnormal extraembryonic structure
definition: Abnormality of perivitelline space.
has_exact_synonym: abnormality of perivitelline space

abnormal ceratobranchial IV
type: Class
subclass of: abnormal cartilage element
subclass of: abnormal chondrocranium
definition: Abnormality of ceratobranchial IV.
has_exact_synonym: abnormality of ceratobranchial IV

abnormal marginal zone (sensu neural)
type: Class
subclass of: XPO_0141315
definition: Abnormality of marginal zone (sensu neural).
has_exact_synonym: abnormality of marginal zone (sensu neural)

abnormal claw of hindlimb digit 4
type: Class
subclass of: abnormal claw
subclass of: abnormal hindlimb digit 4
definition: Abnormality of claw of hindlimb digit 4.
has_exact_synonym: abnormality of claw of hindlimb digit 4

abnormal animal cap outer layer
type: Class
subclass of: abnormal animal cap
definition: Abnormality of animal cap outer layer.
has_exact_synonym: abnormality of animal cap outer layer

abnormal myotome of head somite 3
type: Class
subclass of: abnormal myotome
definition: Abnormality of myotome of head somite 3.
has_exact_synonym: abnormality of myotome of head somite 3

abnormal cornea
type: Class
subclass of: abnormal surface structure
subclass of: abnormal eye
definition: Abnormality of cornea.
has_exact_synonym: abnormality of cornea

abnormal podocyte
type: Class
subclass of: abnormal cell
subclass of: abnormal glomus
definition: Abnormality of podocyte.
has_exact_synonym: abnormality of podocyte

abnormal m. levator scapulae superior
type: Class
subclass of: abnormal cranial muscle
definition: Abnormality of m. levator scapulae superior.
has_exact_synonym: abnormality of m. levator scapulae superior

abnormal median fin
type: Class
subclass of: abnormal fin
definition: Abnormality of median fin.
has_exact_synonym: abnormality of median fin

abnormal magnocellular preoptic nucleus
type: Class
subclass of: abnormal neural nucleus
subclass of: abnormal preoptic area
definition: Abnormality of magnocellular preoptic nucleus.
has_exact_synonym: abnormality of magnocellular preoptic nucleus

abnormal oculomotor nerve
type: Class
subclass of: abnormal cranial nerve
definition: Abnormality of oculomotor nerve.
has_exact_synonym: abnormality of oculomotor nerve

abnormal myotome of tail somite 15
type: Class
subclass of: abnormal myotome
definition: Abnormality of myotome of tail somite 15.
has_exact_synonym: abnormality of myotome of tail somite 15

abnormal posterodorsal tegmental nucleus
type: Class
subclass of: abnormal neural nucleus
subclass of: abnormal midbrain tegmentum
definition: Abnormality of posterodorsal tegmental nucleus.
has_exact_synonym: abnormality of posterodorsal tegmental nucleus

abnormal coelomic epithelium
type: Class
subclass of: abnormal epithelium
definition: Abnormality of coelomic epithelium.
has_exact_synonym: abnormality of coelomic epithelium

abnormal medial amygdala
type: Class
subclass of: abnormal neural nucleus
subclass of: abnormal amygdala
definition: Abnormality of medial amygdala.
has_exact_synonym: abnormality of medial amygdala

abnormal dorsal funiculus
type: Class
subclass of: abnormal anatomical cluster
subclass of: abnormal spinal cord
definition: Abnormality of dorsal funiculus.
has_exact_synonym: abnormality of dorsal funiculus

abnormal ampullary nerve
type: Class
subclass of: abnormal vestibulocochlear nerve
definition: Abnormality of ampullary nerve.
has_exact_synonym: abnormality of ampullary nerve

abnormal processus anterior hyalis
type: Class
subclass of: abnormal cartilage element
subclass of: abnormal chondrocranium
definition: Abnormality of processus anterior hyalis.
has_exact_synonym: abnormality of processus anterior hyalis

abnormal glomerular mesangial cell
type: Class
subclass of: abnormal glomus
subclass of: abnormal pericyte
definition: Abnormality of glomerular mesangial cell.
has_exact_synonym: abnormality of glomerular mesangial cell

abnormal myotome of trunk somite 13
type: Class
subclass of: abnormal myotome
definition: Abnormality of myotome of trunk somite 13.
has_exact_synonym: abnormality of myotome of trunk somite 13

abnormal ischiadic artery
type: Class
subclass of: abnormal artery
definition: Abnormality of ischiadic artery.
has_exact_synonym: abnormality of ischiadic artery

abnormal dorsal crest of the endoderm
type: Class
subclass of: abnormal endoderm
definition: Abnormality of dorsal crest of the endoderm.
has_exact_synonym: abnormality of dorsal crest of the endoderm

abnormal paracrine cell
type: Class
subclass of: abnormal cell
definition: Abnormality of paracrine cell.
has_exact_synonym: abnormality of paracrine cell

abnormal ventrolateral edge of myotome
type: Class
subclass of: abnormal myotome
definition: Abnormality of ventrolateral edge of myotome.
has_exact_synonym: abnormality of ventrolateral edge of myotome

abnormal left-right organizer
type: Class
subclass of: abnormal gastrocoel roof plate
subclass of: XPO_0141315
definition: Abnormality of left-right organizer.
has_exact_synonym: abnormality of left-right organizer

abnormal tarsus
type: Class
subclass of: abnormal bone element
subclass of: abnormal hindlimb skeleton
subclass of: abnormal foot
definition: Abnormality of tarsus.
has_exact_synonym: abnormality of tarsus

abnormal interdigital webbing
type: Class
subclass of: abnormal tissue
subclass of: abnormal autopod
subclass of: abnormal interdigital region
definition: Abnormality of interdigital webbing.
has_exact_synonym: abnormality of interdigital webbing

abnormal rhombomere R8
type: Class
subclass of: abnormal rhombomere
definition: Abnormality of rhombomere R8.
has_exact_synonym: abnormality of rhombomere R8

abnormal subthalamic nucleus
type: Class
subclass of: abnormal neural nucleus
subclass of: abnormal basal ganglion
subclass of: abnormal prethalamus
definition: Abnormality of subthalamic nucleus.
has_exact_synonym: abnormality of subthalamic nucleus

abnormal forebrain-midbrain boundary
type: Class
subclass of: abnormal neural plate
subclass of: abnormal brain
subclass of: abnormal anatomical line
definition: Abnormality of forebrain-midbrain boundary.
has_exact_synonym: abnormality of forebrain-midbrain boundary

abnormal sclerotome of trunk somite 10
type: Class
subclass of: abnormal sclerotome
definition: Abnormality of sclerotome of trunk somite 10.
has_exact_synonym: abnormality of sclerotome of trunk somite 10

abnormal transverse process
type: Class
subclass of: abnormal vertebra
subclass of: abnormal process
definition: Abnormality of transverse process.
has_exact_synonym: abnormality of transverse process

abnormal m. quadrato-hyoangularis
type: Class
subclass of: abnormal hyoid head muscle
definition: Abnormality of m. quadrato-hyoangularis.
has_exact_synonym: abnormality of m. quadrato-hyoangularis

abnormal myelin accumulating cell
type: Class
subclass of: abnormal cell
definition: Abnormality of myelin accumulating cell.
has_exact_synonym: abnormality of myelin accumulating cell

abnormal pericardial muscle
type: Class
subclass of: abnormal heart
subclass of: abnormal muscle
definition: Abnormality of pericardial muscle.
has_exact_synonym: abnormality of pericardial muscle

abnormal myeloid cell
type: Class
subclass of: abnormal cell
subclass of: abnormal hematological system
definition: Abnormality of myeloid cell.
has_exact_synonym: abnormality of myeloid cell

abnormal dorsal lymph space
type: Class
subclass of: abnormal anatomical space
subclass of: abnormal lymphatic system
definition: Abnormality of dorsal lymph space.
has_exact_synonym: abnormality of dorsal lymph space

abnormal blastomere V1.1.1
type: Class
subclass of: abnormal ventral animal hemisphere blastomere
definition: Abnormality of blastomere V1.1.1.
has_exact_synonym: abnormality of blastomere V1.1.1

abnormal ceratobranchial I
type: Class
subclass of: abnormal cartilage element
subclass of: abnormal chondrocranium
definition: Abnormality of ceratobranchial I.
has_exact_synonym: abnormality of ceratobranchial I

abnormal amacrine cell
type: Class
subclass of: abnormal interneuron
subclass of: abnormal retinal neural layer
definition: Abnormality of amacrine cell.
has_exact_synonym: abnormality of amacrine cell

abnormal m. orbitohyoideus
type: Class
subclass of: abnormal hyoid head muscle
definition: Abnormality of m. orbitohyoideus.
has_exact_synonym: abnormality of m. orbitohyoideus

abnormal capillary system of liver
type: Class
subclass of: abnormal capillary
subclass of: abnormal liver
definition: Abnormality of capillary system of liver.
has_exact_synonym: abnormality of capillary system of liver

abnormal jaw muscle
type: Class
subclass of: abnormal cranial muscle
definition: Abnormality of jaw muscle.
has_exact_synonym: abnormality of jaw muscle

abnormal vestibulocochlear ganglion
type: Class
subclass of: abnormal ganglion
subclass of: abnormal vestibulocochlear nerve
definition: Abnormality of vestibulocochlear ganglion.
has_exact_synonym: abnormality of vestibulocochlear ganglion

abnormal arteria iliaca communis
type: Class
subclass of: abnormal artery
subclass of: abnormal trunk vasculature
definition: Abnormality of arteria iliaca communis.
has_exact_synonym: abnormality of arteria iliaca communis

abnormal fibrocellular pad
type: Class
subclass of: abnormal blastema
definition: Abnormality of fibrocellular pad.
has_exact_synonym: abnormality of fibrocellular pad

abnormal sperm entry point
type: Class
subclass of: abnormal cell part
subclass of: abnormal zygote
definition: Abnormality of sperm entry point.
has_exact_synonym: abnormality of sperm entry point

abnormal outer fin
type: Class
subclass of: abnormal fin
definition: Abnormality of outer fin.
has_exact_synonym: abnormality of outer fin

abnormal right-ventral blastomere
type: Class
subclass of: abnormal blastomere
definition: Abnormality of right-ventral blastomere.
has_exact_synonym: abnormality of right-ventral blastomere

abnormal oral cavity
type: Class
subclass of: abnormal alimentary system
subclass of: abnormal mouth
definition: Abnormality of oral cavity.
has_exact_synonym: abnormality of oral cavity

abnormal sclerotome of tail somite 16
type: Class
subclass of: abnormal sclerotome
definition: Abnormality of sclerotome of tail somite 16.
has_exact_synonym: abnormality of sclerotome of tail somite 16

abnormal secondary myofiber
type: Class
subclass of: abnormal cell
subclass of: abnormal muscle
definition: Abnormality of secondary myofiber.
has_exact_synonym: abnormality of secondary myofiber

abnormal alkali secreting cell
type: Class
subclass of: abnormal cell
definition: Abnormality of alkali secreting cell.
has_exact_synonym: abnormality of alkali secreting cell

abnormal stage I oocyte
type: Class
subclass of: abnormal oocyte
definition: Abnormality of stage I oocyte.
has_exact_synonym: abnormality of stage I oocyte

abnormal medial nasal prominence
type: Class
subclass of: abnormal head
subclass of: abnormal embryonic structure
definition: Abnormality of medial nasal prominence.
has_exact_synonym: abnormality of medial nasal prominence

abnormal anterior amygdala
type: Class
subclass of: abnormal neural nucleus
subclass of: abnormal amygdala
definition: Abnormality of anterior amygdala.
has_exact_synonym: abnormality of anterior amygdala

abnormal rectum
type: Class
subclass of: abnormal large intestine
definition: Abnormality of rectum.
has_exact_synonym: abnormality of rectum

abnormal zygote cortex
type: Class
subclass of: abnormal cell part
subclass of: abnormal zygote
definition: Abnormality of zygote cortex.
has_exact_synonym: abnormality of zygote cortex

abnormal pars media of the stapes
type: Class
subclass of: abnormal stapes
definition: Abnormality of pars media of the stapes.
has_exact_synonym: abnormality of pars media of the stapes

abnormal aortic arch 5
type: Class
subclass of: abnormal aortic arch
definition: Abnormality of aortic arch 5.
has_exact_synonym: abnormality of aortic arch 5

abnormal ventral septum
type: Class
subclass of: abnormal telencephalon septum
definition: Abnormality of ventral septum.
has_exact_synonym: abnormality of ventral septum

abnormal vegetal endoderm
type: Class
subclass of: abnormal endoderm
subclass of: abnormal embryonic structure
definition: Abnormality of vegetal endoderm.
has_exact_synonym: abnormality of vegetal endoderm

abnormal ventral fin vasculature
type: Class
subclass of: abnormal fin vasculature
definition: Abnormality of ventral fin vasculature.
has_exact_synonym: abnormality of ventral fin vasculature

abnormal lens fiber cell mass
type: Class
subclass of: abnormal tissue
subclass of: abnormal lens
definition: Abnormality of lens fiber cell mass.
has_exact_synonym: abnormality of lens fiber cell mass

abnormal urostyle
type: Class
subclass of: abnormal bone element
subclass of: abnormal postcranial axial skeleton
definition: Abnormality of urostyle.
has_exact_synonym: abnormality of urostyle

abnormal stage V oocyte
type: Class
subclass of: abnormal oocyte
definition: Abnormality of stage V oocyte.
has_exact_synonym: abnormality of stage V oocyte

abnormal skeletal muscle satellite cell
type: Class
subclass of: abnormal cell
subclass of: abnormal skeletal muscle
definition: Abnormality of skeletal muscle satellite cell.
has_exact_synonym: abnormality of skeletal muscle satellite cell

abnormal sclerotome of tail somite 18
type: Class
subclass of: abnormal sclerotome
definition: Abnormality of sclerotome of tail somite 18.
has_exact_synonym: abnormality of sclerotome of tail somite 18

abnormal nostril
type: Class
subclass of: abnormal head
subclass of: abnormal anatomical space
definition: Abnormality of nostril.
has_exact_synonym: abnormality of nostril

abnormal bone marrow
type: Class
subclass of: abnormal tissue
subclass of: abnormal hematological system
definition: Abnormality of bone marrow.
has_exact_synonym: abnormality of bone marrow

abnormal descending interneuron
type: Class
subclass of: abnormal interneuron
definition: Abnormality of descending interneuron.
has_exact_synonym: abnormality of descending interneuron

abnormal epigastric artery
type: Class
subclass of: abnormal artery
subclass of: abnormal trunk vasculature
definition: Abnormality of epigastric artery.
has_exact_synonym: abnormality of epigastric artery

abnormal sclerotome of trunk somite 8
type: Class
subclass of: abnormal sclerotome
definition: Abnormality of sclerotome of trunk somite 8.
has_exact_synonym: abnormality of sclerotome of trunk somite 8

abnormal mesonephric late proximal tubule
type: Class
subclass of: abnormal mesonephric tubule
definition: Abnormality of mesonephric late proximal tubule.
has_exact_synonym: abnormality of mesonephric late proximal tubule

abnormal ectodermal cell
type: Class
subclass of: abnormal cell
subclass of: abnormal ectoderm
definition: Abnormality of ectodermal cell.
has_exact_synonym: abnormality of ectodermal cell

abnormal atrial septum
type: Class
subclass of: abnormal heart
subclass of: XPO_0141715
definition: Abnormality of atrial septum.
has_exact_synonym: abnormality of atrial septum

abnormal fat body
type: Class
subclass of: abnormal adipose tissue
definition: Abnormality of fat body.
has_exact_synonym: abnormality of fat body

abnormal blastomere D1.2.1
type: Class
subclass of: abnormal dorsal animal hemisphere blastomere
definition: Abnormality of blastomere D1.2.1.
has_exact_synonym: abnormality of blastomere D1.2.1

abnormal torus semicircularis
type: Class
subclass of: abnormal midbrain
definition: Abnormality of torus semicircularis.
has_exact_synonym: abnormality of torus semicircularis

abnormal subcommissural organ
type: Class
subclass of: abnormal pretectum
definition: Abnormality of subcommissural organ.
has_exact_synonym: abnormality of subcommissural organ

abnormal ciliary axoneme
type: Class
subclass of: abnormal cilium
definition: Abnormality of ciliary axoneme.
has_exact_synonym: abnormality of ciliary axoneme

abnormal stage II oocyte
type: Class
subclass of: abnormal oocyte
definition: Abnormality of stage II oocyte.
has_exact_synonym: abnormality of stage II oocyte

abnormal anterior-proximal mesenchyme
type: Class
subclass of: abnormal mesenchyme
subclass of: abnormal limb bud
definition: Abnormality of anterior-proximal mesenchyme.
has_exact_synonym: abnormality of anterior-proximal mesenchyme

abnormal endodermal cell
type: Class
subclass of: abnormal cell
subclass of: abnormal endoderm
definition: Abnormality of endodermal cell.
has_exact_synonym: abnormality of endodermal cell

abnormal parabrachial area
type: Class
subclass of: abnormal neural nucleus
definition: Abnormality of parabrachial area.
has_exact_synonym: abnormality of parabrachial area

abnormal sclerotome of trunk somite 12
type: Class
subclass of: abnormal sclerotome
definition: Abnormality of sclerotome of trunk somite 12.
has_exact_synonym: abnormality of sclerotome of trunk somite 12

abnormal organ cortex
type: Class
subclass of: abnormal multi-tissue structure
definition: Abnormality of organ cortex.
has_exact_synonym: abnormality of organ cortex

abnormal blastomere D2.2.1
type: Class
subclass of: abnormal dorsal vegetal hemisphere blastomere
definition: Abnormality of blastomere D2.2.1.
has_exact_synonym: abnormality of blastomere D2.2.1

abnormal processus posterior hyalis
type: Class
subclass of: abnormal cartilage element
subclass of: abnormal chondrocranium
definition: Abnormality of processus posterior hyalis.
has_exact_synonym: abnormality of processus posterior hyalis

abnormal upper jaw
type: Class
subclass of: abnormal cranium
definition: Abnormality of upper jaw.
has_exact_synonym: abnormality of upper jaw

abnormal femoral vein
type: Class
subclass of: abnormal vein
subclass of: abnormal hindlimb stylopod
definition: Abnormality of femoral vein.
has_exact_synonym: abnormality of femoral vein

abnormal endolymphatic duct
type: Class
subclass of: abnormal duct
subclass of: abnormal inner ear
definition: Abnormality of endolymphatic duct.
has_exact_synonym: abnormality of endolymphatic duct

abnormal optic nerve
type: Class
subclass of: abnormal cranial nerve
subclass of: abnormal eye
definition: Abnormality of optic nerve.
has_exact_synonym: abnormality of optic nerve

abnormal myocoelic slit
type: Class
subclass of: abnormal anatomical space
subclass of: abnormal myotome
definition: Abnormality of myocoelic slit.
has_exact_synonym: abnormality of myocoelic slit

abnormal lateral funiculus
type: Class
subclass of: abnormal anatomical cluster
subclass of: abnormal spinal cord
definition: Abnormality of lateral funiculus.
has_exact_synonym: abnormality of lateral funiculus

abnormal basal body
type: Class
subclass of: abnormal cell part
definition: Abnormality of basal body.
has_exact_synonym: abnormality of basal body

abnormal dendrite
type: Class
subclass of: XPO_0131654
definition: Abnormality of dendrite.
has_exact_synonym: abnormality of dendrite

abnormal neuromast mantle cell
type: Class
subclass of: abnormal cell
subclass of: abnormal skin
definition: Abnormality of neuromast mantle cell.
has_exact_synonym: abnormality of neuromast mantle cell

abnormal ventral fin margin
type: Class
subclass of: abnormal fin margin
subclass of: abnormal ventral tail fin
definition: Abnormality of ventral fin margin.
has_exact_synonym: abnormality of ventral fin margin

abnormal dorsal endoderm
type: Class
subclass of: abnormal embryonic structure
subclass of: abnormal gastrocoel roof plate
definition: Abnormality of dorsal endoderm.
has_exact_synonym: abnormality of dorsal endoderm

abnormal B cell
type: Class
subclass of: abnormal lymphocyte
definition: Abnormality of B cell.
has_exact_synonym: abnormality of B cell

abnormal hypobranchial placode
type: Class
subclass of: abnormal embryonic structure
definition: Abnormality of hypobranchial placode.
has_exact_synonym: abnormality of hypobranchial placode

abnormal otic region
type: Class
subclass of: abnormal cranium
definition: Abnormality of otic region.
has_exact_synonym: abnormality of otic region

abnormal ventral tegmentum
type: Class
subclass of: abnormal midbrain tegmentum
definition: Abnormality of ventral tegmentum.
has_exact_synonym: abnormality of ventral tegmentum

abnormal m. rectus posterior
type: Class
subclass of: abnormal eye muscle
definition: Abnormality of m. rectus posterior.
has_exact_synonym: abnormality of m. rectus posterior

abnormal bipolar neuron
type: Class
subclass of: abnormal interneuron
subclass of: abnormal retinal neural layer
definition: Abnormality of bipolar neuron.
has_exact_synonym: abnormality of bipolar neuron

abnormal ventral blood island border
type: Class
subclass of: abnormal blood vessel
subclass of: abnormal ventral blood island
definition: Abnormality of ventral blood island border.
has_exact_synonym: abnormality of ventral blood island border

abnormal posterior vena cava
type: Class
subclass of: abnormal vein
subclass of: abnormal trunk vasculature
definition: Abnormality of posterior vena cava.
has_exact_synonym: abnormality of posterior vena cava

abnormal infundibulum
type: Class
subclass of: abnormal diencephalon
definition: Abnormality of infundibulum.
has_exact_synonym: abnormality of infundibulum

abnormal pars externa of the stapes
type: Class
subclass of: abnormal stapes
definition: Abnormality of pars externa of the stapes.
has_exact_synonym: abnormality of pars externa of the stapes

abnormal choroid
type: Class
subclass of: abnormal eye
subclass of: abnormal uveal tract
definition: Abnormality of choroid.
has_exact_synonym: abnormality of choroid

abnormal skin mucous gland
type: Class
subclass of: abnormal skin gland
subclass of: abnormal mucous gland
definition: Abnormality of skin mucous gland.
has_exact_synonym: abnormality of skin mucous gland

abnormal laterodorsal tegmental nucleus
type: Class
subclass of: abnormal neural nucleus
subclass of: abnormal midbrain tegmentum
definition: Abnormality of laterodorsal tegmental nucleus.
has_exact_synonym: abnormality of laterodorsal tegmental nucleus

abnormal myotome of trunk somite 4
type: Class
subclass of: abnormal myotome
definition: Abnormality of myotome of trunk somite 4.
has_exact_synonym: abnormality of myotome of trunk somite 4

abnormal endomesoderm
type: Class
subclass of: abnormal primary germ layer
definition: Abnormality of endomesoderm.
has_exact_synonym: abnormality of endomesoderm

abnormal simple cuboidal epithelium
type: Class
subclass of: abnormal unilaminar epithelium
definition: Abnormality of simple cuboidal epithelium.
has_exact_synonym: abnormality of simple cuboidal epithelium

abnormal blastomere V2.1.1
type: Class
subclass of: abnormal ventral vegetal hemisphere blastomere
definition: Abnormality of blastomere V2.1.1.
has_exact_synonym: abnormality of blastomere V2.1.1

abnormal absorptive cell
type: Class
subclass of: abnormal cell
definition: Abnormality of absorptive cell.
has_exact_synonym: abnormality of absorptive cell

abnormal liver parenchyme
type: Class
subclass of: abnormal tissue
subclass of: abnormal liver
definition: Abnormality of liver parenchyme.
has_exact_synonym: abnormality of liver parenchyme

abnormal internal coil of the small intestine
type: Class
subclass of: abnormal small intestine
definition: Abnormality of internal coil of the small intestine.
has_exact_synonym: abnormality of internal coil of the small intestine

abnormal subintestinal vein
type: Class
subclass of: abnormal vein
subclass of: abnormal trunk vasculature
subclass of: abnormal tail vasculature
definition: Abnormality of subintestinal vein.
has_exact_synonym: abnormality of subintestinal vein

abnormal pyloric sphincter
type: Class
subclass of: abnormal pylorus
definition: Abnormality of pyloric sphincter.
has_exact_synonym: abnormality of pyloric sphincter

abnormal m. rectus anterior
type: Class
subclass of: abnormal eye muscle
definition: Abnormality of m. rectus anterior.
has_exact_synonym: abnormality of m. rectus anterior

abnormal olfactory nerve
type: Class
subclass of: abnormal cranial nerve
subclass of: abnormal olfactory system
definition: Abnormality of olfactory nerve.
has_exact_synonym: abnormality of olfactory nerve

abnormal sclerotome of trunk somite 5
type: Class
subclass of: abnormal sclerotome
definition: Abnormality of sclerotome of trunk somite 5.
has_exact_synonym: abnormality of sclerotome of trunk somite 5

abnormal external gill
type: Class
subclass of: abnormal surface structure
subclass of: abnormal respiratory system
definition: Abnormality of external gill.
has_exact_synonym: abnormality of external gill

abnormal fenestra basicranialis
type: Class
subclass of: abnormal chondrocranium
subclass of: abnormal anatomical space
definition: Abnormality of fenestra basicranialis.
has_exact_synonym: abnormality of fenestra basicranialis

abnormal commisura quadratocranialis anterior
type: Class
subclass of: abnormal cartilage element
subclass of: abnormal chondrocranium
definition: Abnormality of commisura quadratocranialis anterior.
has_exact_synonym: abnormality of commisura quadratocranialis anterior

abnormal dorsal pallium
type: Class
subclass of: abnormal pallium
definition: Abnormality of dorsal pallium.
has_exact_synonym: abnormality of dorsal pallium

abnormal lampbrush chromosome
type: Class
subclass of: abnormal cell part
definition: Abnormality of lampbrush chromosome.
has_exact_synonym: abnormality of lampbrush chromosome

abnormal pulmonary vein
type: Class
subclass of: abnormal vein
subclass of: abnormal trunk vasculature
definition: Abnormality of pulmonary vein.
has_exact_synonym: abnormality of pulmonary vein

abnormal dorsal column nucleus
type: Class
subclass of: abnormal neural nucleus
subclass of: abnormal medulla oblongata
definition: Abnormality of dorsal column nucleus.
has_exact_synonym: abnormality of dorsal column nucleus

abnormal pronephric sinus
type: Class
subclass of: abnormal pronephric kidney
definition: Abnormality of pronephric sinus.
has_exact_synonym: abnormality of pronephric sinus

abnormal m. levator mandibulae longus internus
type: Class
subclass of: abnormal mandibular head muscle
definition: Abnormality of m. levator mandibulae longus internus.
has_exact_synonym: abnormality of m. levator mandibulae longus internus

abnormal inner limiting membrane
type: Class
subclass of: abnormal tissue
subclass of: abnormal retinal neural layer
definition: Abnormality of inner limiting membrane.
has_exact_synonym: abnormality of inner limiting membrane

abnormal dental epithelium
type: Class
subclass of: abnormal epithelium
definition: Abnormality of dental epithelium.
has_exact_synonym: abnormality of dental epithelium

abnormal peripheral retina
type: Class
subclass of: abnormal retina
definition: Abnormality of peripheral retina.
has_exact_synonym: abnormality of peripheral retina

abnormal trochlear motornucleus
type: Class
subclass of: abnormal tissue
subclass of: abnormal midbrain
definition: Abnormality of trochlear motornucleus.
has_exact_synonym: abnormality of trochlear motornucleus

abnormal post-anal gut
type: Class
subclass of: abnormal archenteron
definition: Abnormality of post-anal gut.
has_exact_synonym: abnormality of post-anal gut

abnormal Jacobson's vein
type: Class
subclass of: abnormal vein
definition: Abnormality of Jacobson's vein.
has_exact_synonym: abnormality of Jacobson's vein

abnormal abdominal myoblast
type: Class
subclass of: abnormal myotome
subclass of: abnormal myoblast
subclass of: abnormal trunk musculature
definition: Abnormality of abdominal myoblast.
has_exact_synonym: abnormality of abdominal myoblast

abnormal claw of hindlimb digit 5
type: Class
subclass of: abnormal claw
subclass of: abnormal hindlimb digit 5
definition: Abnormality of claw of hindlimb digit 5.
has_exact_synonym: abnormality of claw of hindlimb digit 5

abnormal compound organ component
type: Class
subclass of: abnormal multi-tissue structure
subclass of: abnormal compound organ
definition: Abnormality of compound organ component.
has_exact_synonym: abnormality of compound organ component

abnormal adrenal cortex
type: Class
subclass of: abnormal tissue
subclass of: abnormal adrenal gland
definition: Abnormality of adrenal cortex.
has_exact_synonym: abnormality of adrenal cortex

abnormal appendicular ossicle
type: Class
subclass of: abnormal ossicle
subclass of: abnormal appendicular skeleton
definition: Abnormality of appendicular ossicle.
has_exact_synonym: abnormality of appendicular ossicle

abnormal epicardium
type: Class
subclass of: abnormal heart
subclass of: abnormal tissue
definition: Abnormality of epicardium.
has_exact_synonym: abnormality of epicardium

abnormal anterior thalamic nucleus
type: Class
subclass of: abnormal neural nucleus
subclass of: abnormal thalamus
definition: Abnormality of anterior thalamic nucleus.
has_exact_synonym: abnormality of anterior thalamic nucleus

abnormal mesonephric early distal tubule
type: Class
subclass of: abnormal mesonephric tubule
definition: Abnormality of mesonephric early distal tubule.
has_exact_synonym: abnormality of mesonephric early distal tubule

abnormal posterior lateral line
type: Class
subclass of: abnormal lateral line
definition: Abnormality of posterior lateral line.
has_exact_synonym: abnormality of posterior lateral line

abnormal tongue
type: Class
subclass of: abnormal head
subclass of: abnormal multi-tissue structure
definition: Abnormality of tongue.
has_exact_synonym: abnormality of tongue

abnormal prosomere 5
type: Class
subclass of: abnormal telencephalon
subclass of: abnormal prosomere
definition: Abnormality of prosomere 5.
has_exact_synonym: abnormality of prosomere 5

abnormal activin-induced ectoderm
type: Class
subclass of: abnormal anatomical entity in vitro
definition: Abnormality of activin-induced ectoderm.
has_exact_synonym: abnormality of activin-induced ectoderm

abnormal forelimb region
type: Class
subclass of: XPO_0141315
definition: Abnormality of forelimb region.
has_exact_synonym: abnormality of forelimb region

abnormal non-cililated epidermal cell
type: Class
subclass of: abnormal epidermal cell
definition: Abnormality of non-cililated epidermal cell.
has_exact_synonym: abnormality of non-cililated epidermal cell

abnormal ceratohyal
type: Class
subclass of: abnormal cartilage element
subclass of: abnormal hyoid arch
definition: Abnormality of ceratohyal.
has_exact_synonym: abnormality of ceratohyal

abnormal peripheral vegetal yolk mass
type: Class
subclass of: abnormal vegetal yolk mass
definition: Abnormality of peripheral vegetal yolk mass.
has_exact_synonym: abnormality of peripheral vegetal yolk mass

abnormal oligodendrocyte
type: Class
subclass of: abnormal brain
subclass of: abnormal spinal cord
subclass of: abnormal glial cell
definition: Abnormality of oligodendrocyte.
has_exact_synonym: abnormality of oligodendrocyte

abnormal vitelline membrane
type: Class
subclass of: abnormal zygote
subclass of: abnormal extraembryonic structure
definition: Abnormality of vitelline membrane.
has_exact_synonym: abnormality of vitelline membrane

abnormal blastomere V1.2.2
type: Class
subclass of: abnormal ventral animal hemisphere blastomere
definition: Abnormality of blastomere V1.2.2.
has_exact_synonym: abnormality of blastomere V1.2.2

abnormal notochordal epithelium
type: Class
subclass of: abnormal epithelium
definition: Abnormality of notochordal epithelium.
has_exact_synonym: abnormality of notochordal epithelium

abnormal pupil
type: Class
subclass of: abnormal anatomical space
subclass of: abnormal eye
definition: Abnormality of pupil.
has_exact_synonym: abnormality of pupil

abnormal urethra
type: Class
subclass of: abnormal multi-tissue structure
subclass of: abnormal urinary system
definition: Abnormality of urethra.
has_exact_synonym: abnormality of urethra

abnormal cutaneous magnus
type: Class
subclass of: abnormal vein
subclass of: abnormal trunk vasculature
definition: Abnormality of cutaneous magnus.
has_exact_synonym: abnormality of cutaneous magnus

abnormal mm. constrictores branchiales III
type: Class
subclass of: abnormal branchial head muscle
definition: Abnormality of mm. constrictores branchiales III.
has_exact_synonym: abnormality of mm. constrictores branchiales III

abnormal early proximal tubule
type: Class
subclass of: abnormal proximal tubule
definition: Abnormality of early proximal tubule.
has_exact_synonym: abnormality of early proximal tubule

abnormal truncus arteriosus
type: Class
subclass of: abnormal blood vessel
definition: Abnormality of truncus arteriosus.
has_exact_synonym: abnormality of truncus arteriosus

abnormal early distal tubule
type: Class
subclass of: abnormal distal tubule
definition: Abnormality of early distal tubule.
has_exact_synonym: abnormality of early distal tubule

abnormal dorsal longitudinal anastomosing vessel - right branch
type: Class
subclass of: abnormal dorsal longitudinal anastomosing vessel
definition: Abnormality of dorsal longitudinal anastomosing vessel - right branch.
has_exact_synonym: abnormality of dorsal longitudinal anastomosing vessel - right branch

abnormal joint
type: Class
subclass of: abnormal anatomical cluster
subclass of: abnormal articular system
subclass of: abnormal joint region
definition: Abnormality of joint.
has_exact_synonym: abnormality of joint

abnormal hemangioblast
type: Class
subclass of: abnormal cell
subclass of: abnormal hematological system
definition: Abnormality of hemangioblast.
has_exact_synonym: abnormality of hemangioblast

abnormal central nucleus of the thalamus
type: Class
subclass of: abnormal neural nucleus
subclass of: abnormal thalamus
definition: Abnormality of central nucleus of the thalamus.
has_exact_synonym: abnormality of central nucleus of the thalamus

abnormal blastocoel roof
type: Class
subclass of: abnormal tissue
subclass of: abnormal blastocoel
definition: Abnormality of blastocoel roof.
has_exact_synonym: abnormality of blastocoel roof

abnormal intersomitic epithelium
type: Class
subclass of: abnormal epithelium
subclass of: abnormal intersomitic region
definition: Abnormality of intersomitic epithelium.
has_exact_synonym: abnormality of intersomitic epithelium

abnormal xanthophore
type: Class
subclass of: abnormal pigment cell
definition: Abnormality of xanthophore.
has_exact_synonym: abnormality of xanthophore

abnormal ventral hyoid arch skeleton
type: Class
subclass of: abnormal tissue
subclass of: abnormal hyoid arch skeleton
definition: Abnormality of ventral hyoid arch skeleton.
has_exact_synonym: abnormality of ventral hyoid arch skeleton

abnormal sclerotome of trunk somite 1
type: Class
subclass of: abnormal sclerotome
definition: Abnormality of sclerotome of trunk somite 1.
has_exact_synonym: abnormality of sclerotome of trunk somite 1

abnormal retinal outer plexiform layer
type: Class
subclass of: abnormal tissue
subclass of: abnormal retinal neural layer
definition: Abnormality of retinal outer plexiform layer.
has_exact_synonym: abnormality of retinal outer plexiform layer

abnormal prosomere 4
type: Class
subclass of: abnormal diencephalon
subclass of: abnormal prosomere
definition: Abnormality of prosomere 4.
has_exact_synonym: abnormality of prosomere 4

abnormal accessory nerve
type: Class
subclass of: abnormal cranial nerve
definition: Abnormality of accessory nerve.
has_exact_synonym: abnormality of accessory nerve

abnormal myotome of tail somite 17
type: Class
subclass of: abnormal myotome
definition: Abnormality of myotome of tail somite 17.
has_exact_synonym: abnormality of myotome of tail somite 17

abnormal left ventricle
type: Class
subclass of: abnormal lateral ventricle
definition: Abnormality of left ventricle.
has_exact_synonym: abnormality of left ventricle

abnormal raphe nucleus
type: Class
subclass of: abnormal medulla oblongata
definition: Abnormality of raphe nucleus.
has_exact_synonym: abnormality of raphe nucleus

abnormal Schwann cell
type: Class
subclass of: abnormal peripheral nervous system
subclass of: abnormal nerve
subclass of: abnormal glial cell
definition: Abnormality of Schwann cell.
has_exact_synonym: abnormality of Schwann cell

abnormal proctodeum
type: Class
subclass of: abnormal surface structure
subclass of: abnormal larval alimentary system
definition: Abnormality of proctodeum.
has_exact_synonym: abnormality of proctodeum

abnormal intersomitic tendon
type: Class
subclass of: abnormal intersomitic region
subclass of: abnormal tendon
definition: Abnormality of intersomitic tendon.
has_exact_synonym: abnormality of intersomitic tendon

abnormal head morphology
type: Class
subclass of: abnormal head
subclass of: abnormal organism subdivision morphology
definition: Any unspecified morphological anomaly of the head, such as, for example, abnormal shape or colour.
has db xref: MP:0000432
has_exact_synonym: abnormal morphology of head

abnormal organism subdivision morphology
type: Class
subclass of: abnormal organism subdivision
subclass of: abnormal multicellular anatomical structure morphology
definition: Any unspecified morphological anomaly of the organism subdivision, such as, for example, abnormal shape or colour.
has_exact_synonym: abnormal morphology of organism subdivision

abnormal cell morphology
type: Class
subclass of: abnormal cell
subclass of: abnormal anatomical structure morphology
definition: Any unspecified morphological anomaly of the cell, such as, for example, abnormal shape or colour.
has_exact_synonym: abnormal morphology of cell

abnormal anatomical structure morphology
type: Class
subclass of: abnormal anatomical structure
definition: Any unspecified morphological anomaly of the anatomical structure, such as, for example, abnormal shape or colour.
has_exact_synonym: abnormal morphology of anatomical structure

abnormal epidermis morphology
type: Class
subclass of: abnormal epidermis
subclass of: abnormal multi-tissue structure morphology
definition: Any unspecified morphological anomaly of the epidermis, such as, for example, abnormal shape or colour.
has_exact_synonym: abnormal morphology of epidermis

abnormal multi-tissue structure morphology
type: Class
subclass of: abnormal multi-tissue structure
subclass of: abnormal multicellular anatomical structure morphology
definition: Any unspecified morphological anomaly of the multi-tissue structure, such as, for example, abnormal shape or colour.
has_exact_synonym: abnormal morphology of multi-tissue structure

abnormal multicellular anatomical structure morphology
type: Class
subclass of: abnormal multicellular anatomical structure
subclass of: abnormal anatomical structure morphology
definition: Any unspecified morphological anomaly of the multicellular anatomical structure, such as, for example, abnormal shape or colour.
has_exact_synonym: abnormal morphology of multicellular anatomical structure

abnormal cardiac neural crest morphology
type: Class
subclass of: abnormal cardiac neural crest
subclass of: abnormal tissue morphology
definition: Any unspecified morphological anomaly of the cardiac neural crest, such as, for example, abnormal shape or colour.
has_exact_synonym: abnormal morphology of cardiac neural crest

abnormal heart morphology
type: Class
subclass of: abnormal heart
subclass of: abnormal cavitated compound organ morphology
subclass of: abnormal viscus morphology
definition: Any unspecified morphological anomaly of the heart, such as, for example, abnormal shape or colour.
has_exact_synonym: abnormal morphology of heart

abnormal tissue morphology
type: Class
subclass of: abnormal tissue
subclass of: abnormal multicellular anatomical structure morphology
definition: Any unspecified morphological anomaly of the tissue, such as, for example, abnormal shape or colour.
has_exact_synonym: abnormal morphology of tissue

abnormal anterior placodal area morphology
type: Class
subclass of: abnormal anterior placodal area
subclass of: abnormal tissue morphology
definition: Any unspecified morphological anomaly of the anterior placodal area, such as, for example, abnormal shape or colour.
has_exact_synonym: abnormal morphology of anterior placodal area

abnormal external plexiform layer of the olfactory bulb morphology
type: Class
subclass of: abnormal external plexiform layer of the olfactory bulb
subclass of: abnormal tissue morphology
definition: Any unspecified morphological anomaly of the external plexiform layer of the olfactory bulb, such as, for example, abnormal shape or colour.
has_exact_synonym: abnormal morphology of external plexiform layer of the olfactory bulb

abnormal distal mesenchyme morphology
type: Class
subclass of: abnormal distal mesenchyme
subclass of: abnormal mesenchyme morphology
definition: Any unspecified morphological anomaly of the distal mesenchyme, such as, for example, abnormal shape or colour.
has_exact_synonym: abnormal morphology of distal mesenchyme

abnormal mesenchyme morphology
type: Class
subclass of: abnormal mesenchyme
subclass of: abnormal tissue morphology
definition: Any unspecified morphological anomaly of the mesenchyme, such as, for example, abnormal shape or colour.
has_exact_synonym: abnormal morphology of mesenchyme

abnormal oocyte morphology
type: Class
subclass of: abnormal oocyte
subclass of: abnormal germ cell morphology
definition: Any unspecified morphological anomaly of the oocyte, such as, for example, abnormal shape or colour.
has_exact_synonym: abnormal morphology of oocyte

abnormal germ cell morphology
type: Class
subclass of: abnormal germ cell
subclass of: abnormal cell morphology
definition: Any unspecified morphological anomaly of the germ cell, such as, for example, abnormal shape or colour.
has_exact_synonym: abnormal morphology of germ cell

abnormal lower jaw morphology
type: Class
subclass of: abnormal lower jaw
subclass of: abnormal anatomical cluster morphology
definition: Any unspecified morphological anomaly of the lower jaw, such as, for example, abnormal shape or colour.
has_exact_synonym: abnormal morphology of lower jaw

abnormal anatomical cluster morphology
type: Class
subclass of: abnormal anatomical cluster
subclass of: abnormal anatomical group morphology
definition: Any unspecified morphological anomaly of the anatomical cluster, such as, for example, abnormal shape or colour.
has_exact_synonym: abnormal morphology of anatomical cluster

abnormal central nervous system morphology
type: Class
subclass of: abnormal central nervous system
subclass of: abnormal nervous system morphology
definition: Any unspecified morphological anomaly of the central nervous system, such as, for example, abnormal shape or colour.
has_exact_synonym: abnormal morphology of central nervous system

abnormal nervous system morphology
type: Class
subclass of: abnormal nervous system
subclass of: abnormal anatomical system morphology
definition: Any unspecified morphological anomaly of the nervous system, such as, for example, abnormal shape or colour.
has_exact_synonym: abnormal morphology of nervous system

abnormal fundus morphology
type: Class
subclass of: abnormal fundus
subclass of: abnormal multi-tissue structure morphology
definition: Any unspecified morphological anomaly of the fundus, such as, for example, abnormal shape or colour.
has_exact_synonym: abnormal morphology of fundus

abnormal blastomere V1.1 morphology
type: Class
subclass of: abnormal blastomere V1.1
subclass of: abnormal ventral animal hemisphere blastomere morphology
definition: Any unspecified morphological anomaly of the blastomere V1.1, such as, for example, abnormal shape or colour.
has_exact_synonym: abnormal morphology of blastomere V1.1

abnormal ventral animal hemisphere blastomere morphology
type: Class
subclass of: abnormal ventral animal hemisphere blastomere
subclass of: abnormal animal blastomere morphology
definition: Any unspecified morphological anomaly of the ventral animal hemisphere blastomere, such as, for example, abnormal shape or colour.
has_exact_synonym: abnormal morphology of ventral animal hemisphere blastomere

abnormal ovary morphology
type: Class
subclass of: abnormal ovary
subclass of: abnormal gonad morphology
definition: Any unspecified morphological anomaly of the ovary, such as, for example, abnormal shape or colour.
has_exact_synonym: abnormal morphology of ovary

abnormal gonad morphology
type: Class
subclass of: abnormal gonad
subclass of: abnormal cavitated compound organ morphology
definition: Any unspecified morphological anomaly of the gonad, such as, for example, abnormal shape or colour.
has_exact_synonym: abnormal morphology of gonad

abnormal olfactory bulb morphology
type: Class
subclass of: abnormal olfactory bulb
subclass of: abnormal multi-tissue structure morphology
definition: Any unspecified morphological anomaly of the olfactory bulb, such as, for example, abnormal shape or colour.
has_exact_synonym: abnormal morphology of olfactory bulb

abnormal hepatic vein morphology
type: Class
subclass of: abnormal hepatic vein
subclass of: abnormal vein morphology
definition: Any unspecified morphological anomaly of the hepatic vein, such as, for example, abnormal shape or colour.
has_exact_synonym: abnormal morphology of hepatic vein

abnormal vein morphology
type: Class
subclass of: abnormal vein
subclass of: abnormal blood vessel morphology
definition: Any unspecified morphological anomaly of the vein, such as, for example, abnormal shape or colour.
has_exact_synonym: abnormal morphology of vein

abnormal trunk somite 12 morphology
type: Class
subclass of: abnormal trunk somite 12
subclass of: abnormal trunk somite morphology
definition: Any unspecified morphological anomaly of the trunk somite 12, such as, for example, abnormal shape or colour.
has_exact_synonym: abnormal morphology of trunk somite 12

abnormal trunk somite morphology
type: Class
subclass of: abnormal trunk somite
subclass of: abnormal somite morphology
definition: Any unspecified morphological anomaly of the trunk somite, such as, for example, abnormal shape or colour.
has_exact_synonym: abnormal morphology of trunk somite

abnormal cartilage element morphology
type: Class
subclass of: abnormal cartilage element
subclass of: abnormal skeletal element morphology
definition: Any unspecified morphological anomaly of the cartilage element, such as, for example, abnormal shape or colour.
has_exact_synonym: abnormal morphology of cartilage element

abnormal skeletal element morphology
type: Class
subclass of: abnormal skeletal element
subclass of: abnormal solid compound organ morphology
definition: Any unspecified morphological anomaly of the skeletal element, such as, for example, abnormal shape or colour.
has_exact_synonym: abnormal morphology of skeletal element

abnormal chondrocranium morphology
type: Class
subclass of: abnormal chondrocranium
subclass of: abnormal cranium morphology
definition: Any unspecified morphological anomaly of the chondrocranium, such as, for example, abnormal shape or colour.
has_exact_synonym: abnormal morphology of chondrocranium

abnormal chondrocyte morphology
type: Class
subclass of: abnormal chondrocyte
subclass of: abnormal cell morphology
definition: Any unspecified morphological anomaly of the chondrocyte, such as, for example, abnormal shape or colour.
has_exact_synonym: abnormal morphology of chondrocyte

abnormal head somite 1 morphology
type: Class
subclass of: abnormal head somite 1
subclass of: abnormal head somite morphology
definition: Any unspecified morphological anomaly of the head somite 1, such as, for example, abnormal shape or colour.
has_exact_synonym: abnormal morphology of head somite 1

abnormal head somite morphology
type: Class
subclass of: abnormal head somite
subclass of: abnormal somite morphology
definition: Any unspecified morphological anomaly of the head somite, such as, for example, abnormal shape or colour.
has_exact_synonym: abnormal morphology of head somite

abnormal head vasculature morphology
type: Class
subclass of: abnormal head vasculature
subclass of: abnormal multi-tissue structure morphology
definition: Any unspecified morphological anomaly of the head vasculature, such as, for example, abnormal shape or colour.
has_exact_synonym: abnormal morphology of head vasculature

abnormal blood vessel morphology
type: Class
subclass of: abnormal blood vessel
subclass of: abnormal multi-tissue structure morphology
definition: Any unspecified morphological anomaly of the blood vessel, such as, for example, abnormal shape or colour.
has_exact_synonym: abnormal morphology of blood vessel

abnormal olfactory epithelium morphology
type: Class
subclass of: abnormal olfactory epithelium
subclass of: abnormal epithelium morphology
definition: Any unspecified morphological anomaly of the olfactory epithelium, such as, for example, abnormal shape or colour.
has_exact_synonym: abnormal morphology of olfactory epithelium

abnormal sclerotome of trunk somite 9 morphology
type: Class
subclass of: abnormal sclerotome of trunk somite 9
subclass of: abnormal sclerotome morphology
definition: Any unspecified morphological anomaly of the sclerotome of trunk somite 9, such as, for example, abnormal shape or colour.
has_exact_synonym: abnormal morphology of sclerotome of trunk somite 9

abnormal sclerotome morphology
type: Class
subclass of: abnormal sclerotome
subclass of: abnormal tissue morphology
definition: Any unspecified morphological anomaly of the sclerotome, such as, for example, abnormal shape or colour.
has_exact_synonym: abnormal morphology of sclerotome

abnormal regenerating tail morphology
type: Class
subclass of: abnormal regenerating tail
subclass of: abnormal regenerating tissue morphology
definition: Any unspecified morphological anomaly of the regenerating tail, such as, for example, abnormal shape or colour.
has_exact_synonym: abnormal morphology of regenerating tail

abnormal regenerating tissue morphology
type: Class
subclass of: abnormal regenerating tissue
subclass of: abnormal tissue morphology
definition: Any unspecified morphological anomaly of the regenerating tissue, such as, for example, abnormal shape or colour.
has_exact_synonym: abnormal morphology of regenerating tissue

abnormal anatomical space morphology
type: Class
subclass of: abnormal anatomical space
definition: Any unspecified morphological anomaly of the anatomical space, such as, for example, abnormal shape or colour.
has_exact_synonym: abnormal morphology of anatomical space

abnormal myotome morphology
type: Class
subclass of: abnormal myotome
subclass of: abnormal tissue morphology
definition: Any unspecified morphological anomaly of the myotome, such as, for example, abnormal shape or colour.
has_exact_synonym: abnormal morphology of myotome

abnormal animal hemisphere morphology
type: Class
subclass of: abnormal animal hemisphere
subclass of: XPO_0141316
definition: Any unspecified morphological anomaly of the animal hemisphere, such as, for example, abnormal shape or colour.
has_exact_synonym: abnormal morphology of animal hemisphere

obsolete abnormal morphology of anatomical region
type: Class
IAO_0000125: XPO_0141316
deprecated: true

abnormal urinary system morphology
type: Class
subclass of: abnormal urinary system
subclass of: abnormal anatomical system morphology
definition: Any unspecified morphological anomaly of the urinary system, such as, for example, abnormal shape or colour.
has_exact_synonym: abnormal morphology of urinary system

abnormal anatomical system morphology
type: Class
subclass of: abnormal anatomical system
subclass of: abnormal anatomical group morphology
definition: Any unspecified morphological anomaly of the anatomical system, such as, for example, abnormal shape or colour.
has_exact_synonym: abnormal morphology of anatomical system

abnormal endoderm morphology
type: Class
subclass of: abnormal endoderm
subclass of: abnormal primary germ layer morphology
definition: Any unspecified morphological anomaly of the endoderm, such as, for example, abnormal shape or colour.
has_exact_synonym: abnormal morphology of endoderm

abnormal mandibular artery morphology
type: Class
subclass of: abnormal mandibular artery
subclass of: abnormal artery morphology
definition: Any unspecified morphological anomaly of the mandibular artery, such as, for example, abnormal shape or colour.
has_exact_synonym: abnormal morphology of mandibular artery

abnormal artery morphology
type: Class
subclass of: abnormal artery
subclass of: abnormal blood vessel morphology
definition: Any unspecified morphological anomaly of the artery, such as, for example, abnormal shape or colour.
has_exact_synonym: abnormal morphology of artery

abnormal olfactory placode morphology
type: Class
subclass of: abnormal olfactory placode
subclass of: abnormal neurogenic placode morphology
definition: Any unspecified morphological anomaly of the olfactory placode, such as, for example, abnormal shape or colour.
has_exact_synonym: abnormal morphology of olfactory placode

abnormal neurogenic placode morphology
type: Class
subclass of: abnormal neurogenic placode
subclass of: abnormal cranial placode morphology
definition: Any unspecified morphological anomaly of the neurogenic placode, such as, for example, abnormal shape or colour.
has_exact_synonym: abnormal morphology of neurogenic placode

abnormal dorsal aorta morphology
type: Class
subclass of: abnormal dorsal aorta
subclass of: abnormal aorta morphology
definition: Any unspecified morphological anomaly of the dorsal aorta, such as, for example, abnormal shape or colour.
has_exact_synonym: abnormal morphology of dorsal aorta

abnormal aorta morphology
type: Class
subclass of: abnormal aorta
subclass of: abnormal artery morphology
definition: Any unspecified morphological anomaly of the aorta, such as, for example, abnormal shape or colour.
has_exact_synonym: abnormal morphology of aorta

abnormal anatomical entity in vitro morphology
type: Class
subclass of: abnormal anatomical entity in vitro
definition: Any unspecified morphological anomaly of the anatomical entity in vitro, such as, for example, abnormal shape or colour.
has_exact_synonym: abnormal morphology of anatomical entity in vitro

abnormal rhombomere R3 morphology
type: Class
subclass of: abnormal rhombomere R3
subclass of: abnormal rhombomere morphology
definition: Any unspecified morphological anomaly of the rhombomere R3, such as, for example, abnormal shape or colour.
has_exact_synonym: abnormal morphology of rhombomere R3

abnormal rhombomere morphology
type: Class
subclass of: abnormal rhombomere
subclass of: abnormal neuromere morphology
definition: Any unspecified morphological anomaly of the rhombomere, such as, for example, abnormal shape or colour.
has_exact_synonym: abnormal morphology of rhombomere

abnormal anatomical group morphology
type: Class
subclass of: abnormal anatomical group
subclass of: abnormal anatomical structure morphology
definition: Any unspecified morphological anomaly of the anatomical group, such as, for example, abnormal shape or colour.
has_exact_synonym: abnormal morphology of anatomical group

abnormal mesonephric sinus morphology
type: Class
subclass of: abnormal mesonephric sinus
subclass of: abnormal anatomical space morphology
definition: Any unspecified morphological anomaly of the mesonephric sinus, such as, for example, abnormal shape or colour.
has_exact_synonym: abnormal morphology of mesonephric sinus

abnormal venous endothelium morphology
type: Class
subclass of: abnormal venous endothelium
subclass of: abnormal simple squamous epithelium morphology
definition: Any unspecified morphological anomaly of the venous endothelium, such as, for example, abnormal shape or colour.
has_exact_synonym: abnormal morphology of venous endothelium

abnormal simple squamous epithelium morphology
type: Class
subclass of: abnormal simple squamous epithelium
subclass of: abnormal unilaminar epithelium morphology
definition: Any unspecified morphological anomaly of the simple squamous epithelium, such as, for example, abnormal shape or colour.
has_exact_synonym: abnormal morphology of simple squamous epithelium

abnormal head somite 4 morphology
type: Class
subclass of: abnormal head somite 4
subclass of: abnormal head somite morphology
definition: Any unspecified morphological anomaly of the head somite 4, such as, for example, abnormal shape or colour.
has_exact_synonym: abnormal morphology of head somite 4

abnormal optic tectum morphology
type: Class
subclass of: abnormal optic tectum
subclass of: abnormal multi-tissue structure morphology
definition: Any unspecified morphological anomaly of the optic tectum, such as, for example, abnormal shape or colour.
has_exact_synonym: abnormal morphology of optic tectum

abnormal cranial muscle morphology
type: Class
subclass of: abnormal cranial muscle
subclass of: abnormal muscle morphology
definition: Any unspecified morphological anomaly of the cranial muscle, such as, for example, abnormal shape or colour.
has_exact_synonym: abnormal morphology of cranial muscle

abnormal muscle morphology
type: Class
subclass of: abnormal muscle
subclass of: abnormal tissue morphology
definition: Any unspecified morphological anomaly of the muscle, such as, for example, abnormal shape or colour.
has_exact_synonym: abnormal morphology of muscle

abnormal trunk morphology
type: Class
subclass of: abnormal trunk
subclass of: abnormal organism subdivision morphology
definition: Any unspecified morphological anomaly of the trunk, such as, for example, abnormal shape or colour.
has_exact_synonym: abnormal morphology of trunk

abnormal embryonic structure morphology
type: Class
subclass of: abnormal embryonic structure
subclass of: abnormal anatomical structure morphology
definition: Any unspecified morphological anomaly of the embryonic structure, such as, for example, abnormal shape or colour.
has_exact_synonym: abnormal morphology of embryonic structure

abnormal mesoderm morphology
type: Class
subclass of: abnormal mesoderm
subclass of: abnormal primary germ layer morphology
definition: Any unspecified morphological anomaly of the mesoderm, such as, for example, abnormal shape or colour.
has_exact_synonym: abnormal morphology of mesoderm

abnormal involuted dorsal mesoderm morphology
type: Class
subclass of: abnormal involuted dorsal mesoderm
subclass of: abnormal tissue morphology
definition: Any unspecified morphological anomaly of the involuted dorsal mesoderm, such as, for example, abnormal shape or colour.
has_exact_synonym: abnormal morphology of involuted dorsal mesoderm

abnormal cell part morphology
type: Class
subclass of: abnormal cell part
subclass of: abnormal anatomical structure morphology
definition: Any unspecified morphological anomaly of the cell part, such as, for example, abnormal shape or colour.
has_exact_synonym: abnormal morphology of cell part

abnormal trigeminal nerve morphology
type: Class
subclass of: abnormal trigeminal nerve
subclass of: abnormal cranial nerve morphology
definition: Any unspecified morphological anomaly of the trigeminal nerve, such as, for example, abnormal shape or colour.
has_exact_synonym: abnormal morphology of trigeminal nerve

abnormal cranial nerve morphology
type: Class
subclass of: abnormal cranial nerve
subclass of: XPO_0141281
definition: Any unspecified morphological anomaly of the cranial nerve, such as, for example, abnormal shape or colour.
has_exact_synonym: abnormal morphology of cranial nerve

abnormal fin vasculature morphology
type: Class
subclass of: abnormal fin vasculature
subclass of: abnormal blood vessel morphology
definition: Any unspecified morphological anomaly of the fin vasculature, such as, for example, abnormal shape or colour.
has_exact_synonym: abnormal morphology of fin vasculature

abnormal peripheral nervous system morphology
type: Class
subclass of: abnormal peripheral nervous system
subclass of: abnormal nervous system morphology
definition: Any unspecified morphological anomaly of the peripheral nervous system, such as, for example, abnormal shape or colour.
has_exact_synonym: abnormal morphology of peripheral nervous system

abnormal aortic arch 1 morphology
type: Class
subclass of: abnormal aortic arch 1
subclass of: abnormal aortic arch morphology
definition: Any unspecified morphological anomaly of the aortic arch 1, such as, for example, abnormal shape or colour.
has_exact_synonym: abnormal morphology of aortic arch 1

abnormal aortic arch morphology
type: Class
subclass of: abnormal aortic arch
subclass of: abnormal artery morphology
definition: Any unspecified morphological anomaly of the aortic arch, such as, for example, abnormal shape or colour.
has_exact_synonym: abnormal morphology of aortic arch

abnormal genital system morphology
type: Class
subclass of: abnormal genital system
subclass of: abnormal anatomical system morphology
definition: Any unspecified morphological anomaly of the genital system, such as, for example, abnormal shape or colour.
has_exact_synonym: abnormal morphology of genital system

abnormal endochondral bone morphology
type: Class
subclass of: abnormal endochondral bone
subclass of: abnormal endochondral element morphology
definition: Any unspecified morphological anomaly of the endochondral bone, such as, for example, abnormal shape or colour.
has_exact_synonym: abnormal morphology of endochondral bone

abnormal pelvic girdle morphology
type: Class
subclass of: abnormal pelvic girdle
subclass of: abnormal skeletal subdivision morphology
definition: Any unspecified morphological anomaly of the pelvic girdle, such as, for example, abnormal shape or colour.
has_exact_synonym: abnormal morphology of pelvic girdle

abnormal endochondral element morphology
type: Class
subclass of: abnormal endochondral element
subclass of: abnormal regenerating skeletal element morphology
definition: Any unspecified morphological anomaly of the endochondral element, such as, for example, abnormal shape or colour.
has_exact_synonym: abnormal morphology of endochondral element

abnormal upper blastopore lip morphology
type: Class
subclass of: abnormal upper blastopore lip
subclass of: abnormal embryonic structure morphology
definition: Any unspecified morphological anomaly of the upper blastopore lip, such as, for example, abnormal shape or colour.
has_exact_synonym: abnormal morphology of upper blastopore lip

abnormal tail tip morphology
type: Class
subclass of: abnormal tail tip
subclass of: abnormal tissue morphology
definition: Any unspecified morphological anomaly of the tail tip, such as, for example, abnormal shape or colour.
has_exact_synonym: abnormal morphology of tail tip

abnormal anterior lateral line placode morphology
type: Class
subclass of: abnormal anterior lateral line placode
subclass of: abnormal lateral line placode morphology
definition: Any unspecified morphological anomaly of the anterior lateral line placode, such as, for example, abnormal shape or colour.
has_exact_synonym: abnormal morphology of anterior lateral line placode

abnormal lateral line placode morphology
type: Class
subclass of: abnormal lateral line placode
subclass of: abnormal neurogenic placode morphology
definition: Any unspecified morphological anomaly of the lateral line placode, such as, for example, abnormal shape or colour.
has_exact_synonym: abnormal morphology of lateral line placode

abnormal mouth primordium morphology
type: Class
subclass of: abnormal mouth primordium
subclass of: abnormal multi-tissue structure morphology
definition: Any unspecified morphological anomaly of the mouth primordium, such as, for example, abnormal shape or colour.
has_exact_synonym: abnormal morphology of mouth primordium

abnormal cranium morphology
type: Class
subclass of: abnormal cranium
subclass of: abnormal anatomical cluster morphology
definition: Any unspecified morphological anomaly of the cranium, such as, for example, abnormal shape or colour.
has_exact_synonym: abnormal morphology of cranium

abnormal solid compound organ morphology
type: Class
subclass of: abnormal solid compound organ
subclass of: abnormal compound organ morphology
definition: Any unspecified morphological anomaly of the solid compound organ, such as, for example, abnormal shape or colour.
has_exact_synonym: abnormal morphology of solid compound organ

abnormal neural plate morphology
type: Class
subclass of: abnormal neural plate
subclass of: abnormal tissue morphology
definition: Any unspecified morphological anomaly of the neural plate, such as, for example, abnormal shape or colour.
has_exact_synonym: abnormal morphology of neural plate

abnormal surface structure morphology
type: Class
subclass of: abnormal surface structure
subclass of: abnormal organism subdivision morphology
definition: Any unspecified morphological anomaly of the surface structure, such as, for example, abnormal shape or colour.
has_exact_synonym: abnormal morphology of surface structure

abnormal neural tube morphology
type: Class
subclass of: abnormal neural tube
subclass of: abnormal embryonic structure morphology
definition: Any unspecified morphological anomaly of the neural tube, such as, for example, abnormal shape or colour.
has_exact_synonym: abnormal morphology of neural tube

abnormal cardinal vein morphology
type: Class
subclass of: abnormal cardinal vein
subclass of: abnormal vein morphology
definition: Any unspecified morphological anomaly of the cardinal vein, such as, for example, abnormal shape or colour.
has_exact_synonym: abnormal morphology of cardinal vein

abnormal trunk vasculature morphology
type: Class
subclass of: abnormal trunk vasculature
subclass of: abnormal multi-tissue structure morphology
definition: Any unspecified morphological anomaly of the trunk vasculature, such as, for example, abnormal shape or colour.
has_exact_synonym: abnormal morphology of trunk vasculature

abnormal intermediate mesoderm morphology
type: Class
subclass of: abnormal intermediate mesoderm
subclass of: abnormal tissue morphology
definition: Any unspecified morphological anomaly of the intermediate mesoderm, such as, for example, abnormal shape or colour.
has_exact_synonym: abnormal morphology of intermediate mesoderm

abnormal paired dorsal aorta morphology
type: Class
subclass of: abnormal paired dorsal aorta
subclass of: abnormal aorta morphology
definition: Any unspecified morphological anomaly of the paired dorsal aorta, such as, for example, abnormal shape or colour.
has_exact_synonym: abnormal morphology of paired dorsal aorta

abnormal branchial crest morphology
type: Class
subclass of: abnormal branchial crest
subclass of: abnormal tissue morphology
definition: Any unspecified morphological anomaly of the branchial crest, such as, for example, abnormal shape or colour.
has_exact_synonym: abnormal morphology of branchial crest

abnormal primary germ layer morphology
type: Class
subclass of: abnormal primary germ layer
subclass of: abnormal tissue morphology
definition: Any unspecified morphological anomaly of the primary germ layer, such as, for example, abnormal shape or colour.
has_exact_synonym: abnormal morphology of primary germ layer

abnormal mesonephric mesenchyme morphology
type: Class
subclass of: abnormal mesonephric mesenchyme
subclass of: abnormal mesenchyme morphology
definition: Any unspecified morphological anomaly of the mesonephric mesenchyme, such as, for example, abnormal shape or colour.
has_exact_synonym: abnormal morphology of mesonephric mesenchyme

abnormal arteria mesenterica posterior morphology
type: Class
subclass of: abnormal arteria mesenterica posterior
subclass of: abnormal artery morphology
definition: Any unspecified morphological anomaly of the arteria mesenterica posterior, such as, for example, abnormal shape or colour.
has_exact_synonym: abnormal morphology of arteria mesenterica posterior

abnormal hypophyseal primordium morphology
type: Class
subclass of: abnormal hypophyseal primordium
subclass of: abnormal primordium morphology
definition: Any unspecified morphological anomaly of the hypophyseal primordium, such as, for example, abnormal shape or colour.
has_exact_synonym: abnormal morphology of hypophyseal primordium

abnormal primordium morphology
type: Class
subclass of: abnormal primordium
subclass of: abnormal embryonic structure morphology
definition: Any unspecified morphological anomaly of the primordium, such as, for example, abnormal shape or colour.
has_exact_synonym: abnormal morphology of primordium

abnormal alimentary system morphology
type: Class
subclass of: abnormal alimentary system
subclass of: abnormal anatomical system morphology
definition: Any unspecified morphological anomaly of the alimentary system, such as, for example, abnormal shape or colour.
has_exact_synonym: abnormal morphology of alimentary system

abnormal hepatic portal vein morphology
type: Class
subclass of: abnormal hepatic portal vein
subclass of: abnormal vein morphology
definition: Any unspecified morphological anomaly of the hepatic portal vein, such as, for example, abnormal shape or colour.
has_exact_synonym: abnormal morphology of hepatic portal vein

abnormal foregut morphology
type: Class
subclass of: abnormal foregut
subclass of: abnormal embryonic structure morphology
definition: Any unspecified morphological anomaly of the foregut, such as, for example, abnormal shape or colour.
has_exact_synonym: abnormal morphology of foregut

abnormal optic tract morphology
type: Class
subclass of: abnormal optic tract
subclass of: abnormal multi-tissue structure morphology
definition: Any unspecified morphological anomaly of the optic tract, such as, for example, abnormal shape or colour.
has_exact_synonym: abnormal morphology of optic tract

abnormal neuromere morphology
type: Class
subclass of: abnormal neuromere
subclass of: abnormal organism subdivision morphology
definition: Any unspecified morphological anomaly of the neuromere, such as, for example, abnormal shape or colour.
has_exact_synonym: abnormal morphology of neuromere

abnormal hindbrain morphology
type: Class
subclass of: abnormal hindbrain
subclass of: abnormal multi-tissue structure morphology
definition: Any unspecified morphological anomaly of the hindbrain, such as, for example, abnormal shape or colour.
has_exact_synonym: abnormal morphology of hindbrain

abnormal presumptive rhombomere morphology
type: Class
subclass of: abnormal presumptive rhombomere
subclass of: abnormal embryonic structure morphology
definition: Any unspecified morphological anomaly of the presumptive rhombomere, such as, for example, abnormal shape or colour.
has_exact_synonym: abnormal morphology of presumptive rhombomere

abnormal central amygdala morphology
type: Class
subclass of: abnormal central amygdala
subclass of: abnormal neural nucleus morphology
definition: Any unspecified morphological anomaly of the central amygdala, such as, for example, abnormal shape or colour.
has_exact_synonym: abnormal morphology of central amygdala

abnormal neural nucleus morphology
type: Class
subclass of: abnormal neural nucleus
subclass of: abnormal anatomical cluster morphology
definition: Any unspecified morphological anomaly of the neural nucleus, such as, for example, abnormal shape or colour.
has_exact_synonym: abnormal morphology of neural nucleus

abnormal lateral pallium morphology
type: Class
subclass of: abnormal lateral pallium
subclass of: abnormal multi-tissue structure morphology
definition: Any unspecified morphological anomaly of the lateral pallium, such as, for example, abnormal shape or colour.
has_exact_synonym: abnormal morphology of lateral pallium

abnormal somite morphology
type: Class
subclass of: abnormal somite
subclass of: abnormal tissue morphology
definition: Any unspecified morphological anomaly of the somite, such as, for example, abnormal shape or colour.
has_exact_synonym: abnormal morphology of somite

abnormal nerve morphology
type: Class
subclass of: abnormal nerve
subclass of: abnormal tissue morphology
definition: Any unspecified morphological anomaly of the nerve, such as, for example, abnormal shape or colour.
has_exact_synonym: abnormal morphology of nerve

abnormal ectoderm morphology
type: Class
subclass of: abnormal ectoderm
subclass of: abnormal primary germ layer morphology
definition: Any unspecified morphological anomaly of the ectoderm, such as, for example, abnormal shape or colour.
has_exact_synonym: abnormal morphology of ectoderm

abnormal brain morphology
type: Class
subclass of: abnormal brain
subclass of: abnormal cavitated compound organ morphology
definition: Any unspecified morphological anomaly of the brain, such as, for example, abnormal shape or colour.
has_exact_synonym: abnormal morphology of brain

abnormal anterior neural tube morphology
type: Class
subclass of: abnormal anterior neural tube
subclass of: abnormal embryonic structure morphology
definition: Any unspecified morphological anomaly of the anterior neural tube, such as, for example, abnormal shape or colour.
has_exact_synonym: abnormal morphology of anterior neural tube

abnormal neural stem cell morphology
type: Class
subclass of: abnormal neural stem cell
subclass of: abnormal stem cell morphology
definition: Any unspecified morphological anomaly of the neural stem cell, such as, for example, abnormal shape or colour.
has_exact_synonym: abnormal morphology of neural stem cell

abnormal stem cell morphology
type: Class
subclass of: abnormal stem cell
subclass of: abnormal cell morphology
definition: Any unspecified morphological anomaly of the stem cell, such as, for example, abnormal shape or colour.
has_exact_synonym: abnormal morphology of stem cell

abnormal pallidum morphology
type: Class
subclass of: abnormal pallidum
subclass of: abnormal anatomical cluster morphology
definition: Any unspecified morphological anomaly of the pallidum, such as, for example, abnormal shape or colour.
has_exact_synonym: abnormal morphology of pallidum

abnormal migrating neuroblast morphology
type: Class
subclass of: abnormal migrating neuroblast
subclass of: abnormal cell morphology
definition: Any unspecified morphological anomaly of the migrating neuroblast, such as, for example, abnormal shape or colour.
has_exact_synonym: abnormal morphology of migrating neuroblast

abnormal stage VI oocyte morphology
type: Class
subclass of: abnormal stage VI oocyte
subclass of: abnormal oocyte morphology
definition: Any unspecified morphological anomaly of the stage VI oocyte, such as, for example, abnormal shape or colour.
has_exact_synonym: abnormal morphology of stage VI oocyte

abnormal hindlimb digit morphology
type: Class
subclass of: abnormal hindlimb digit
subclass of: abnormal digit morphology
definition: Any unspecified morphological anomaly of the hindlimb digit, such as, for example, abnormal shape or colour.
has_exact_synonym: abnormal morphology of hindlimb digit

abnormal digit morphology
type: Class
subclass of: abnormal digit
subclass of: abnormal anatomical cluster morphology
definition: Any unspecified morphological anomaly of the digit, such as, for example, abnormal shape or colour.
has_exact_synonym: abnormal morphology of digit

abnormal sclerotome of trunk somite 7 morphology
type: Class
subclass of: abnormal sclerotome of trunk somite 7
subclass of: abnormal sclerotome morphology
definition: Any unspecified morphological anomaly of the sclerotome of trunk somite 7, such as, for example, abnormal shape or colour.
has_exact_synonym: abnormal morphology of sclerotome of trunk somite 7

abnormal hindlimb bud morphology
type: Class
subclass of: abnormal hindlimb bud
subclass of: abnormal limb bud morphology
definition: Any unspecified morphological anomaly of the hindlimb bud, such as, for example, abnormal shape or colour.
has_exact_synonym: abnormal morphology of hindlimb bud

abnormal gastrocoel roof plate morphology
type: Class
subclass of: abnormal gastrocoel roof plate
subclass of: abnormal tissue morphology
definition: Any unspecified morphological anomaly of the gastrocoel roof plate, such as, for example, abnormal shape or colour.
has_exact_synonym: abnormal morphology of gastrocoel roof plate

abnormal tooth morphology
type: Class
subclass of: abnormal tooth
subclass of: abnormal skeletal element morphology
definition: Any unspecified morphological anomaly of the tooth, such as, for example, abnormal shape or colour.
has_exact_synonym: abnormal morphology of tooth

abnormal eye morphology
type: Class
subclass of: abnormal eye
subclass of: abnormal cavitated compound organ morphology
definition: Any unspecified morphological anomaly of the eye, such as, for example, abnormal shape or colour.
has_exact_synonym: abnormal morphology of eye

abnormal uveal tract morphology
type: Class
subclass of: abnormal uveal tract
subclass of: abnormal tissue morphology
definition: Any unspecified morphological anomaly of the uveal tract, such as, for example, abnormal shape or colour.
has_exact_synonym: abnormal morphology of uveal tract

abnormal regenerating limb morphology
type: Class
subclass of: abnormal regenerating limb
subclass of: abnormal regenerating tissue morphology
definition: Any unspecified morphological anomaly of the regenerating limb, such as, for example, abnormal shape or colour.
has_exact_synonym: abnormal morphology of regenerating limb

abnormal delta cell morphology
type: Class
subclass of: abnormal delta cell
subclass of: abnormal enteroendocrine cell morphology
definition: Any unspecified morphological anomaly of the delta cell, such as, for example, abnormal shape or colour.
has_exact_synonym: abnormal morphology of delta cell

abnormal enteroendocrine cell morphology
type: Class
subclass of: abnormal enteroendocrine cell
subclass of: abnormal endocrine cell morphology
definition: Any unspecified morphological anomaly of the enteroendocrine cell, such as, for example, abnormal shape or colour.
has_exact_synonym: abnormal morphology of enteroendocrine cell

abnormal tail somite 15 morphology
type: Class
subclass of: abnormal tail somite 15
subclass of: abnormal tail somite morphology
definition: Any unspecified morphological anomaly of the tail somite 15, such as, for example, abnormal shape or colour.
has_exact_synonym: abnormal morphology of tail somite 15

abnormal lens epithelium morphology
type: Class
subclass of: abnormal lens epithelium
subclass of: abnormal epithelium morphology
definition: Any unspecified morphological anomaly of the lens epithelium, such as, for example, abnormal shape or colour.
has_exact_synonym: abnormal morphology of lens epithelium

abnormal epithelium morphology
type: Class
subclass of: abnormal epithelium
subclass of: abnormal tissue morphology
definition: Any unspecified morphological anomaly of the epithelium, such as, for example, abnormal shape or colour.
has_exact_synonym: abnormal morphology of epithelium

abnormal granule cell layer of the olfactory bulb morphology
type: Class
subclass of: abnormal granule cell layer of the olfactory bulb
subclass of: abnormal tissue morphology
definition: Any unspecified morphological anomaly of the granule cell layer of the olfactory bulb, such as, for example, abnormal shape or colour.
has_exact_synonym: abnormal morphology of granule cell layer of the olfactory bulb

abnormal preoptic area morphology
type: Class
subclass of: abnormal preoptic area
subclass of: abnormal multi-tissue structure morphology
definition: Any unspecified morphological anomaly of the preoptic area, such as, for example, abnormal shape or colour.
has_exact_synonym: abnormal morphology of preoptic area

abnormal retromammillary area morphology
type: Class
subclass of: abnormal retromammillary area
subclass of: abnormal multi-tissue structure morphology
definition: Any unspecified morphological anomaly of the retromammillary area, such as, for example, abnormal shape or colour.
has_exact_synonym: abnormal morphology of retromammillary area

abnormal neuron morphology
type: Class
subclass of: abnormal neuron
subclass of: abnormal cell morphology
definition: Any unspecified morphological anomaly of the neuron, such as, for example, abnormal shape or colour.
has_exact_synonym: abnormal morphology of neuron

abnormal subclavian vein morphology
type: Class
subclass of: abnormal subclavian vein
subclass of: abnormal vein morphology
definition: Any unspecified morphological anomaly of the subclavian vein, such as, for example, abnormal shape or colour.
has_exact_synonym: abnormal morphology of subclavian vein

abnormal prehallux morphology
type: Class
subclass of: abnormal prehallux
subclass of: XPO_0141575
definition: Any unspecified morphological anomaly of the prehallux, such as, for example, abnormal shape or colour.
has_exact_synonym: abnormal morphology of prehallux

abnormal cranial muscle primordium morphology
type: Class
subclass of: abnormal cranial muscle primordium
subclass of: abnormal multi-tissue structure morphology
definition: Any unspecified morphological anomaly of the cranial muscle primordium, such as, for example, abnormal shape or colour.
has_exact_synonym: abnormal morphology of cranial muscle primordium

abnormal left atrium morphology
type: Class
subclass of: abnormal left atrium
subclass of: abnormal cavitated compound organ morphology
definition: Any unspecified morphological anomaly of the left atrium, such as, for example, abnormal shape or colour.
has_exact_synonym: abnormal morphology of left atrium

abnormal cavitated compound organ morphology
type: Class
subclass of: abnormal cavitated compound organ
subclass of: abnormal compound organ morphology
definition: Any unspecified morphological anomaly of the cavitated compound organ, such as, for example, abnormal shape or colour.
has_exact_synonym: abnormal morphology of cavitated compound organ

abnormal embryo morphology
type: Class
subclass of: abnormal embryo
definition: Any unspecified morphological anomaly of the embryo, such as, for example, abnormal shape or colour.
has_exact_synonym: abnormal morphology of embryo

abnormal endocrine cell morphology
type: Class
subclass of: abnormal endocrine cell
subclass of: abnormal cell morphology
definition: Any unspecified morphological anomaly of the endocrine cell, such as, for example, abnormal shape or colour.
has_exact_synonym: abnormal morphology of endocrine cell

abnormal islets of Langerhans morphology
type: Class
subclass of: abnormal islets of Langerhans
subclass of: abnormal multi-tissue structure morphology
definition: Any unspecified morphological anomaly of the islets of Langerhans, such as, for example, abnormal shape or colour.
has_exact_synonym: abnormal morphology of islets of Langerhans

abnormal limb segment morphology
type: Class
subclass of: abnormal limb segment
subclass of: abnormal organism subdivision morphology
definition: Any unspecified morphological anomaly of the limb segment, such as, for example, abnormal shape or colour.
has_exact_synonym: abnormal morphology of limb segment

abnormal nucleus accumbens morphology
type: Class
subclass of: abnormal nucleus accumbens
subclass of: abnormal neural nucleus morphology
definition: Any unspecified morphological anomaly of the nucleus accumbens, such as, for example, abnormal shape or colour.
has_exact_synonym: abnormal morphology of nucleus accumbens

abnormal blastema morphology
type: Class
subclass of: abnormal blastema
subclass of: abnormal regenerating tissue morphology
definition: Any unspecified morphological anomaly of the blastema, such as, for example, abnormal shape or colour.
has_exact_synonym: abnormal morphology of blastema

abnormal ventral aorta morphology
type: Class
subclass of: abnormal ventral aorta
subclass of: abnormal aorta morphology
definition: Any unspecified morphological anomaly of the ventral aorta, such as, for example, abnormal shape or colour.
has_exact_synonym: abnormal morphology of ventral aorta

abnormal pulmonary artery morphology
type: Class
subclass of: abnormal pulmonary artery
subclass of: abnormal artery morphology
definition: Any unspecified morphological anomaly of the pulmonary artery, such as, for example, abnormal shape or colour.
has_exact_synonym: abnormal morphology of pulmonary artery

abnormal trabecula cranii morphology
type: Class
subclass of: abnormal trabecula cranii
subclass of: abnormal cartilage element morphology
definition: Any unspecified morphological anomaly of the trabecula cranii, such as, for example, abnormal shape or colour.
has_exact_synonym: abnormal morphology of trabecula cranii

abnormal right channel of ventral aorta morphology
type: Class
subclass of: abnormal right channel of ventral aorta
subclass of: abnormal artery morphology
definition: Any unspecified morphological anomaly of the right channel of ventral aorta, such as, for example, abnormal shape or colour.
has_exact_synonym: abnormal morphology of right channel of ventral aorta

abnormal second pancreatic bud morphology
type: Class
subclass of: abnormal second pancreatic bud
subclass of: abnormal multi-tissue structure morphology
definition: Any unspecified morphological anomaly of the second pancreatic bud, such as, for example, abnormal shape or colour.
has_exact_synonym: abnormal morphology of second pancreatic bud

abnormal first pancreatic bud morphology
type: Class
subclass of: abnormal first pancreatic bud
subclass of: abnormal primordium morphology
definition: Any unspecified morphological anomaly of the first pancreatic bud, such as, for example, abnormal shape or colour.
has_exact_synonym: abnormal morphology of first pancreatic bud

abnormal hepato-pancreatic progenitor cell morphology
type: Class
subclass of: abnormal hepato-pancreatic progenitor cell
subclass of: abnormal progenitor cell morphology
definition: Any unspecified morphological anomaly of the hepato-pancreatic progenitor cell, such as, for example, abnormal shape or colour.
has_exact_synonym: abnormal morphology of hepato-pancreatic progenitor cell

abnormal ionocyte morphology
type: Class
subclass of: abnormal ionocyte
subclass of: abnormal non-ciliated epithelial cell morphology
definition: Any unspecified morphological anomaly of the ionocyte, such as, for example, abnormal shape or colour.
has_exact_synonym: abnormal morphology of ionocyte

abnormal epithelial cell morphology
type: Class
subclass of: abnormal epithelial cell
subclass of: abnormal cell morphology
definition: Any unspecified morphological anomaly of the epithelial cell, such as, for example, abnormal shape or colour.
has_exact_synonym: abnormal morphology of epithelial cell

abnormal basal ganglion morphology
type: Class
subclass of: abnormal basal ganglion
subclass of: abnormal anatomical cluster morphology
definition: Any unspecified morphological anomaly of the basal ganglion, such as, for example, abnormal shape or colour.
has_exact_synonym: abnormal morphology of basal ganglion

abnormal semicircular canal morphology
type: Class
subclass of: abnormal semicircular canal
subclass of: abnormal tissue morphology
definition: Any unspecified morphological anomaly of the semicircular canal, such as, for example, abnormal shape or colour.
has_exact_synonym: abnormal morphology of semicircular canal

abnormal membrane bone morphology
type: Class
subclass of: abnormal membrane bone
subclass of: abnormal bone element morphology
definition: Any unspecified morphological anomaly of the membrane bone, such as, for example, abnormal shape or colour.
has_exact_synonym: abnormal morphology of membrane bone

abnormal bone element morphology
type: Class
subclass of: abnormal bone element
subclass of: abnormal skeletal element morphology
definition: Any unspecified morphological anomaly of the bone element, such as, for example, abnormal shape or colour.
has_exact_synonym: abnormal morphology of bone element

abnormal facial nerve morphology
type: Class
subclass of: abnormal facial nerve
subclass of: abnormal cranial nerve morphology
definition: Any unspecified morphological anomaly of the facial nerve, such as, for example, abnormal shape or colour.
has_exact_synonym: abnormal morphology of facial nerve

abnormal lateral semicircular canal morphology
type: Class
subclass of: abnormal lateral semicircular canal
subclass of: abnormal semicircular canal morphology
definition: Any unspecified morphological anomaly of the lateral semicircular canal, such as, for example, abnormal shape or colour.
has_exact_synonym: abnormal morphology of lateral semicircular canal

abnormal endocrine system morphology
type: Class
subclass of: abnormal endocrine system
subclass of: abnormal anatomical system morphology
definition: Any unspecified morphological anomaly of the endocrine system, such as, for example, abnormal shape or colour.
has_exact_synonym: abnormal morphology of endocrine system

abnormal vertebral element morphology
type: Class
subclass of: abnormal vertebral element
subclass of: abnormal skeletal element morphology
definition: Any unspecified morphological anomaly of the vertebral element, such as, for example, abnormal shape or colour.
has_exact_synonym: abnormal morphology of vertebral element

abnormal hindlimb skeleton morphology
type: Class
subclass of: abnormal hindlimb skeleton
subclass of: abnormal skeletal subdivision morphology
definition: Any unspecified morphological anomaly of the hindlimb skeleton, such as, for example, abnormal shape or colour.
has_exact_synonym: abnormal morphology of hindlimb skeleton

abnormal skeletal subdivision morphology
type: Class
subclass of: abnormal skeletal subdivision
subclass of: abnormal anatomical cluster morphology
definition: Any unspecified morphological anomaly of the skeletal subdivision, such as, for example, abnormal shape or colour.
has_exact_synonym: abnormal morphology of skeletal subdivision

abnormal photoreceptor layer morphology
type: Class
subclass of: abnormal photoreceptor layer
subclass of: abnormal tissue morphology
definition: Any unspecified morphological anomaly of the photoreceptor layer, such as, for example, abnormal shape or colour.
has_exact_synonym: abnormal morphology of photoreceptor layer

abnormal brain ventricle morphology
type: Class
subclass of: abnormal brain ventricle
subclass of: abnormal anatomical space morphology
definition: Any unspecified morphological anomaly of the brain ventricle, such as, for example, abnormal shape or colour.
has_exact_synonym: abnormal morphology of brain ventricle

abnormal compound organ morphology
type: Class
subclass of: abnormal compound organ
subclass of: abnormal multicellular anatomical structure morphology
definition: Any unspecified morphological anomaly of the compound organ, such as, for example, abnormal shape or colour.
has_exact_synonym: abnormal morphology of compound organ

abnormal lymphatic system morphology
type: Class
subclass of: abnormal lymphatic system
subclass of: abnormal anatomical system morphology
definition: Any unspecified morphological anomaly of the lymphatic system, such as, for example, abnormal shape or colour.
has_exact_synonym: abnormal morphology of lymphatic system

abnormal pars nervosa morphology
type: Class
subclass of: abnormal pars nervosa
subclass of: abnormal multi-tissue structure morphology
definition: Any unspecified morphological anomaly of the pars nervosa, such as, for example, abnormal shape or colour.
has_exact_synonym: abnormal morphology of pars nervosa

abnormal anterior entopeduncular nucleus morphology
type: Class
subclass of: abnormal anterior entopeduncular nucleus
subclass of: abnormal neural nucleus morphology
definition: Any unspecified morphological anomaly of the anterior entopeduncular nucleus, such as, for example, abnormal shape or colour.
has_exact_synonym: abnormal morphology of anterior entopeduncular nucleus

abnormal oval window morphology
type: Class
subclass of: abnormal oval window
subclass of: abnormal anatomical space morphology
definition: Any unspecified morphological anomaly of the oval window, such as, for example, abnormal shape or colour.
has_exact_synonym: abnormal morphology of oval window

abnormal mm. constrictores branchiales IV primordium morphology
type: Class
subclass of: abnormal mm. constrictores branchiales IV primordium
subclass of: abnormal cranial muscle primordium morphology
definition: Any unspecified morphological anomaly of the mm. constrictores branchiales IV primordium, such as, for example, abnormal shape or colour.
has_exact_synonym: abnormal morphology of mm. constrictores branchiales IV primordium

abnormal claw morphology
type: Class
subclass of: abnormal claw
subclass of: abnormal acellular anatomical structure morphology
definition: Any unspecified morphological anomaly of the claw, such as, for example, abnormal shape or colour.
has_exact_synonym: abnormal morphology of claw

abnormal acellular anatomical structure morphology
type: Class
subclass of: abnormal acellular anatomical structure
subclass of: abnormal anatomical structure morphology
definition: Any unspecified morphological anomaly of the acellular anatomical structure, such as, for example, abnormal shape or colour.
has_exact_synonym: abnormal morphology of acellular anatomical structure

abnormal hindlimb digit 1 morphology
type: Class
subclass of: abnormal hindlimb digit 1
subclass of: abnormal hindlimb digit morphology
definition: Any unspecified morphological anomaly of the hindlimb digit 1, such as, for example, abnormal shape or colour.
has_exact_synonym: abnormal morphology of hindlimb digit 1

abnormal wound epidermis inner layer morphology
type: Class
subclass of: abnormal wound epidermis inner layer
subclass of: abnormal regenerating tissue morphology
definition: Any unspecified morphological anomaly of the wound epidermis inner layer, such as, for example, abnormal shape or colour.
has_exact_synonym: abnormal morphology of wound epidermis inner layer

abnormal right lymph heart morphology
type: Class
subclass of: abnormal right lymph heart
subclass of: abnormal cavitated compound organ morphology
definition: Any unspecified morphological anomaly of the right lymph heart, such as, for example, abnormal shape or colour.
has_exact_synonym: abnormal morphology of right lymph heart

abnormal midbrain tegmentum morphology
type: Class
subclass of: abnormal midbrain tegmentum
subclass of: abnormal multi-tissue structure morphology
definition: Any unspecified morphological anomaly of the midbrain tegmentum, such as, for example, abnormal shape or colour.
has_exact_synonym: abnormal morphology of midbrain tegmentum

abnormal lateral line ganglion morphology
type: Class
subclass of: abnormal lateral line ganglion
subclass of: abnormal cranial ganglion morphology
definition: Any unspecified morphological anomaly of the lateral line ganglion, such as, for example, abnormal shape or colour.
has_exact_synonym: abnormal morphology of lateral line ganglion

abnormal cranial ganglion morphology
type: Class
subclass of: abnormal cranial ganglion
subclass of: abnormal ganglion morphology
definition: Any unspecified morphological anomaly of the cranial ganglion, such as, for example, abnormal shape or colour.
has_exact_synonym: abnormal morphology of cranial ganglion

abnormal trunk somite 13 morphology
type: Class
subclass of: abnormal trunk somite 13
subclass of: abnormal trunk somite morphology
definition: Any unspecified morphological anomaly of the trunk somite 13, such as, for example, abnormal shape or colour.
has_exact_synonym: abnormal morphology of trunk somite 13

abnormal avascular GAG-rich matrix morphology
type: Class
subclass of: abnormal avascular GAG-rich matrix
subclass of: abnormal proteinaceous extracellular matrix morphology
definition: Any unspecified morphological anomaly of the avascular GAG-rich matrix, such as, for example, abnormal shape or colour.
has_exact_synonym: abnormal morphology of avascular GAG-rich matrix

abnormal non-mineralized cartilage tissue morphology
type: Class
subclass of: abnormal non-mineralized cartilage tissue
subclass of: abnormal cartilage tissue morphology
definition: Any unspecified morphological anomaly of the non-mineralized cartilage tissue, such as, for example, abnormal shape or colour.
has_exact_synonym: abnormal morphology of non-mineralized cartilage tissue

abnormal proteinaceous extracellular matrix morphology
type: Class
subclass of: abnormal proteinaceous extracellular matrix
subclass of: abnormal extracellular matrix morphology
definition: Any unspecified morphological anomaly of the proteinaceous extracellular matrix, such as, for example, abnormal shape or colour.
has_exact_synonym: abnormal morphology of proteinaceous extracellular matrix

abnormal caudal vertebra morphology
type: Class
subclass of: abnormal caudal vertebra
subclass of: abnormal vertebra morphology
definition: Any unspecified morphological anomaly of the caudal vertebra, such as, for example, abnormal shape or colour.
has_exact_synonym: abnormal morphology of caudal vertebra

abnormal vertebra morphology
type: Class
subclass of: abnormal vertebra
subclass of: abnormal endochondral bone morphology
definition: Any unspecified morphological anomaly of the vertebra, such as, for example, abnormal shape or colour.
has_exact_synonym: abnormal morphology of vertebra

abnormal astrocyte end-foot morphology
type: Class
subclass of: abnormal astrocyte end-foot
subclass of: abnormal cell part morphology
definition: Any unspecified morphological anomaly of the astrocyte end-foot, such as, for example, abnormal shape or colour.
has_exact_synonym: abnormal morphology of astrocyte end-foot

abnormal pelvic appendage morphology
type: Class
subclass of: abnormal pelvic appendage
subclass of: abnormal paired appendage morphology
definition: Any unspecified morphological anomaly of the pelvic appendage, such as, for example, abnormal shape or colour.
has_exact_synonym: abnormal morphology of pelvic appendage

abnormal paired appendage morphology
type: Class
subclass of: abnormal paired appendage
subclass of: abnormal appendage morphology
definition: Any unspecified morphological anomaly of the paired appendage, such as, for example, abnormal shape or colour.
has_exact_synonym: abnormal morphology of paired appendage

abnormal diaphysis morphology
type: Class
subclass of: abnormal diaphysis
subclass of: abnormal organ part morphology
definition: Any unspecified morphological anomaly of the diaphysis, such as, for example, abnormal shape or colour.
has_exact_synonym: abnormal morphology of diaphysis

abnormal organ part morphology
type: Class
subclass of: abnormal organ part
subclass of: abnormal anatomical structure morphology
definition: Any unspecified morphological anomaly of the organ part, such as, for example, abnormal shape or colour.
has_exact_synonym: abnormal morphology of organ part

abnormal endocardium morphology
type: Class
subclass of: abnormal endocardium
subclass of: abnormal tissue morphology
definition: Any unspecified morphological anomaly of the endocardium, such as, for example, abnormal shape or colour.
has_exact_synonym: abnormal morphology of endocardium

abnormal dermomyotome morphology
type: Class
subclass of: abnormal dermomyotome
subclass of: abnormal multilaminar epithelium morphology
definition: Any unspecified morphological anomaly of the dermomyotome, such as, for example, abnormal shape or colour.
has_exact_synonym: abnormal morphology of dermomyotome

abnormal multilaminar epithelium morphology
type: Class
subclass of: abnormal multilaminar epithelium
subclass of: abnormal epithelium morphology
definition: Any unspecified morphological anomaly of the multilaminar epithelium, such as, for example, abnormal shape or colour.
has_exact_synonym: abnormal morphology of multilaminar epithelium

abnormal aortic arch 4 morphology
type: Class
subclass of: abnormal aortic arch 4
subclass of: abnormal aortic arch morphology
definition: Any unspecified morphological anomaly of the aortic arch 4, such as, for example, abnormal shape or colour.
has_exact_synonym: abnormal morphology of aortic arch 4

abnormal prethalamus morphology
type: Class
subclass of: abnormal prethalamus
subclass of: abnormal multi-tissue structure morphology
definition: Any unspecified morphological anomaly of the prethalamus, such as, for example, abnormal shape or colour.
has_exact_synonym: abnormal morphology of prethalamus

abnormal posterior crista morphology
type: Class
subclass of: abnormal posterior crista
subclass of: abnormal sensory epithelial cell morphology
definition: Any unspecified morphological anomaly of the posterior crista, such as, for example, abnormal shape or colour.
has_exact_synonym: abnormal morphology of posterior crista

abnormal sensory epithelial cell morphology
type: Class
subclass of: abnormal sensory epithelial cell
subclass of: abnormal epithelial cell morphology
definition: Any unspecified morphological anomaly of the sensory epithelial cell, such as, for example, abnormal shape or colour.
has_exact_synonym: abnormal morphology of sensory epithelial cell

abnormal trunk neural crest morphology
type: Class
subclass of: abnormal trunk neural crest
subclass of: XPO_0141500
definition: Any unspecified morphological anomaly of the trunk neural crest, such as, for example, abnormal shape or colour.
has_exact_synonym: abnormal morphology of trunk neural crest

abnormal wound epidermis morphology
type: Class
subclass of: abnormal wound epidermis
subclass of: abnormal regenerating tissue morphology
definition: Any unspecified morphological anomaly of the wound epidermis, such as, for example, abnormal shape or colour.
has_exact_synonym: abnormal morphology of wound epidermis

abnormal circulatory system morphology
type: Class
subclass of: abnormal circulatory system
subclass of: abnormal anatomical system morphology
definition: Any unspecified morphological anomaly of the circulatory system, such as, for example, abnormal shape or colour.
has_exact_synonym: abnormal morphology of circulatory system

abnormal mesonephric tubule morphology
type: Class
subclass of: abnormal mesonephric tubule
subclass of: abnormal tissue morphology
definition: Any unspecified morphological anomaly of the mesonephric tubule, such as, for example, abnormal shape or colour.
has_exact_synonym: abnormal morphology of mesonephric tubule

abnormal mesonephric nephron morphology
type: Class
subclass of: abnormal mesonephric nephron
subclass of: abnormal multi-tissue structure morphology
definition: Any unspecified morphological anomaly of the mesonephric nephron, such as, for example, abnormal shape or colour.
has_exact_synonym: abnormal morphology of mesonephric nephron

abnormal coelom morphology
type: Class
subclass of: abnormal coelom
subclass of: abnormal anatomical space morphology
definition: Any unspecified morphological anomaly of the coelom, such as, for example, abnormal shape or colour.
has_exact_synonym: abnormal morphology of coelom

abnormal visual system morphology
type: Class
subclass of: abnormal visual system
subclass of: abnormal sensory system morphology
definition: Any unspecified morphological anomaly of the visual system, such as, for example, abnormal shape or colour.
has_exact_synonym: abnormal morphology of visual system

abnormal sensory system morphology
type: Class
subclass of: abnormal sensory system
subclass of: abnormal anatomical system morphology
definition: Any unspecified morphological anomaly of the sensory system, such as, for example, abnormal shape or colour.
has_exact_synonym: abnormal morphology of sensory system

abnormal skeletal muscle morphology
type: Class
subclass of: abnormal skeletal muscle
subclass of: abnormal muscle morphology
definition: Any unspecified morphological anomaly of the skeletal muscle, such as, for example, abnormal shape or colour.
has_exact_synonym: abnormal morphology of skeletal muscle

abnormal blastocoel morphology
type: Class
subclass of: abnormal blastocoel
subclass of: abnormal anatomical space morphology
definition: Any unspecified morphological anomaly of the blastocoel, such as, for example, abnormal shape or colour.
has_exact_synonym: abnormal morphology of blastocoel

abnormal follicle cell morphology
type: Class
subclass of: abnormal follicle cell
subclass of: abnormal cell morphology
definition: Any unspecified morphological anomaly of the follicle cell, such as, for example, abnormal shape or colour.
has_exact_synonym: abnormal morphology of follicle cell

abnormal non-neural ectoderm morphology
type: Class
subclass of: abnormal non-neural ectoderm
subclass of: abnormal tissue morphology
definition: Any unspecified morphological anomaly of the non-neural ectoderm, such as, for example, abnormal shape or colour.
has_exact_synonym: abnormal morphology of non-neural ectoderm

abnormal dorsal fin skeleton morphology
type: Class
subclass of: abnormal dorsal fin skeleton
subclass of: abnormal median fin skeleton morphology
definition: Any unspecified morphological anomaly of the dorsal fin skeleton, such as, for example, abnormal shape or colour.
has_exact_synonym: abnormal morphology of dorsal fin skeleton

abnormal median fin skeleton morphology
type: Class
subclass of: abnormal median fin skeleton
subclass of: abnormal skeletal subdivision morphology
definition: Any unspecified morphological anomaly of the median fin skeleton, such as, for example, abnormal shape or colour.
has_exact_synonym: abnormal morphology of median fin skeleton

abnormal pelvic girdle primordium morphology
type: Class
subclass of: abnormal pelvic girdle primordium
subclass of: abnormal multi-tissue structure morphology
definition: Any unspecified morphological anomaly of the pelvic girdle primordium, such as, for example, abnormal shape or colour.
has_exact_synonym: abnormal morphology of pelvic girdle primordium

abnormal sclerotomal cartilage morphology
type: Class
subclass of: abnormal sclerotomal cartilage
subclass of: abnormal tissue morphology
definition: Any unspecified morphological anomaly of the sclerotomal cartilage, such as, for example, abnormal shape or colour.
has_exact_synonym: abnormal morphology of sclerotomal cartilage

abnormal tail vasculature morphology
type: Class
subclass of: abnormal tail vasculature
subclass of: abnormal blood vessel morphology
definition: Any unspecified morphological anomaly of the tail vasculature, such as, for example, abnormal shape or colour.
has_exact_synonym: abnormal morphology of tail vasculature

abnormal progenitor cell morphology
type: Class
subclass of: abnormal progenitor cell
subclass of: abnormal cell morphology
definition: Any unspecified morphological anomaly of the progenitor cell, such as, for example, abnormal shape or colour.
has_exact_synonym: abnormal morphology of progenitor cell

abnormal heart primordium morphology
type: Class
subclass of: abnormal heart primordium
subclass of: abnormal primordium morphology
definition: Any unspecified morphological anomaly of the heart primordium, such as, for example, abnormal shape or colour.
has_exact_synonym: abnormal morphology of heart primordium

abnormal chondroblast morphology
type: Class
subclass of: abnormal chondroblast
subclass of: abnormal cell morphology
definition: Any unspecified morphological anomaly of the chondroblast, such as, for example, abnormal shape or colour.
has_exact_synonym: abnormal morphology of chondroblast

abnormal trunk somite 9 morphology
type: Class
subclass of: abnormal trunk somite 9
subclass of: abnormal trunk somite morphology
definition: Any unspecified morphological anomaly of the trunk somite 9, such as, for example, abnormal shape or colour.
has_exact_synonym: abnormal morphology of trunk somite 9

abnormal trunk somite 10 morphology
type: Class
subclass of: abnormal trunk somite 10
subclass of: abnormal trunk somite morphology
definition: Any unspecified morphological anomaly of the trunk somite 10, such as, for example, abnormal shape or colour.
has_exact_synonym: abnormal morphology of trunk somite 10

abnormal pronephric duct morphology
type: Class
subclass of: abnormal pronephric duct
subclass of: abnormal duct morphology
definition: Any unspecified morphological anomaly of the pronephric duct, such as, for example, abnormal shape or colour.
has_exact_synonym: abnormal morphology of pronephric duct

abnormal duct morphology
type: Class
subclass of: abnormal duct
subclass of: abnormal multi-tissue structure morphology
definition: Any unspecified morphological anomaly of the duct, such as, for example, abnormal shape or colour.
has_exact_synonym: abnormal morphology of duct

abnormal extracellular matrix morphology
type: Class
subclass of: abnormal extracellular matrix
subclass of: abnormal acellular anatomical structure morphology
definition: Any unspecified morphological anomaly of the extracellular matrix, such as, for example, abnormal shape or colour.
has_exact_synonym: abnormal morphology of extracellular matrix

obsolete abnormal morphology of tail region
type: Class
IAO_0000125: abnormal tail morphology
deprecated: true

abnormal humerus morphology
type: Class
subclass of: abnormal humerus
subclass of: abnormal endochondral bone morphology
definition: Any unspecified morphological anomaly of the humerus, such as, for example, abnormal shape or colour.
has_exact_synonym: abnormal morphology of humerus

abnormal vagal epibranchial placode morphology
type: Class
subclass of: abnormal vagal epibranchial placode
subclass of: abnormal epibranchial placode morphology
definition: Any unspecified morphological anomaly of the vagal epibranchial placode, such as, for example, abnormal shape or colour.
has_exact_synonym: abnormal morphology of vagal epibranchial placode

abnormal epibranchial placode morphology
type: Class
subclass of: abnormal epibranchial placode
subclass of: abnormal neurogenic placode morphology
definition: Any unspecified morphological anomaly of the epibranchial placode, such as, for example, abnormal shape or colour.
has_exact_synonym: abnormal morphology of epibranchial placode

abnormal gamma cell morphology
type: Class
subclass of: abnormal gamma cell
subclass of: abnormal enteroendocrine cell morphology
definition: Any unspecified morphological anomaly of the gamma cell, such as, for example, abnormal shape or colour.
has_exact_synonym: abnormal morphology of gamma cell

abnormal medulla oblongata morphology
type: Class
subclass of: abnormal medulla oblongata
subclass of: abnormal multi-tissue structure morphology
definition: Any unspecified morphological anomaly of the medulla oblongata, such as, for example, abnormal shape or colour.
has_exact_synonym: abnormal morphology of medulla oblongata

abnormal fin morphology
type: Class
subclass of: abnormal fin
subclass of: abnormal surface structure morphology
definition: Any unspecified morphological anomaly of the fin, such as, for example, abnormal shape or colour.
has_exact_synonym: abnormal morphology of fin

abnormal tail fin morphology
type: Class
subclass of: abnormal tail fin
subclass of: abnormal fin morphology
definition: Any unspecified morphological anomaly of the tail fin, such as, for example, abnormal shape or colour.
has_exact_synonym: abnormal morphology of tail fin

abnormal blastomere morphology
type: Class
subclass of: abnormal blastomere
subclass of: abnormal early embryonic cell morphology
definition: Any unspecified morphological anomaly of the blastomere, such as, for example, abnormal shape or colour.
has_exact_synonym: abnormal morphology of blastomere

abnormal early embryonic cell morphology
type: Class
subclass of: abnormal early embryonic cell
subclass of: abnormal cell morphology
definition: Any unspecified morphological anomaly of the early embryonic cell, such as, for example, abnormal shape or colour.
has_exact_synonym: abnormal morphology of early embryonic cell

abnormal vegetal hemisphere morphology
type: Class
subclass of: abnormal vegetal hemisphere
subclass of: XPO_0141316
definition: Any unspecified morphological anomaly of the vegetal hemisphere, such as, for example, abnormal shape or colour.
has_exact_synonym: abnormal morphology of vegetal hemisphere

abnormal elastic cartilage tissue morphology
type: Class
subclass of: abnormal elastic cartilage tissue
subclass of: abnormal non-mineralized hyaline cartilage tissue morphology
definition: Any unspecified morphological anomaly of the elastic cartilage tissue, such as, for example, abnormal shape or colour.
has_exact_synonym: abnormal morphology of elastic cartilage tissue

abnormal non-mineralized hyaline cartilage tissue morphology
type: Class
subclass of: abnormal non-mineralized hyaline cartilage tissue
subclass of: abnormal non-mineralized cartilage tissue morphology
subclass of: abnormal hyaline cartilage tissue morphology
definition: Any unspecified morphological anomaly of the non-mineralized hyaline cartilage tissue, such as, for example, abnormal shape or colour.
has_exact_synonym: abnormal morphology of non-mineralized hyaline cartilage tissue

abnormal blastopore lip morphology
type: Class
subclass of: abnormal blastopore lip
subclass of: abnormal embryonic structure morphology
definition: Any unspecified morphological anomaly of the blastopore lip, such as, for example, abnormal shape or colour.
has_exact_synonym: abnormal morphology of blastopore lip

abnormal neurohypophysis morphology
type: Class
subclass of: abnormal neurohypophysis
subclass of: abnormal multi-tissue structure morphology
definition: Any unspecified morphological anomaly of the neurohypophysis, such as, for example, abnormal shape or colour.
has_exact_synonym: abnormal morphology of neurohypophysis

abnormal gamete morphology
type: Class
subclass of: abnormal gamete
subclass of: abnormal germ cell morphology
definition: Any unspecified morphological anomaly of the gamete, such as, for example, abnormal shape or colour.
has_exact_synonym: abnormal morphology of gamete

abnormal respiratory system morphology
type: Class
subclass of: abnormal respiratory system
subclass of: abnormal anatomical system morphology
definition: Any unspecified morphological anomaly of the respiratory system, such as, for example, abnormal shape or colour.
has_exact_synonym: abnormal morphology of respiratory system

abnormal middle lateral line morphology
type: Class
subclass of: abnormal middle lateral line
subclass of: abnormal lateral line morphology
definition: Any unspecified morphological anomaly of the middle lateral line, such as, for example, abnormal shape or colour.
has_exact_synonym: abnormal morphology of middle lateral line

abnormal lateral line morphology
type: Class
subclass of: abnormal lateral line
subclass of: abnormal tissue morphology
definition: Any unspecified morphological anomaly of the lateral line, such as, for example, abnormal shape or colour.
has_exact_synonym: abnormal morphology of lateral line

abnormal eye muscle morphology
type: Class
subclass of: abnormal eye muscle
subclass of: abnormal cranial muscle morphology
definition: Any unspecified morphological anomaly of the eye muscle, such as, for example, abnormal shape or colour.
has_exact_synonym: abnormal morphology of eye muscle

abnormal m. obliquus superior primordium morphology
type: Class
subclass of: abnormal m. obliquus superior primordium
subclass of: abnormal cranial muscle primordium morphology
definition: Any unspecified morphological anomaly of the m. obliquus superior primordium, such as, for example, abnormal shape or colour.
has_exact_synonym: abnormal morphology of m. obliquus superior primordium

abnormal intersomitic artery morphology
type: Class
subclass of: abnormal intersomitic artery
subclass of: abnormal intersomitic vessel morphology
definition: Any unspecified morphological anomaly of the intersomitic artery, such as, for example, abnormal shape or colour.
has_exact_synonym: abnormal morphology of intersomitic artery

abnormal intersomitic vessel morphology
type: Class
subclass of: abnormal intersomitic vessel
subclass of: abnormal blood vessel morphology
definition: Any unspecified morphological anomaly of the intersomitic vessel, such as, for example, abnormal shape or colour.
has_exact_synonym: abnormal morphology of intersomitic vessel

abnormal axial skeleton morphology
type: Class
subclass of: abnormal axial skeleton
subclass of: abnormal skeletal subdivision morphology
definition: Any unspecified morphological anomaly of the axial skeleton, such as, for example, abnormal shape or colour.
has_exact_synonym: abnormal morphology of axial skeleton

abnormal visceral pouch morphology
type: Class
subclass of: abnormal visceral pouch
subclass of: abnormal embryonic structure morphology
definition: Any unspecified morphological anomaly of the visceral pouch, such as, for example, abnormal shape or colour.
has_exact_synonym: abnormal morphology of visceral pouch

abnormal supraorbital lateral line morphology
type: Class
subclass of: abnormal supraorbital lateral line
subclass of: abnormal lateral line morphology
definition: Any unspecified morphological anomaly of the supraorbital lateral line, such as, for example, abnormal shape or colour.
has_exact_synonym: abnormal morphology of supraorbital lateral line

abnormal retinal blood vessel morphology
type: Class
subclass of: abnormal retinal blood vessel
subclass of: abnormal blood vessel morphology
definition: Any unspecified morphological anomaly of the retinal blood vessel, such as, for example, abnormal shape or colour.
has_exact_synonym: abnormal morphology of retinal blood vessel

abnormal tympanic annulus morphology
type: Class
subclass of: abnormal tympanic annulus
subclass of: abnormal cartilage element morphology
definition: Any unspecified morphological anomaly of the tympanic annulus, such as, for example, abnormal shape or colour.
has_exact_synonym: abnormal morphology of tympanic annulus

abnormal m. interhyoideus primordium morphology
type: Class
subclass of: abnormal m. interhyoideus primordium
subclass of: abnormal cranial muscle primordium morphology
definition: Any unspecified morphological anomaly of the m. interhyoideus primordium, such as, for example, abnormal shape or colour.
has_exact_synonym: abnormal morphology of m. interhyoideus primordium

abnormal germinal granule morphology
type: Class
subclass of: abnormal germinal granule
subclass of: abnormal cell part morphology
definition: Any unspecified morphological anomaly of the germinal granule, such as, for example, abnormal shape or colour.
has_exact_synonym: abnormal morphology of germinal granule

abnormal pronephric mesenchyme morphology
type: Class
subclass of: abnormal pronephric mesenchyme
subclass of: abnormal mesenchyme morphology
definition: Any unspecified morphological anomaly of the pronephric mesenchyme, such as, for example, abnormal shape or colour.
has_exact_synonym: abnormal morphology of pronephric mesenchyme

abnormal trunk placode morphology
type: Class
subclass of: abnormal trunk placode
subclass of: abnormal embryonic structure morphology
definition: Any unspecified morphological anomaly of the trunk placode, such as, for example, abnormal shape or colour.
has_exact_synonym: abnormal morphology of trunk placode

abnormal commissural interneuron morphology
type: Class
subclass of: abnormal commissural interneuron
subclass of: abnormal interneuron morphology
definition: Any unspecified morphological anomaly of the commissural interneuron, such as, for example, abnormal shape or colour.
has_exact_synonym: abnormal morphology of commissural interneuron

abnormal interneuron morphology
type: Class
subclass of: abnormal interneuron
subclass of: abnormal neuron morphology
definition: Any unspecified morphological anomaly of the interneuron, such as, for example, abnormal shape or colour.
has_exact_synonym: abnormal morphology of interneuron

abnormal zygote morphology
type: Class
subclass of: abnormal zygote
subclass of: abnormal cell morphology
definition: Any unspecified morphological anomaly of the zygote, such as, for example, abnormal shape or colour.
has_exact_synonym: abnormal morphology of zygote

abnormal lateral ganglionic eminence morphology
type: Class
subclass of: abnormal lateral ganglionic eminence
subclass of: abnormal tissue morphology
definition: Any unspecified morphological anomaly of the lateral ganglionic eminence, such as, for example, abnormal shape or colour.
has_exact_synonym: abnormal morphology of lateral ganglionic eminence

abnormal circumblastoporal collar morphology
type: Class
subclass of: abnormal circumblastoporal collar
subclass of: abnormal embryonic structure morphology
definition: Any unspecified morphological anomaly of the circumblastoporal collar, such as, for example, abnormal shape or colour.
has_exact_synonym: abnormal morphology of circumblastoporal collar

abnormal midbrain morphology
type: Class
subclass of: abnormal midbrain
subclass of: abnormal multi-tissue structure morphology
definition: Any unspecified morphological anomaly of the midbrain, such as, for example, abnormal shape or colour.
has_exact_synonym: abnormal morphology of midbrain

abnormal hand morphology
type: Class
subclass of: abnormal hand
subclass of: abnormal autopod morphology
definition: Any unspecified morphological anomaly of the hand, such as, for example, abnormal shape or colour.
has_exact_synonym: abnormal morphology of hand

abnormal forelimb skeleton morphology
type: Class
subclass of: abnormal forelimb skeleton
subclass of: abnormal skeletal subdivision morphology
definition: Any unspecified morphological anomaly of the forelimb skeleton, such as, for example, abnormal shape or colour.
has_exact_synonym: abnormal morphology of forelimb skeleton

abnormal lateral plate mesoderm morphology
type: Class
subclass of: abnormal lateral plate mesoderm
subclass of: abnormal embryonic structure morphology
definition: Any unspecified morphological anomaly of the lateral plate mesoderm, such as, for example, abnormal shape or colour.
has_exact_synonym: abnormal morphology of lateral plate mesoderm

abnormal portion of organism substance morphology
type: Class
subclass of: abnormal portion of organism substance
definition: Any unspecified morphological anomaly of the portion of organism substance, such as, for example, abnormal shape or colour.
has_exact_synonym: abnormal morphology of portion of organism substance

abnormal hyaline cartilage tissue morphology
type: Class
subclass of: abnormal hyaline cartilage tissue
subclass of: abnormal cartilage tissue morphology
definition: Any unspecified morphological anomaly of the hyaline cartilage tissue, such as, for example, abnormal shape or colour.
has_exact_synonym: abnormal morphology of hyaline cartilage tissue

abnormal anterior neural fold morphology
type: Class
subclass of: abnormal anterior neural fold
subclass of: abnormal tissue morphology
definition: Any unspecified morphological anomaly of the anterior neural fold, such as, for example, abnormal shape or colour.
has_exact_synonym: abnormal morphology of anterior neural fold

abnormal axial ossicle morphology
type: Class
subclass of: abnormal axial ossicle
subclass of: abnormal ossicle morphology
definition: Any unspecified morphological anomaly of the axial ossicle, such as, for example, abnormal shape or colour.
has_exact_synonym: abnormal morphology of axial ossicle

abnormal ossicle morphology
type: Class
subclass of: abnormal ossicle
subclass of: abnormal skeletal element morphology
definition: Any unspecified morphological anomaly of the ossicle, such as, for example, abnormal shape or colour.
has_exact_synonym: abnormal morphology of ossicle

abnormal appendicular skeleton morphology
type: Class
subclass of: abnormal appendicular skeleton
subclass of: abnormal skeletal subdivision morphology
definition: Any unspecified morphological anomaly of the appendicular skeleton, such as, for example, abnormal shape or colour.
has_exact_synonym: abnormal morphology of appendicular skeleton

abnormal granule cell morphology
type: Class
subclass of: abnormal granule cell
subclass of: abnormal interneuron morphology
definition: Any unspecified morphological anomaly of the granule cell, such as, for example, abnormal shape or colour.
has_exact_synonym: abnormal morphology of granule cell

abnormal neural plate border morphology
type: Class
subclass of: abnormal neural plate border
subclass of: abnormal tissue morphology
definition: Any unspecified morphological anomaly of the neural plate border, such as, for example, abnormal shape or colour.
has_exact_synonym: abnormal morphology of neural plate border

abnormal amygdala morphology
type: Class
subclass of: abnormal amygdala
subclass of: abnormal anatomical cluster morphology
definition: Any unspecified morphological anomaly of the amygdala, such as, for example, abnormal shape or colour.
has_exact_synonym: abnormal morphology of amygdala

abnormal striatum morphology
type: Class
subclass of: abnormal striatum
subclass of: abnormal anatomical cluster morphology
definition: Any unspecified morphological anomaly of the striatum, such as, for example, abnormal shape or colour.
has_exact_synonym: abnormal morphology of striatum

abnormal m. rectus anterior primordium morphology
type: Class
subclass of: abnormal m. rectus anterior primordium
subclass of: abnormal cranial muscle primordium morphology
definition: Any unspecified morphological anomaly of the m. rectus anterior primordium, such as, for example, abnormal shape or colour.
has_exact_synonym: abnormal morphology of m. rectus anterior primordium

abnormal Leydig cell morphology
type: Class
subclass of: abnormal Leydig cell
subclass of: abnormal epithelial cell morphology
definition: Any unspecified morphological anomaly of the Leydig cell, such as, for example, abnormal shape or colour.
has_exact_synonym: abnormal morphology of Leydig cell

abnormal ganglion morphology
type: Class
subclass of: abnormal ganglion
subclass of: abnormal tissue morphology
definition: Any unspecified morphological anomaly of the ganglion, such as, for example, abnormal shape or colour.
has_exact_synonym: abnormal morphology of ganglion

abnormal trigeminal placode morphology
type: Class
subclass of: abnormal trigeminal placode
subclass of: abnormal neurogenic placode morphology
definition: Any unspecified morphological anomaly of the trigeminal placode, such as, for example, abnormal shape or colour.
has_exact_synonym: abnormal morphology of trigeminal placode

abnormal aortic arch 6 morphology
type: Class
subclass of: abnormal aortic arch 6
subclass of: abnormal aortic arch morphology
definition: Any unspecified morphological anomaly of the aortic arch 6, such as, for example, abnormal shape or colour.
has_exact_synonym: abnormal morphology of aortic arch 6

abnormal small intestine morphology
type: Class
subclass of: abnormal small intestine
subclass of: abnormal multi-tissue structure morphology
definition: Any unspecified morphological anomaly of the small intestine, such as, for example, abnormal shape or colour.
has_exact_synonym: abnormal morphology of small intestine

abnormal acinar cell morphology
type: Class
subclass of: abnormal acinar cell
subclass of: abnormal cell morphology
definition: Any unspecified morphological anomaly of the acinar cell, such as, for example, abnormal shape or colour.
has_exact_synonym: abnormal morphology of acinar cell

abnormal cardiovascular system morphology
type: Class
subclass of: abnormal cardiovascular system
subclass of: abnormal anatomical system morphology
definition: Any unspecified morphological anomaly of the cardiovascular system, such as, for example, abnormal shape or colour.
has_exact_synonym: abnormal morphology of cardiovascular system

abnormal mm. levator arcuum branchialium III primordium morphology
type: Class
subclass of: abnormal mm. levator arcuum branchialium III primordium
subclass of: abnormal cranial muscle primordium morphology
definition: Any unspecified morphological anomaly of the mm. levator arcuum branchialium III primordium, such as, for example, abnormal shape or colour.
has_exact_synonym: abnormal morphology of mm. levator arcuum branchialium III primordium

abnormal braincase and otic capsule skeleton morphology
type: Class
subclass of: abnormal braincase and otic capsule skeleton
subclass of: abnormal skeletal subdivision morphology
definition: Any unspecified morphological anomaly of the braincase and otic capsule skeleton, such as, for example, abnormal shape or colour.
has_exact_synonym: abnormal morphology of braincase and otic capsule skeleton

abnormal non-mineralized chondroid tissue morphology
type: Class
subclass of: abnormal non-mineralized chondroid tissue
subclass of: abnormal skeletal tissue morphology
definition: Any unspecified morphological anomaly of the non-mineralized chondroid tissue, such as, for example, abnormal shape or colour.
has_exact_synonym: abnormal morphology of non-mineralized chondroid tissue

abnormal skeletal tissue morphology
type: Class
subclass of: abnormal skeletal tissue
subclass of: abnormal connective tissue morphology
definition: Any unspecified morphological anomaly of the skeletal tissue, such as, for example, abnormal shape or colour.
has_exact_synonym: abnormal morphology of skeletal tissue

abnormal neural crest morphology
type: Class
subclass of: abnormal neural crest
subclass of: abnormal tissue morphology
definition: Any unspecified morphological anomaly of the neural crest, such as, for example, abnormal shape or colour.
has_exact_synonym: abnormal morphology of neural crest

abnormal m. levator mandibulae longus internus primordium morphology
type: Class
subclass of: abnormal m. levator mandibulae longus internus primordium
subclass of: abnormal cranial muscle primordium morphology
definition: Any unspecified morphological anomaly of the m. levator mandibulae longus internus primordium, such as, for example, abnormal shape or colour.
has_exact_synonym: abnormal morphology of m. levator mandibulae longus internus primordium

abnormal hyaloid blood vessel morphology
type: Class
subclass of: abnormal hyaloid blood vessel
subclass of: abnormal blood vessel morphology
definition: Any unspecified morphological anomaly of the hyaloid blood vessel, such as, for example, abnormal shape or colour.
has_exact_synonym: abnormal morphology of hyaloid blood vessel

abnormal hematological system morphology
type: Class
subclass of: abnormal hematological system
subclass of: abnormal anatomical system morphology
definition: Any unspecified morphological anomaly of the hematological system, such as, for example, abnormal shape or colour.
has_exact_synonym: abnormal morphology of hematological system

abnormal splanchnocranium morphology
type: Class
subclass of: abnormal splanchnocranium
subclass of: abnormal cranium morphology
definition: Any unspecified morphological anomaly of the splanchnocranium, such as, for example, abnormal shape or colour.
has_exact_synonym: abnormal morphology of splanchnocranium

abnormal pharyngeal endoderm morphology
type: Class
subclass of: abnormal pharyngeal endoderm
subclass of: abnormal tissue morphology
definition: Any unspecified morphological anomaly of the pharyngeal endoderm, such as, for example, abnormal shape or colour.
has_exact_synonym: abnormal morphology of pharyngeal endoderm

abnormal anterior entopeduncular region morphology
type: Class
subclass of: abnormal anterior entopeduncular region
subclass of: XPO_0141316
definition: Any unspecified morphological anomaly of the anterior entopeduncular region, such as, for example, abnormal shape or colour.
has_exact_synonym: abnormal morphology of anterior entopeduncular region

abnormal animal pole morphology
type: Class
subclass of: abnormal animal pole
subclass of: XPO_0141316
definition: Any unspecified morphological anomaly of the animal pole, such as, for example, abnormal shape or colour.
has_exact_synonym: abnormal morphology of animal pole

abnormal connective tissue morphology
type: Class
subclass of: abnormal connective tissue
subclass of: abnormal tissue morphology
definition: Any unspecified morphological anomaly of the connective tissue, such as, for example, abnormal shape or colour.
has_exact_synonym: abnormal morphology of connective tissue

abnormal perichondrium morphology
type: Class
subclass of: abnormal perichondrium
subclass of: abnormal connective tissue morphology
definition: Any unspecified morphological anomaly of the perichondrium, such as, for example, abnormal shape or colour.
has_exact_synonym: abnormal morphology of perichondrium

abnormal periosteum morphology
type: Class
subclass of: abnormal periosteum
subclass of: abnormal connective tissue morphology
definition: Any unspecified morphological anomaly of the periosteum, such as, for example, abnormal shape or colour.
has_exact_synonym: abnormal morphology of periosteum

abnormal m. levator mandibulae longus superficialis morphology
type: Class
subclass of: abnormal m. levator mandibulae longus superficialis
subclass of: abnormal mandibular head muscle morphology
definition: Any unspecified morphological anomaly of the m. levator mandibulae longus superficialis, such as, for example, abnormal shape or colour.
has_exact_synonym: abnormal morphology of m. levator mandibulae longus superficialis

abnormal mandibular head muscle morphology
type: Class
subclass of: abnormal mandibular head muscle
subclass of: abnormal cranial muscle morphology
definition: Any unspecified morphological anomaly of the mandibular head muscle, such as, for example, abnormal shape or colour.
has_exact_synonym: abnormal morphology of mandibular head muscle

abnormal interdigital mesenchyme morphology
type: Class
subclass of: abnormal interdigital mesenchyme
subclass of: abnormal mesenchyme morphology
definition: Any unspecified morphological anomaly of the interdigital mesenchyme, such as, for example, abnormal shape or colour.
has_exact_synonym: abnormal morphology of interdigital mesenchyme

abnormal amputated fin morphology
type: Class
subclass of: abnormal amputated fin
subclass of: abnormal amputated tissue morphology
definition: Any unspecified morphological anomaly of the amputated fin, such as, for example, abnormal shape or colour.
has_exact_synonym: abnormal morphology of amputated fin

abnormal amputated tissue morphology
type: Class
subclass of: abnormal amputated tissue
subclass of: abnormal tissue morphology
definition: Any unspecified morphological anomaly of the amputated tissue, such as, for example, abnormal shape or colour.
has_exact_synonym: abnormal morphology of amputated tissue

abnormal retinal neural layer morphology
type: Class
subclass of: abnormal retinal neural layer
subclass of: abnormal multi-tissue structure morphology
definition: Any unspecified morphological anomaly of the retinal neural layer, such as, for example, abnormal shape or colour.
has_exact_synonym: abnormal morphology of retinal neural layer

abnormal limb morphology
type: Class
subclass of: abnormal limb
subclass of: abnormal organism subdivision morphology
definition: Any unspecified morphological anomaly of the limb, such as, for example, abnormal shape or colour.
has_exact_synonym: abnormal morphology of limb

abnormal viscus morphology
type: Class
subclass of: abnormal viscus
subclass of: abnormal anatomical cluster morphology
definition: Any unspecified morphological anomaly of the viscus, such as, for example, abnormal shape or colour.
has_exact_synonym: abnormal morphology of viscus

abnormal adenohypophyseal placode morphology
type: Class
subclass of: abnormal adenohypophyseal placode
subclass of: XPO_0141287
definition: Any unspecified morphological anomaly of the adenohypophyseal placode, such as, for example, abnormal shape or colour.
has_exact_synonym: abnormal morphology of adenohypophyseal placode

abnormal cranial placode morphology
type: Class
subclass of: abnormal cranial placode
subclass of: abnormal embryonic structure morphology
definition: Any unspecified morphological anomaly of the cranial placode, such as, for example, abnormal shape or colour.
has_exact_synonym: abnormal morphology of cranial placode

abnormal m. levator mandibulae longus profundus primordium morphology
type: Class
subclass of: abnormal m. levator mandibulae longus profundus primordium
subclass of: abnormal cranial muscle primordium morphology
definition: Any unspecified morphological anomaly of the m. levator mandibulae longus profundus primordium, such as, for example, abnormal shape or colour.
has_exact_synonym: abnormal morphology of m. levator mandibulae longus profundus primordium

abnormal proximal stomach morphology
type: Class
subclass of: abnormal proximal stomach
subclass of: abnormal multi-tissue structure morphology
definition: Any unspecified morphological anomaly of the proximal stomach, such as, for example, abnormal shape or colour.
has_exact_synonym: abnormal morphology of proximal stomach

abnormal cilium morphology
type: Class
subclass of: abnormal cilium
subclass of: abnormal cell part morphology
definition: Any unspecified morphological anomaly of the cilium, such as, for example, abnormal shape or colour.
has_exact_synonym: abnormal morphology of cilium

abnormal involuting marginal zone morphology
type: Class
subclass of: abnormal involuting marginal zone
subclass of: abnormal marginal zone morphology
definition: Any unspecified morphological anomaly of the involuting marginal zone, such as, for example, abnormal shape or colour.
has_exact_synonym: abnormal morphology of involuting marginal zone

abnormal marginal zone morphology
type: Class
subclass of: abnormal marginal zone
subclass of: abnormal embryonic structure morphology
definition: Any unspecified morphological anomaly of the marginal zone, such as, for example, abnormal shape or colour.
has_exact_synonym: abnormal morphology of marginal zone

abnormal blastomere D1.1 morphology
type: Class
subclass of: abnormal blastomere D1.1
subclass of: abnormal dorsal animal hemisphere blastomere morphology
definition: Any unspecified morphological anomaly of the blastomere D1.1, such as, for example, abnormal shape or colour.
has_exact_synonym: abnormal morphology of blastomere D1.1

abnormal dorsal animal hemisphere blastomere morphology
type: Class
subclass of: abnormal dorsal animal hemisphere blastomere
subclass of: abnormal animal blastomere morphology
definition: Any unspecified morphological anomaly of the dorsal animal hemisphere blastomere, such as, for example, abnormal shape or colour.
has_exact_synonym: abnormal morphology of dorsal animal hemisphere blastomere

abnormal ventral vegetal hemisphere blastomere morphology
type: Class
subclass of: abnormal ventral vegetal hemisphere blastomere
subclass of: abnormal vegetal blastomere morphology
definition: Any unspecified morphological anomaly of the ventral vegetal hemisphere blastomere, such as, for example, abnormal shape or colour.
has_exact_synonym: abnormal morphology of ventral vegetal hemisphere blastomere

abnormal vegetal blastomere morphology
type: Class
subclass of: abnormal vegetal blastomere
subclass of: abnormal blastomere morphology
definition: Any unspecified morphological anomaly of the vegetal blastomere, such as, for example, abnormal shape or colour.
has_exact_synonym: abnormal morphology of vegetal blastomere

abnormal radio-ulna morphology
type: Class
subclass of: abnormal radio-ulna
subclass of: abnormal endochondral bone morphology
definition: Any unspecified morphological anomaly of the radio-ulna, such as, for example, abnormal shape or colour.
has_exact_synonym: abnormal morphology of radio-ulna

abnormal tibia-fibula morphology
type: Class
subclass of: abnormal tibia-fibula
subclass of: abnormal endochondral bone morphology
definition: Any unspecified morphological anomaly of the tibia-fibula, such as, for example, abnormal shape or colour.
has_exact_synonym: abnormal morphology of tibia-fibula

abnormal femur morphology
type: Class
subclass of: abnormal femur
subclass of: abnormal endochondral bone morphology
definition: Any unspecified morphological anomaly of the femur, such as, for example, abnormal shape or colour.
has_exact_synonym: abnormal morphology of femur

abnormal zeugopod morphology
type: Class
subclass of: abnormal zeugopod
subclass of: abnormal limb segment morphology
definition: Any unspecified morphological anomaly of the zeugopod, such as, for example, abnormal shape or colour.
has_exact_synonym: abnormal morphology of zeugopod

abnormal forelimb morphology
type: Class
subclass of: abnormal forelimb
subclass of: abnormal limb morphology
definition: Any unspecified morphological anomaly of the forelimb, such as, for example, abnormal shape or colour.
has_exact_synonym: abnormal morphology of forelimb

abnormal hematopoietic stem cell morphology
type: Class
subclass of: abnormal hematopoietic stem cell
subclass of: abnormal stem cell morphology
definition: Any unspecified morphological anomaly of the hematopoietic stem cell, such as, for example, abnormal shape or colour.
has_exact_synonym: abnormal morphology of hematopoietic stem cell

abnormal preplacodal ectoderm morphology
type: Class
subclass of: abnormal preplacodal ectoderm
subclass of: abnormal tissue morphology
definition: Any unspecified morphological anomaly of the preplacodal ectoderm, such as, for example, abnormal shape or colour.
has_exact_synonym: abnormal morphology of preplacodal ectoderm

abnormal tail somite morphology
type: Class
subclass of: abnormal tail somite
subclass of: abnormal somite morphology
definition: Any unspecified morphological anomaly of the tail somite, such as, for example, abnormal shape or colour.
has_exact_synonym: abnormal morphology of tail somite

abnormal presomitic mesoderm morphology
type: Class
subclass of: abnormal presomitic mesoderm
subclass of: abnormal tissue morphology
definition: Any unspecified morphological anomaly of the presomitic mesoderm, such as, for example, abnormal shape or colour.
has_exact_synonym: abnormal morphology of presomitic mesoderm

abnormal glomus morphology
type: Class
subclass of: abnormal glomus
subclass of: abnormal multi-tissue structure morphology
definition: Any unspecified morphological anomaly of the glomus, such as, for example, abnormal shape or colour.
has_exact_synonym: abnormal morphology of glomus

abnormal archenteron morphology
type: Class
subclass of: abnormal archenteron
subclass of: abnormal anatomical space morphology
definition: Any unspecified morphological anomaly of the archenteron, such as, for example, abnormal shape or colour.
has_exact_synonym: abnormal morphology of archenteron

abnormal foregut endoderm morphology
type: Class
subclass of: abnormal foregut endoderm
subclass of: abnormal primordium morphology
definition: Any unspecified morphological anomaly of the foregut endoderm, such as, for example, abnormal shape or colour.
has_exact_synonym: abnormal morphology of foregut endoderm

abnormal trunk somite 11 morphology
type: Class
subclass of: abnormal trunk somite 11
subclass of: abnormal trunk somite morphology
definition: Any unspecified morphological anomaly of the trunk somite 11, such as, for example, abnormal shape or colour.
has_exact_synonym: abnormal morphology of trunk somite 11

abnormal pericardial roof morphology
type: Class
subclass of: abnormal pericardial roof
subclass of: abnormal tissue morphology
definition: Any unspecified morphological anomaly of the pericardial roof, such as, for example, abnormal shape or colour.
has_exact_synonym: abnormal morphology of pericardial roof

abnormal proximal mesenchyme morphology
type: Class
subclass of: abnormal proximal mesenchyme
subclass of: abnormal mesenchyme morphology
definition: Any unspecified morphological anomaly of the proximal mesenchyme, such as, for example, abnormal shape or colour.
has_exact_synonym: abnormal morphology of proximal mesenchyme

abnormal testis morphology
type: Class
subclass of: abnormal testis
subclass of: abnormal gonad morphology
definition: Any unspecified morphological anomaly of the testis, such as, for example, abnormal shape or colour.
has_exact_synonym: abnormal morphology of testis

abnormal secretory epithelial cell morphology
type: Class
subclass of: abnormal secretory epithelial cell
subclass of: abnormal epithelial cell morphology
definition: Any unspecified morphological anomaly of the secretory epithelial cell, such as, for example, abnormal shape or colour.
has_exact_synonym: abnormal morphology of secretory epithelial cell

abnormal ligament morphology
type: Class
subclass of: abnormal ligament
subclass of: abnormal dense regular connective tissue morphology
definition: Any unspecified morphological anomaly of the ligament, such as, for example, abnormal shape or colour.
has_exact_synonym: abnormal morphology of ligament

abnormal dense regular connective tissue morphology
type: Class
subclass of: abnormal dense regular connective tissue
subclass of: abnormal connective tissue morphology
definition: Any unspecified morphological anomaly of the dense regular connective tissue, such as, for example, abnormal shape or colour.
has_exact_synonym: abnormal morphology of dense regular connective tissue

abnormal anterior palatine artery morphology
type: Class
subclass of: abnormal anterior palatine artery
subclass of: abnormal artery morphology
definition: Any unspecified morphological anomaly of the anterior palatine artery, such as, for example, abnormal shape or colour.
has_exact_synonym: abnormal morphology of anterior palatine artery

abnormal hindlimb digit 2 morphology
type: Class
subclass of: abnormal hindlimb digit 2
subclass of: abnormal hindlimb digit morphology
definition: Any unspecified morphological anomaly of the hindlimb digit 2, such as, for example, abnormal shape or colour.
has_exact_synonym: abnormal morphology of hindlimb digit 2

abnormal choana morphology
type: Class
subclass of: abnormal choana
subclass of: abnormal anatomical space morphology
definition: Any unspecified morphological anomaly of the choana, such as, for example, abnormal shape or colour.
has_exact_synonym: abnormal morphology of choana

abnormal dorsal lateral plate mesoderm morphology
type: Class
subclass of: abnormal dorsal lateral plate mesoderm
subclass of: abnormal embryonic structure morphology
definition: Any unspecified morphological anomaly of the dorsal lateral plate mesoderm, such as, for example, abnormal shape or colour.
has_exact_synonym: abnormal morphology of dorsal lateral plate mesoderm

abnormal notochord morphology
type: Class
subclass of: abnormal notochord
subclass of: abnormal tissue morphology
definition: Any unspecified morphological anomaly of the notochord, such as, for example, abnormal shape or colour.
has_exact_synonym: abnormal morphology of notochord

abnormal process morphology
type: Class
subclass of: abnormal process
subclass of: abnormal anatomical structure morphology
definition: Any unspecified morphological anomaly of the process, such as, for example, abnormal shape or colour.
has_exact_synonym: abnormal morphology of process

abnormal auditory ossicle morphology
type: Class
subclass of: abnormal auditory ossicle
subclass of: abnormal bone element morphology
definition: Any unspecified morphological anomaly of the auditory ossicle, such as, for example, abnormal shape or colour.
has_exact_synonym: abnormal morphology of auditory ossicle

abnormal sensorial layer morphology
type: Class
subclass of: abnormal sensorial layer
subclass of: abnormal tissue morphology
definition: Any unspecified morphological anomaly of the sensorial layer, such as, for example, abnormal shape or colour.
has_exact_synonym: abnormal morphology of sensorial layer

abnormal olfactory system morphology
type: Class
subclass of: abnormal olfactory system
subclass of: abnormal sensory system morphology
definition: Any unspecified morphological anomaly of the olfactory system, such as, for example, abnormal shape or colour.
has_exact_synonym: abnormal morphology of olfactory system

abnormal anterior crista morphology
type: Class
subclass of: abnormal anterior crista
subclass of: abnormal sensory epithelial cell morphology
definition: Any unspecified morphological anomaly of the anterior crista, such as, for example, abnormal shape or colour.
has_exact_synonym: abnormal morphology of anterior crista

abnormal spermatid morphology
type: Class
subclass of: abnormal spermatid
subclass of: abnormal germ cell morphology
definition: Any unspecified morphological anomaly of the spermatid, such as, for example, abnormal shape or colour.
has_exact_synonym: abnormal morphology of spermatid

abnormal odontoid tissue morphology
type: Class
subclass of: abnormal odontoid tissue
subclass of: abnormal skeletal tissue morphology
definition: Any unspecified morphological anomaly of the odontoid tissue, such as, for example, abnormal shape or colour.
has_exact_synonym: abnormal morphology of odontoid tissue

abnormal anterior neural ridge morphology
type: Class
subclass of: abnormal anterior neural ridge
subclass of: abnormal tissue morphology
definition: Any unspecified morphological anomaly of the anterior neural ridge, such as, for example, abnormal shape or colour.
has_exact_synonym: abnormal morphology of anterior neural ridge

abnormal epidermis inner layer morphology
type: Class
subclass of: abnormal epidermis inner layer
subclass of: abnormal tissue morphology
definition: Any unspecified morphological anomaly of the epidermis inner layer, such as, for example, abnormal shape or colour.
has_exact_synonym: abnormal morphology of epidermis inner layer

abnormal pectoral appendage morphology
type: Class
subclass of: abnormal pectoral appendage
subclass of: abnormal paired appendage morphology
definition: Any unspecified morphological anomaly of the pectoral appendage, such as, for example, abnormal shape or colour.
has_exact_synonym: abnormal morphology of pectoral appendage

abnormal ventral pallium morphology
type: Class
subclass of: abnormal ventral pallium
subclass of: abnormal multi-tissue structure morphology
definition: Any unspecified morphological anomaly of the ventral pallium, such as, for example, abnormal shape or colour.
has_exact_synonym: abnormal morphology of ventral pallium

abnormal epsilon cell morphology
type: Class
subclass of: abnormal epsilon cell
subclass of: abnormal enteroendocrine cell morphology
definition: Any unspecified morphological anomaly of the epsilon cell, such as, for example, abnormal shape or colour.
has_exact_synonym: abnormal morphology of epsilon cell

abnormal nucleus of the solitary tract morphology
type: Class
subclass of: abnormal nucleus of the solitary tract
subclass of: abnormal neural nucleus morphology
definition: Any unspecified morphological anomaly of the nucleus of the solitary tract, such as, for example, abnormal shape or colour.
has_exact_synonym: abnormal morphology of nucleus of the solitary tract

abnormal proepicardium morphology
type: Class
subclass of: abnormal proepicardium
subclass of: abnormal progenitor cell morphology
definition: Any unspecified morphological anomaly of the proepicardium, such as, for example, abnormal shape or colour.
has_exact_synonym: abnormal morphology of proepicardium

abnormal spinal cord morphology
type: Class
subclass of: abnormal spinal cord
subclass of: abnormal cavitated compound organ morphology
definition: Any unspecified morphological anomaly of the spinal cord, such as, for example, abnormal shape or colour.
has_exact_synonym: abnormal morphology of spinal cord

abnormal internal carotid artery morphology
type: Class
subclass of: abnormal internal carotid artery
subclass of: abnormal artery morphology
definition: Any unspecified morphological anomaly of the internal carotid artery, such as, for example, abnormal shape or colour.
has_exact_synonym: abnormal morphology of internal carotid artery

abnormal trunk somite 2 morphology
type: Class
subclass of: abnormal trunk somite 2
subclass of: abnormal trunk somite morphology
definition: Any unspecified morphological anomaly of the trunk somite 2, such as, for example, abnormal shape or colour.
has_exact_synonym: abnormal morphology of trunk somite 2

abnormal cement gland morphology
type: Class
subclass of: abnormal cement gland
subclass of: abnormal surface structure morphology
definition: Any unspecified morphological anomaly of the cement gland, such as, for example, abnormal shape or colour.
has_exact_synonym: abnormal morphology of cement gland

abnormal spinal ganglion morphology
type: Class
subclass of: abnormal spinal ganglion
subclass of: abnormal ganglion morphology
definition: Any unspecified morphological anomaly of the spinal ganglion, such as, for example, abnormal shape or colour.
has_exact_synonym: abnormal morphology of spinal ganglion

abnormal spleen morphology
type: Class
subclass of: abnormal spleen
subclass of: abnormal compound organ morphology
subclass of: abnormal viscus morphology
definition: Any unspecified morphological anomaly of the spleen, such as, for example, abnormal shape or colour.
has_exact_synonym: abnormal morphology of spleen

abnormal head somite 2 morphology
type: Class
subclass of: abnormal head somite 2
subclass of: abnormal head somite morphology
definition: Any unspecified morphological anomaly of the head somite 2, such as, for example, abnormal shape or colour.
has_exact_synonym: abnormal morphology of head somite 2

abnormal thymocyte morphology
type: Class
subclass of: abnormal thymocyte
subclass of: abnormal lymphocyte morphology
definition: Any unspecified morphological anomaly of the thymocyte, such as, for example, abnormal shape or colour.
has_exact_synonym: abnormal morphology of thymocyte

abnormal lymphocyte morphology
type: Class
subclass of: abnormal lymphocyte
subclass of: abnormal cell morphology
definition: Any unspecified morphological anomaly of the lymphocyte, such as, for example, abnormal shape or colour.
has_exact_synonym: abnormal morphology of lymphocyte

abnormal circumpharyngeal ridge morphology
type: Class
subclass of: abnormal circumpharyngeal ridge
subclass of: abnormal embryonic structure morphology
definition: Any unspecified morphological anomaly of the circumpharyngeal ridge, such as, for example, abnormal shape or colour.
has_exact_synonym: abnormal morphology of circumpharyngeal ridge

abnormal head mesenchyme morphology
type: Class
subclass of: abnormal head mesenchyme
subclass of: abnormal mesenchyme morphology
definition: Any unspecified morphological anomaly of the head mesenchyme, such as, for example, abnormal shape or colour.
has_exact_synonym: abnormal morphology of head mesenchyme

abnormal fin margin morphology
type: Class
subclass of: abnormal fin margin
subclass of: abnormal tissue morphology
definition: Any unspecified morphological anomaly of the fin margin, such as, for example, abnormal shape or colour.
has_exact_synonym: abnormal morphology of fin margin

abnormal ventral tail fin morphology
type: Class
subclass of: abnormal ventral tail fin
subclass of: abnormal fin morphology
definition: Any unspecified morphological anomaly of the ventral tail fin, such as, for example, abnormal shape or colour.
has_exact_synonym: abnormal morphology of ventral tail fin

abnormal lung bud morphology
type: Class
subclass of: abnormal lung bud
subclass of: abnormal multi-tissue structure morphology
definition: Any unspecified morphological anomaly of the lung bud, such as, for example, abnormal shape or colour.
has_exact_synonym: abnormal morphology of lung bud

abnormal optic field morphology
type: Class
subclass of: abnormal optic field
subclass of: XPO_0141316
definition: Any unspecified morphological anomaly of the optic field, such as, for example, abnormal shape or colour.
has_exact_synonym: abnormal morphology of optic field

abnormal m. levator mandibulae externus primordium morphology
type: Class
subclass of: abnormal m. levator mandibulae externus primordium
subclass of: abnormal cranial muscle primordium morphology
definition: Any unspecified morphological anomaly of the m. levator mandibulae externus primordium, such as, for example, abnormal shape or colour.
has_exact_synonym: abnormal morphology of m. levator mandibulae externus primordium

abnormal foot morphology
type: Class
subclass of: abnormal foot
subclass of: abnormal autopod morphology
definition: Any unspecified morphological anomaly of the foot, such as, for example, abnormal shape or colour.
has_exact_synonym: abnormal morphology of foot

abnormal autopod morphology
type: Class
subclass of: abnormal autopod
subclass of: abnormal limb segment morphology
definition: Any unspecified morphological anomaly of the autopod, such as, for example, abnormal shape or colour.
has_exact_synonym: abnormal morphology of autopod

abnormal optic vesicle morphology
type: Class
subclass of: abnormal optic vesicle
subclass of: abnormal embryonic structure morphology
definition: Any unspecified morphological anomaly of the optic vesicle, such as, for example, abnormal shape or colour.
has_exact_synonym: abnormal morphology of optic vesicle

abnormal ethmoid region morphology
type: Class
subclass of: abnormal ethmoid region
subclass of: abnormal anatomical cluster morphology
definition: Any unspecified morphological anomaly of the ethmoid region, such as, for example, abnormal shape or colour.
has_exact_synonym: abnormal morphology of ethmoid region

abnormal craniofacial skeleton morphology
type: Class
subclass of: abnormal craniofacial skeleton
subclass of: abnormal cranial skeleton morphology
definition: Any unspecified morphological anomaly of the craniofacial skeleton, such as, for example, abnormal shape or colour.
has_exact_synonym: abnormal morphology of craniofacial skeleton

abnormal anterior foregut morphology
type: Class
subclass of: abnormal anterior foregut
subclass of: abnormal embryonic structure morphology
definition: Any unspecified morphological anomaly of the anterior foregut, such as, for example, abnormal shape or colour.
has_exact_synonym: abnormal morphology of anterior foregut

abnormal m. transversus ventralis II morphology
type: Class
subclass of: abnormal m. transversus ventralis II
subclass of: abnormal branchial head muscle morphology
definition: Any unspecified morphological anomaly of the m. transversus ventralis II, such as, for example, abnormal shape or colour.
has_exact_synonym: abnormal morphology of m. transversus ventralis II

abnormal branchial head muscle morphology
type: Class
subclass of: abnormal branchial head muscle
subclass of: abnormal cranial muscle morphology
definition: Any unspecified morphological anomaly of the branchial head muscle, such as, for example, abnormal shape or colour.
has_exact_synonym: abnormal morphology of branchial head muscle

abnormal skeletal system morphology
type: Class
subclass of: abnormal skeletal system
subclass of: abnormal anatomical system morphology
definition: Any unspecified morphological anomaly of the skeletal system, such as, for example, abnormal shape or colour.
has_exact_synonym: abnormal morphology of skeletal system

abnormal limb bud morphology
type: Class
subclass of: abnormal limb bud
subclass of: abnormal surface structure morphology
definition: Any unspecified morphological anomaly of the limb bud, such as, for example, abnormal shape or colour.
has_exact_synonym: abnormal morphology of limb bud

abnormal tail somite 16 morphology
type: Class
subclass of: abnormal tail somite 16
subclass of: abnormal tail somite morphology
definition: Any unspecified morphological anomaly of the tail somite 16, such as, for example, abnormal shape or colour.
has_exact_synonym: abnormal morphology of tail somite 16

abnormal muscular system morphology
type: Class
subclass of: abnormal muscular system
subclass of: abnormal anatomical system morphology
definition: Any unspecified morphological anomaly of the muscular system, such as, for example, abnormal shape or colour.
has_exact_synonym: abnormal morphology of muscular system

abnormal mandibular crest morphology
type: Class
subclass of: abnormal mandibular crest
subclass of: abnormal tissue morphology
definition: Any unspecified morphological anomaly of the mandibular crest, such as, for example, abnormal shape or colour.
has_exact_synonym: abnormal morphology of mandibular crest

abnormal mandibular arch morphology
type: Class
subclass of: abnormal mandibular arch
subclass of: abnormal pharyngeal arch morphology
definition: Any unspecified morphological anomaly of the mandibular arch, such as, for example, abnormal shape or colour.
has_exact_synonym: abnormal morphology of mandibular arch

abnormal trunk somite 8 morphology
type: Class
subclass of: abnormal trunk somite 8
subclass of: abnormal trunk somite morphology
definition: Any unspecified morphological anomaly of the trunk somite 8, such as, for example, abnormal shape or colour.
has_exact_synonym: abnormal morphology of trunk somite 8

abnormal ventral habenular nucleus morphology
type: Class
subclass of: abnormal ventral habenular nucleus
subclass of: abnormal neural nucleus morphology
definition: Any unspecified morphological anomaly of the ventral habenular nucleus, such as, for example, abnormal shape or colour.
has_exact_synonym: abnormal morphology of ventral habenular nucleus

abnormal cartilage tissue morphology
type: Class
subclass of: abnormal cartilage tissue
subclass of: abnormal skeletal tissue morphology
definition: Any unspecified morphological anomaly of the cartilage tissue, such as, for example, abnormal shape or colour.
has_exact_synonym: abnormal morphology of cartilage tissue

abnormal anteroventral tegmental nucleus morphology
type: Class
subclass of: abnormal anteroventral tegmental nucleus
subclass of: abnormal neural nucleus morphology
definition: Any unspecified morphological anomaly of the anteroventral tegmental nucleus, such as, for example, abnormal shape or colour.
has_exact_synonym: abnormal morphology of anteroventral tegmental nucleus

abnormal trunk somite 7 morphology
type: Class
subclass of: abnormal trunk somite 7
subclass of: abnormal trunk somite morphology
definition: Any unspecified morphological anomaly of the trunk somite 7, such as, for example, abnormal shape or colour.
has_exact_synonym: abnormal morphology of trunk somite 7

abnormal pericyte morphology
type: Class
subclass of: abnormal pericyte
subclass of: abnormal cell morphology
definition: Any unspecified morphological anomaly of the pericyte, such as, for example, abnormal shape or colour.
has_exact_synonym: abnormal morphology of pericyte

abnormal processus lateralis hyalis morphology
type: Class
subclass of: abnormal processus lateralis hyalis
subclass of: abnormal cartilage element morphology
definition: Any unspecified morphological anomaly of the processus lateralis hyalis, such as, for example, abnormal shape or colour.
has_exact_synonym: abnormal morphology of processus lateralis hyalis

abnormal lens placode morphology
type: Class
subclass of: abnormal lens placode
subclass of: XPO_0141287
definition: Any unspecified morphological anomaly of the lens placode, such as, for example, abnormal shape or colour.
has_exact_synonym: abnormal morphology of lens placode

abnormal midbrain-hindbrain boundary morphology
type: Class
subclass of: abnormal midbrain-hindbrain boundary
subclass of: abnormal anatomical line morphology
definition: Any unspecified morphological anomaly of the midbrain-hindbrain boundary, such as, for example, abnormal shape or colour.
has_exact_synonym: abnormal morphology of midbrain-hindbrain boundary

abnormal anatomical line morphology
type: Class
subclass of: abnormal anatomical line
definition: Any unspecified morphological anomaly of the anatomical line, such as, for example, abnormal shape or colour.
has_exact_synonym: abnormal morphology of anatomical line

abnormal Mullerian duct morphology
type: Class
subclass of: abnormal Mullerian duct
subclass of: abnormal duct morphology
definition: Any unspecified morphological anomaly of the Mullerian duct, such as, for example, abnormal shape or colour.
has_exact_synonym: abnormal morphology of Mullerian duct

abnormal cloaca morphology
type: Class
subclass of: abnormal cloaca
subclass of: abnormal multi-tissue structure morphology
definition: Any unspecified morphological anomaly of the cloaca, such as, for example, abnormal shape or colour.
has_exact_synonym: abnormal morphology of cloaca

abnormal cement gland primordium morphology
type: Class
subclass of: abnormal cement gland primordium
subclass of: abnormal primordium morphology
definition: Any unspecified morphological anomaly of the cement gland primordium, such as, for example, abnormal shape or colour.
has_exact_synonym: abnormal morphology of cement gland primordium

abnormal retina morphology
type: Class
subclass of: abnormal retina
subclass of: abnormal multi-tissue structure morphology
definition: Any unspecified morphological anomaly of the retina, such as, for example, abnormal shape or colour.
has_exact_synonym: abnormal morphology of retina

abnormal oral evagination morphology
type: Class
subclass of: abnormal oral evagination
subclass of: abnormal embryonic structure morphology
definition: Any unspecified morphological anomaly of the oral evagination, such as, for example, abnormal shape or colour.
has_exact_synonym: abnormal morphology of oral evagination

abnormal distal tubule morphology
type: Class
subclass of: abnormal distal tubule
subclass of: abnormal tissue morphology
definition: Any unspecified morphological anomaly of the distal tubule, such as, for example, abnormal shape or colour.
has_exact_synonym: abnormal morphology of distal tubule

abnormal external jugular vein morphology
type: Class
subclass of: abnormal external jugular vein
subclass of: abnormal vein morphology
definition: Any unspecified morphological anomaly of the external jugular vein, such as, for example, abnormal shape or colour.
has_exact_synonym: abnormal morphology of external jugular vein

abnormal vitelline vein morphology
type: Class
subclass of: abnormal vitelline vein
subclass of: abnormal vein morphology
definition: Any unspecified morphological anomaly of the vitelline vein, such as, for example, abnormal shape or colour.
has_exact_synonym: abnormal morphology of vitelline vein

abnormal pars distalis morphology
type: Class
subclass of: abnormal pars distalis
subclass of: abnormal multi-tissue structure morphology
definition: Any unspecified morphological anomaly of the pars distalis, such as, for example, abnormal shape or colour.
has_exact_synonym: abnormal morphology of pars distalis

abnormal gall bladder primordium morphology
type: Class
subclass of: abnormal gall bladder primordium
subclass of: abnormal primordium morphology
definition: Any unspecified morphological anomaly of the gall bladder primordium, such as, for example, abnormal shape or colour.
has_exact_synonym: abnormal morphology of gall bladder primordium

abnormal liver and biliary system morphology
type: Class
subclass of: abnormal liver and biliary system
subclass of: abnormal anatomical system morphology
definition: Any unspecified morphological anomaly of the liver and biliary system, such as, for example, abnormal shape or colour.
has_exact_synonym: abnormal morphology of liver and biliary system

abnormal liver diverticulum morphology
type: Class
subclass of: abnormal liver diverticulum
subclass of: abnormal embryonic structure morphology
definition: Any unspecified morphological anomaly of the liver diverticulum, such as, for example, abnormal shape or colour.
has_exact_synonym: abnormal morphology of liver diverticulum

abnormal hyoid head muscle morphology
type: Class
subclass of: abnormal hyoid head muscle
subclass of: abnormal cranial muscle morphology
definition: Any unspecified morphological anomaly of the hyoid head muscle, such as, for example, abnormal shape or colour.
has_exact_synonym: abnormal morphology of hyoid head muscle

abnormal otic placode morphology
type: Class
subclass of: abnormal otic placode
subclass of: abnormal neurogenic placode morphology
definition: Any unspecified morphological anomaly of the otic placode, such as, for example, abnormal shape or colour.
has_exact_synonym: abnormal morphology of otic placode

abnormal endoskeleton morphology
type: Class
subclass of: abnormal endoskeleton
subclass of: abnormal skeletal subdivision morphology
definition: Any unspecified morphological anomaly of the endoskeleton, such as, for example, abnormal shape or colour.
has_exact_synonym: abnormal morphology of endoskeleton

abnormal glomerular layer of the olfactory bulb morphology
type: Class
subclass of: abnormal glomerular layer of the olfactory bulb
subclass of: abnormal tissue morphology
definition: Any unspecified morphological anomaly of the glomerular layer of the olfactory bulb, such as, for example, abnormal shape or colour.
has_exact_synonym: abnormal morphology of glomerular layer of the olfactory bulb

abnormal pronephric nephrostome morphology
type: Class
subclass of: abnormal pronephric nephrostome
subclass of: abnormal tissue morphology
definition: Any unspecified morphological anomaly of the pronephric nephrostome, such as, for example, abnormal shape or colour.
has_exact_synonym: abnormal morphology of pronephric nephrostome

abnormal urogenital system morphology
type: Class
subclass of: abnormal urogenital system
subclass of: abnormal anatomical system morphology
definition: Any unspecified morphological anomaly of the urogenital system, such as, for example, abnormal shape or colour.
has_exact_synonym: abnormal morphology of urogenital system

abnormal posterior semicircular canal morphology
type: Class
subclass of: abnormal posterior semicircular canal
subclass of: abnormal semicircular canal morphology
definition: Any unspecified morphological anomaly of the posterior semicircular canal, such as, for example, abnormal shape or colour.
has_exact_synonym: abnormal morphology of posterior semicircular canal

abnormal blastomere D2 morphology
type: Class
subclass of: abnormal blastomere D2
subclass of: abnormal blastomere morphology
definition: Any unspecified morphological anomaly of the blastomere D2, such as, for example, abnormal shape or colour.
has_exact_synonym: abnormal morphology of blastomere D2

abnormal renal artery morphology
type: Class
subclass of: abnormal renal artery
subclass of: abnormal artery morphology
definition: Any unspecified morphological anomaly of the renal artery, such as, for example, abnormal shape or colour.
has_exact_synonym: abnormal morphology of renal artery

abnormal skin morphology
type: Class
subclass of: abnormal skin
subclass of: abnormal surface structure morphology
definition: Any unspecified morphological anomaly of the skin, such as, for example, abnormal shape or colour.
has_exact_synonym: abnormal morphology of skin

abnormal vagal neural crest morphology
type: Class
subclass of: abnormal vagal neural crest
subclass of: XPO_0141500
definition: Any unspecified morphological anomaly of the vagal neural crest, such as, for example, abnormal shape or colour.
has_exact_synonym: abnormal morphology of vagal neural crest

abnormal germ plasm morphology
type: Class
subclass of: abnormal germ plasm
subclass of: abnormal cell part morphology
definition: Any unspecified morphological anomaly of the germ plasm, such as, for example, abnormal shape or colour.
has_exact_synonym: abnormal morphology of germ plasm

abnormal forelimb stylopod morphology
type: Class
subclass of: abnormal forelimb stylopod
subclass of: abnormal stylopod morphology
definition: Any unspecified morphological anomaly of the forelimb stylopod, such as, for example, abnormal shape or colour.
has_exact_synonym: abnormal morphology of forelimb stylopod

abnormal stylopod morphology
type: Class
subclass of: abnormal stylopod
subclass of: abnormal limb segment morphology
definition: Any unspecified morphological anomaly of the stylopod, such as, for example, abnormal shape or colour.
has_exact_synonym: abnormal morphology of stylopod

abnormal cranial skeleton morphology
type: Class
subclass of: abnormal cranial skeleton
subclass of: abnormal skeletal subdivision morphology
definition: Any unspecified morphological anomaly of the cranial skeleton, such as, for example, abnormal shape or colour.
has_exact_synonym: abnormal morphology of cranial skeleton

abnormal cranial neural crest morphology
type: Class
subclass of: abnormal cranial neural crest
subclass of: abnormal tissue morphology
definition: Any unspecified morphological anomaly of the cranial neural crest, such as, for example, abnormal shape or colour.
has_exact_synonym: abnormal morphology of cranial neural crest

abnormal beta cell morphology
type: Class
subclass of: abnormal beta cell
subclass of: abnormal enteroendocrine cell morphology
definition: Any unspecified morphological anomaly of the beta cell, such as, for example, abnormal shape or colour.
has_exact_synonym: abnormal morphology of beta cell

abnormal somatic stem cell morphology
type: Class
subclass of: abnormal somatic stem cell
subclass of: abnormal stem cell morphology
definition: Any unspecified morphological anomaly of the somatic stem cell, such as, for example, abnormal shape or colour.
has_exact_synonym: abnormal morphology of somatic stem cell

abnormal cerebellum morphology
type: Class
subclass of: abnormal cerebellum
subclass of: abnormal multi-tissue structure morphology
definition: Any unspecified morphological anomaly of the cerebellum, such as, for example, abnormal shape or colour.
has_exact_synonym: abnormal morphology of cerebellum

abnormal mineralized bone tissue morphology
type: Class
subclass of: abnormal mineralized bone tissue
subclass of: abnormal bone tissue morphology
subclass of: abnormal mineralized tissue morphology
definition: Any unspecified morphological anomaly of the mineralized bone tissue, such as, for example, abnormal shape or colour.
has_exact_synonym: abnormal morphology of mineralized bone tissue

abnormal bone tissue morphology
type: Class
subclass of: abnormal bone tissue
subclass of: abnormal skeletal tissue morphology
definition: Any unspecified morphological anomaly of the bone tissue, such as, for example, abnormal shape or colour.
has_exact_synonym: abnormal morphology of bone tissue

abnormal mineralized tissue morphology
type: Class
subclass of: abnormal mineralized tissue
subclass of: abnormal skeletal tissue morphology
definition: Any unspecified morphological anomaly of the mineralized tissue, such as, for example, abnormal shape or colour.
has_exact_synonym: abnormal morphology of mineralized tissue

abnormal blastomere D1.2 morphology
type: Class
subclass of: abnormal blastomere D1.2
subclass of: abnormal dorsal animal hemisphere blastomere morphology
definition: Any unspecified morphological anomaly of the blastomere D1.2, such as, for example, abnormal shape or colour.
has_exact_synonym: abnormal morphology of blastomere D1.2

abnormal animal blastomere morphology
type: Class
subclass of: abnormal animal blastomere
subclass of: abnormal blastomere morphology
definition: Any unspecified morphological anomaly of the animal blastomere, such as, for example, abnormal shape or colour.
has_exact_synonym: abnormal morphology of animal blastomere

abnormal subinterstitial vein morphology
type: Class
subclass of: abnormal subinterstitial vein
subclass of: abnormal vein morphology
definition: Any unspecified morphological anomaly of the subinterstitial vein, such as, for example, abnormal shape or colour.
has_exact_synonym: abnormal morphology of subinterstitial vein

abnormal midgut morphology
type: Class
subclass of: abnormal midgut
subclass of: abnormal embryonic structure morphology
definition: Any unspecified morphological anomaly of the midgut, such as, for example, abnormal shape or colour.
has_exact_synonym: abnormal morphology of midgut

abnormal intestine morphology
type: Class
subclass of: abnormal intestine
subclass of: abnormal cavitated compound organ morphology
subclass of: abnormal viscus morphology
definition: Any unspecified morphological anomaly of the intestine, such as, for example, abnormal shape or colour.
has_exact_synonym: abnormal morphology of intestine

abnormal dorsomedial edge of myotome morphology
type: Class
subclass of: abnormal dorsomedial edge of myotome
subclass of: abnormal tissue morphology
definition: Any unspecified morphological anomaly of the dorsomedial edge of myotome, such as, for example, abnormal shape or colour.
has_exact_synonym: abnormal morphology of dorsomedial edge of myotome

abnormal cellular bone tissue morphology
type: Class
subclass of: abnormal cellular bone tissue
subclass of: abnormal mineralized bone tissue morphology
definition: Any unspecified morphological anomaly of the cellular bone tissue, such as, for example, abnormal shape or colour.
has_exact_synonym: abnormal morphology of cellular bone tissue

abnormal processus muscularis palatoquadrati morphology
type: Class
subclass of: abnormal processus muscularis palatoquadrati
subclass of: abnormal cartilage element morphology
definition: Any unspecified morphological anomaly of the processus muscularis palatoquadrati, such as, for example, abnormal shape or colour.
has_exact_synonym: abnormal morphology of processus muscularis palatoquadrati

abnormal epicardial precursor cell morphology
type: Class
subclass of: abnormal epicardial precursor cell
subclass of: abnormal cell morphology
definition: Any unspecified morphological anomaly of the epicardial precursor cell, such as, for example, abnormal shape or colour.
has_exact_synonym: abnormal morphology of epicardial precursor cell

abnormal ciliary marginal zone morphology
type: Class
subclass of: abnormal ciliary marginal zone
subclass of: abnormal proliferative region morphology
definition: Any unspecified morphological anomaly of the ciliary marginal zone, such as, for example, abnormal shape or colour.
has_exact_synonym: abnormal morphology of ciliary marginal zone

abnormal proliferative region morphology
type: Class
subclass of: abnormal proliferative region
subclass of: abnormal anatomical cluster morphology
definition: Any unspecified morphological anomaly of the proliferative region, such as, for example, abnormal shape or colour.
has_exact_synonym: abnormal morphology of proliferative region

abnormal mandibular mesenchyme morphology
type: Class
subclass of: abnormal mandibular mesenchyme
subclass of: abnormal mesenchyme morphology
definition: Any unspecified morphological anomaly of the mandibular mesenchyme, such as, for example, abnormal shape or colour.
has_exact_synonym: abnormal morphology of mandibular mesenchyme

abnormal melanoblast morphology
type: Class
subclass of: abnormal melanoblast
subclass of: abnormal cell morphology
definition: Any unspecified morphological anomaly of the melanoblast, such as, for example, abnormal shape or colour.
has_exact_synonym: abnormal morphology of melanoblast

abnormal medial abdominal vein morphology
type: Class
subclass of: abnormal medial abdominal vein
subclass of: abnormal vein morphology
definition: Any unspecified morphological anomaly of the medial abdominal vein, such as, for example, abnormal shape or colour.
has_exact_synonym: abnormal morphology of medial abdominal vein

abnormal cerebral vein morphology
type: Class
subclass of: abnormal cerebral vein
subclass of: abnormal vein morphology
definition: Any unspecified morphological anomaly of the cerebral vein, such as, for example, abnormal shape or colour.
has_exact_synonym: abnormal morphology of cerebral vein

abnormal inner ear morphology
type: Class
subclass of: abnormal inner ear
subclass of: abnormal anatomical cluster morphology
definition: Any unspecified morphological anomaly of the inner ear, such as, for example, abnormal shape or colour.
has_exact_synonym: abnormal morphology of inner ear

abnormal medium cavity morphology
type: Class
subclass of: abnormal medium cavity
subclass of: abnormal anatomical space morphology
definition: Any unspecified morphological anomaly of the medium cavity, such as, for example, abnormal shape or colour.
has_exact_synonym: abnormal morphology of medium cavity

abnormal archenteron floor morphology
type: Class
subclass of: abnormal archenteron floor
subclass of: abnormal tissue morphology
definition: Any unspecified morphological anomaly of the archenteron floor, such as, for example, abnormal shape or colour.
has_exact_synonym: abnormal morphology of archenteron floor

abnormal somatic layer of lateral plate mesoderm morphology
type: Class
subclass of: abnormal somatic layer of lateral plate mesoderm
subclass of: abnormal embryonic structure morphology
definition: Any unspecified morphological anomaly of the somatic layer of lateral plate mesoderm, such as, for example, abnormal shape or colour.
has_exact_synonym: abnormal morphology of somatic layer of lateral plate mesoderm

abnormal left lymph heart morphology
type: Class
subclass of: abnormal left lymph heart
subclass of: abnormal cavitated compound organ morphology
definition: Any unspecified morphological anomaly of the left lymph heart, such as, for example, abnormal shape or colour.
has_exact_synonym: abnormal morphology of left lymph heart

abnormal nucleus reticularis superior morphology
type: Class
subclass of: abnormal nucleus reticularis superior
subclass of: abnormal neural nucleus morphology
definition: Any unspecified morphological anomaly of the nucleus reticularis superior, such as, for example, abnormal shape or colour.
has_exact_synonym: abnormal morphology of nucleus reticularis superior

abnormal pallium morphology
type: Class
subclass of: abnormal pallium
subclass of: abnormal multi-tissue structure morphology
definition: Any unspecified morphological anomaly of the pallium, such as, for example, abnormal shape or colour.
has_exact_synonym: abnormal morphology of pallium

abnormal m. dilatator laryngis primordium morphology
type: Class
subclass of: abnormal m. dilatator laryngis primordium
subclass of: abnormal cranial muscle primordium morphology
definition: Any unspecified morphological anomaly of the m. dilatator laryngis primordium, such as, for example, abnormal shape or colour.
has_exact_synonym: abnormal morphology of m. dilatator laryngis primordium

abnormal neuromast support cell morphology
type: Class
subclass of: abnormal neuromast support cell
subclass of: abnormal cell morphology
definition: Any unspecified morphological anomaly of the neuromast support cell, such as, for example, abnormal shape or colour.
has_exact_synonym: abnormal morphology of neuromast support cell

abnormal male organism morphology
type: Class
subclass of: abnormal male organism
subclass of: abnormal whole organism morphology
definition: Any unspecified morphological anomaly of the male organism, such as, for example, abnormal shape or colour.
has_exact_synonym: abnormal morphology of male organism

abnormal whole organism morphology
type: Class
subclass of: abnormal whole organism
subclass of: abnormal anatomical structure morphology
definition: Any unspecified morphological anomaly of the whole organism, such as, for example, abnormal shape or colour.
has_exact_synonym: abnormal morphology of whole organism

abnormal blastomere V2 morphology
type: Class
subclass of: abnormal blastomere V2
subclass of: abnormal blastomere morphology
definition: Any unspecified morphological anomaly of the blastomere V2, such as, for example, abnormal shape or colour.
has_exact_synonym: abnormal morphology of blastomere V2

abnormal hindlimb digit 3 morphology
type: Class
subclass of: abnormal hindlimb digit 3
subclass of: abnormal hindlimb digit morphology
definition: Any unspecified morphological anomaly of the hindlimb digit 3, such as, for example, abnormal shape or colour.
has_exact_synonym: abnormal morphology of hindlimb digit 3

abnormal mitotic cell morphology
type: Class
subclass of: abnormal mitotic cell
subclass of: abnormal cell morphology
definition: Any unspecified morphological anomaly of the mitotic cell, such as, for example, abnormal shape or colour.
has_exact_synonym: abnormal morphology of mitotic cell

abnormal oocyte cortex morphology
type: Class
subclass of: abnormal oocyte cortex
subclass of: abnormal cell part morphology
definition: Any unspecified morphological anomaly of the oocyte cortex, such as, for example, abnormal shape or colour.
has_exact_synonym: abnormal morphology of oocyte cortex

abnormal m. orbitohyoideus primordium morphology
type: Class
subclass of: abnormal m. orbitohyoideus primordium
subclass of: abnormal cranial muscle primordium morphology
definition: Any unspecified morphological anomaly of the m. orbitohyoideus primordium, such as, for example, abnormal shape or colour.
has_exact_synonym: abnormal morphology of m. orbitohyoideus primordium

abnormal laryngeal muscle primordium morphology
type: Class
subclass of: abnormal laryngeal muscle primordium
subclass of: abnormal primordium morphology
definition: Any unspecified morphological anomaly of the laryngeal muscle primordium, such as, for example, abnormal shape or colour.
has_exact_synonym: abnormal morphology of laryngeal muscle primordium

abnormal hatching gland morphology
type: Class
subclass of: abnormal hatching gland
subclass of: abnormal embryonic structure morphology
definition: Any unspecified morphological anomaly of the hatching gland, such as, for example, abnormal shape or colour.
has_exact_synonym: abnormal morphology of hatching gland

abnormal central endoderm morphology
type: Class
subclass of: abnormal central endoderm
subclass of: abnormal tissue morphology
definition: Any unspecified morphological anomaly of the central endoderm, such as, for example, abnormal shape or colour.
has_exact_synonym: abnormal morphology of central endoderm

abnormal head somite 3 morphology
type: Class
subclass of: abnormal head somite 3
subclass of: abnormal head somite morphology
definition: Any unspecified morphological anomaly of the head somite 3, such as, for example, abnormal shape or colour.
has_exact_synonym: abnormal morphology of head somite 3

abnormal prime meridian morphology
type: Class
subclass of: abnormal prime meridian
subclass of: XPO_0141316
definition: Any unspecified morphological anomaly of the prime meridian, such as, for example, abnormal shape or colour.
has_exact_synonym: abnormal morphology of prime meridian

abnormal myocardium morphology
type: Class
subclass of: abnormal myocardium
subclass of: abnormal muscle morphology
definition: Any unspecified morphological anomaly of the myocardium, such as, for example, abnormal shape or colour.
has_exact_synonym: abnormal morphology of myocardium

abnormal telencephalon morphology
type: Class
subclass of: abnormal telencephalon
subclass of: abnormal multi-tissue structure morphology
definition: Any unspecified morphological anomaly of the telencephalon, such as, for example, abnormal shape or colour.
has_exact_synonym: abnormal morphology of telencephalon

abnormal mm. levator arcuum branchialium IV primordium morphology
type: Class
subclass of: abnormal mm. levator arcuum branchialium IV primordium
subclass of: abnormal cranial muscle primordium morphology
definition: Any unspecified morphological anomaly of the mm. levator arcuum branchialium IV primordium, such as, for example, abnormal shape or colour.
has_exact_synonym: abnormal morphology of mm. levator arcuum branchialium IV primordium

abnormal myotome of head somite 2 morphology
type: Class
subclass of: abnormal myotome of head somite 2
subclass of: abnormal myotome morphology
definition: Any unspecified morphological anomaly of the myotome of head somite 2, such as, for example, abnormal shape or colour.
has_exact_synonym: abnormal morphology of myotome of head somite 2

abnormal eye primordium morphology
type: Class
subclass of: abnormal eye primordium
subclass of: abnormal primordium morphology
definition: Any unspecified morphological anomaly of the eye primordium, such as, for example, abnormal shape or colour.
has_exact_synonym: abnormal morphology of eye primordium

abnormal animal cap morphology
type: Class
subclass of: abnormal animal cap
subclass of: abnormal embryonic structure morphology
definition: Any unspecified morphological anomaly of the animal cap, such as, for example, abnormal shape or colour.
has_exact_synonym: abnormal morphology of animal cap

abnormal central retina morphology
type: Class
subclass of: abnormal central retina
subclass of: XPO_0141316
definition: Any unspecified morphological anomaly of the central retina, such as, for example, abnormal shape or colour.
has_exact_synonym: abnormal morphology of central retina

abnormal pronephric kidney morphology
type: Class
subclass of: abnormal pronephric kidney
subclass of: abnormal multi-tissue structure morphology
subclass of: abnormal embryonic kidney morphology
definition: Any unspecified morphological anomaly of the pronephric kidney, such as, for example, abnormal shape or colour.
has_exact_synonym: abnormal morphology of pronephric kidney

abnormal kidney morphology
type: Class
subclass of: abnormal kidney
subclass of: abnormal cavitated compound organ morphology
definition: Any unspecified morphological anomaly of the kidney, such as, for example, abnormal shape or colour.
has_exact_synonym: abnormal morphology of kidney

abnormal mesonephric collecting duct morphology
type: Class
subclass of: abnormal mesonephric collecting duct
subclass of: abnormal duct morphology
definition: Any unspecified morphological anomaly of the mesonephric collecting duct, such as, for example, abnormal shape or colour.
has_exact_synonym: abnormal morphology of mesonephric collecting duct

abnormal telencephalon septum morphology
type: Class
subclass of: abnormal telencephalon septum
subclass of: XPO_0141720
definition: Any unspecified morphological anomaly of the telencephalon septum, such as, for example, abnormal shape or colour.
has_exact_synonym: abnormal morphology of telencephalon septum

abnormal motor axon morphology
type: Class
subclass of: abnormal motor axon
subclass of: abnormal axon morphology
definition: Any unspecified morphological anomaly of the motor axon, such as, for example, abnormal shape or colour.
has_exact_synonym: abnormal morphology of motor axon

abnormal axon morphology
type: Class
subclass of: abnormal axon
subclass of: XPO_0141286
definition: Any unspecified morphological anomaly of the axon, such as, for example, abnormal shape or colour.
has_exact_synonym: abnormal morphology of axon

abnormal branchial arch 1 morphology
type: Class
subclass of: abnormal branchial arch 1
subclass of: abnormal branchial arch morphology
definition: Any unspecified morphological anomaly of the branchial arch 1, such as, for example, abnormal shape or colour.
has_exact_synonym: abnormal morphology of branchial arch 1

abnormal branchial arch morphology
type: Class
subclass of: abnormal branchial arch
subclass of: abnormal pharyngeal arch morphology
definition: Any unspecified morphological anomaly of the branchial arch, such as, for example, abnormal shape or colour.
has_exact_synonym: abnormal morphology of branchial arch

abnormal extraembryonic structure morphology
type: Class
subclass of: abnormal extraembryonic structure
subclass of: abnormal anatomical structure morphology
definition: Any unspecified morphological anomaly of the extraembryonic structure, such as, for example, abnormal shape or colour.
has_exact_synonym: abnormal morphology of extraembryonic structure

abnormal gastrula cell morphology
type: Class
subclass of: abnormal gastrula cell
subclass of: abnormal early embryonic cell morphology
definition: Any unspecified morphological anomaly of the gastrula cell, such as, for example, abnormal shape or colour.
has_exact_synonym: abnormal morphology of gastrula cell

abnormal diencephalon morphology
type: Class
subclass of: abnormal diencephalon
subclass of: abnormal multi-tissue structure morphology
definition: Any unspecified morphological anomaly of the diencephalon, such as, for example, abnormal shape or colour.
has_exact_synonym: abnormal morphology of diencephalon

abnormal mineralized cartilage tissue morphology
type: Class
subclass of: abnormal mineralized cartilage tissue
subclass of: abnormal cartilage tissue morphology
definition: Any unspecified morphological anomaly of the mineralized cartilage tissue, such as, for example, abnormal shape or colour.
has_exact_synonym: abnormal morphology of mineralized cartilage tissue

abnormal planum trabeculare anticum morphology
type: Class
subclass of: abnormal planum trabeculare anticum
subclass of: abnormal cartilage element morphology
definition: Any unspecified morphological anomaly of the planum trabeculare anticum, such as, for example, abnormal shape or colour.
has_exact_synonym: abnormal morphology of planum trabeculare anticum

abnormal stomodeal-hypophyseal primordium morphology
type: Class
subclass of: abnormal stomodeal-hypophyseal primordium
subclass of: abnormal primordium morphology
definition: Any unspecified morphological anomaly of the stomodeal-hypophyseal primordium, such as, for example, abnormal shape or colour.
has_exact_synonym: abnormal morphology of stomodeal-hypophyseal primordium

abnormal biliary tree morphology
type: Class
subclass of: abnormal biliary tree
subclass of: abnormal multi-tissue structure morphology
definition: Any unspecified morphological anomaly of the biliary tree, such as, for example, abnormal shape or colour.
has_exact_synonym: abnormal morphology of biliary tree

abnormal globe morphology
type: Class
subclass of: abnormal globe
subclass of: abnormal multi-tissue structure morphology
definition: Any unspecified morphological anomaly of the globe, such as, for example, abnormal shape or colour.
has_exact_synonym: abnormal morphology of globe

abnormal immune system morphology
type: Class
subclass of: abnormal immune system
subclass of: abnormal anatomical system morphology
definition: Any unspecified morphological anomaly of the immune system, such as, for example, abnormal shape or colour.
has_exact_synonym: abnormal morphology of immune system

abnormal forelimb digit morphology
type: Class
subclass of: abnormal forelimb digit
subclass of: abnormal digit morphology
definition: Any unspecified morphological anomaly of the forelimb digit, such as, for example, abnormal shape or colour.
has_exact_synonym: abnormal morphology of forelimb digit

abnormal mandibular arch skeleton morphology
type: Class
subclass of: abnormal mandibular arch skeleton
subclass of: abnormal skeletal subdivision morphology
definition: Any unspecified morphological anomaly of the mandibular arch skeleton, such as, for example, abnormal shape or colour.
has_exact_synonym: abnormal morphology of mandibular arch skeleton

abnormal vertebral column morphology
type: Class
subclass of: abnormal vertebral column
subclass of: abnormal skeletal subdivision morphology
definition: Any unspecified morphological anomaly of the vertebral column, such as, for example, abnormal shape or colour.
has_exact_synonym: abnormal morphology of vertebral column

abnormal elastica externa morphology
type: Class
subclass of: abnormal elastica externa
subclass of: abnormal tissue morphology
definition: Any unspecified morphological anomaly of the elastica externa, such as, for example, abnormal shape or colour.
has_exact_synonym: abnormal morphology of elastica externa

abnormal thyroid primordium morphology
type: Class
subclass of: abnormal thyroid primordium
subclass of: abnormal multi-tissue structure morphology
definition: Any unspecified morphological anomaly of the thyroid primordium, such as, for example, abnormal shape or colour.
has_exact_synonym: abnormal morphology of thyroid primordium

abnormal vestibuloauditory system morphology
type: Class
subclass of: abnormal vestibuloauditory system
subclass of: abnormal sensory system morphology
definition: Any unspecified morphological anomaly of the vestibuloauditory system, such as, for example, abnormal shape or colour.
has_exact_synonym: abnormal morphology of vestibuloauditory system

abnormal unicellular gland morphology
type: Class
subclass of: abnormal unicellular gland
subclass of: abnormal surface structure morphology
definition: Any unspecified morphological anomaly of the unicellular gland, such as, for example, abnormal shape or colour.
has_exact_synonym: abnormal morphology of unicellular gland

abnormal hyoid crest morphology
type: Class
subclass of: abnormal hyoid crest
subclass of: abnormal tissue morphology
definition: Any unspecified morphological anomaly of the hyoid crest, such as, for example, abnormal shape or colour.
has_exact_synonym: abnormal morphology of hyoid crest

abnormal hypothalamus morphology
type: Class
subclass of: abnormal hypothalamus
subclass of: abnormal multi-tissue structure morphology
definition: Any unspecified morphological anomaly of the hypothalamus, such as, for example, abnormal shape or colour.
has_exact_synonym: abnormal morphology of hypothalamus

abnormal pharyngeal arch morphology
type: Class
subclass of: abnormal pharyngeal arch
subclass of: abnormal multi-tissue structure morphology
definition: Any unspecified morphological anomaly of the pharyngeal arch, such as, for example, abnormal shape or colour.
has_exact_synonym: abnormal morphology of pharyngeal arch

abnormal auditory apparatus morphology
type: Class
subclass of: abnormal auditory apparatus
subclass of: abnormal cavitated compound organ morphology
definition: Any unspecified morphological anomaly of the auditory apparatus, such as, for example, abnormal shape or colour.
has_exact_synonym: abnormal morphology of auditory apparatus

abnormal cerebral artery morphology
type: Class
subclass of: abnormal cerebral artery
subclass of: abnormal artery morphology
definition: Any unspecified morphological anomaly of the cerebral artery, such as, for example, abnormal shape or colour.
has_exact_synonym: abnormal morphology of cerebral artery

abnormal Jacobson's organ morphology
type: Class
subclass of: abnormal Jacobson's organ
subclass of: abnormal multi-tissue structure morphology
definition: Any unspecified morphological anomaly of the Jacobson's organ, such as, for example, abnormal shape or colour.
has_exact_synonym: abnormal morphology of Jacobson's organ

abnormal cardiac myocyte morphology
type: Class
subclass of: abnormal cardiac myocyte
subclass of: abnormal myocyte morphology
definition: Any unspecified morphological anomaly of the cardiac myocyte, such as, for example, abnormal shape or colour.
has_exact_synonym: abnormal morphology of cardiac myocyte

abnormal myocyte morphology
type: Class
subclass of: abnormal myocyte
subclass of: abnormal cell morphology
definition: Any unspecified morphological anomaly of the myocyte, such as, for example, abnormal shape or colour.
has_exact_synonym: abnormal morphology of myocyte

abnormal regenerating skeletal element morphology
type: Class
subclass of: abnormal regenerating skeletal element
subclass of: abnormal skeletal element morphology
definition: Any unspecified morphological anomaly of the regenerating skeletal element, such as, for example, abnormal shape or colour.
has_exact_synonym: abnormal morphology of regenerating skeletal element

abnormal alpha cell morphology
type: Class
subclass of: abnormal alpha cell
subclass of: abnormal enteroendocrine cell morphology
definition: Any unspecified morphological anomaly of the alpha cell, such as, for example, abnormal shape or colour.
has_exact_synonym: abnormal morphology of alpha cell

abnormal adult immune system morphology
type: Class
subclass of: abnormal adult immune system
subclass of: abnormal immune system morphology
definition: Any unspecified morphological anomaly of the adult immune system, such as, for example, abnormal shape or colour.
has_exact_synonym: abnormal morphology of adult immune system

abnormal eye photoreceptor cell morphology
type: Class
subclass of: abnormal eye photoreceptor cell
subclass of: abnormal cell morphology
definition: Any unspecified morphological anomaly of the eye photoreceptor cell, such as, for example, abnormal shape or colour.
has_exact_synonym: abnormal morphology of eye photoreceptor cell

abnormal vascular endothelium morphology
type: Class
subclass of: abnormal vascular endothelium
subclass of: abnormal simple squamous epithelium morphology
definition: Any unspecified morphological anomaly of the vascular endothelium, such as, for example, abnormal shape or colour.
has_exact_synonym: abnormal morphology of vascular endothelium

abnormal right ventricle morphology
type: Class
subclass of: abnormal right ventricle
subclass of: abnormal lateral ventricle morphology
definition: Any unspecified morphological anomaly of the right ventricle, such as, for example, abnormal shape or colour.
has_exact_synonym: abnormal morphology of right ventricle

abnormal lateral ventricle morphology
type: Class
subclass of: abnormal lateral ventricle
subclass of: abnormal brain ventricle morphology
definition: Any unspecified morphological anomaly of the lateral ventricle, such as, for example, abnormal shape or colour.
has_exact_synonym: abnormal morphology of lateral ventricle

abnormal m. geniohyoideus primordium morphology
type: Class
subclass of: abnormal m. geniohyoideus primordium
subclass of: abnormal cranial muscle primordium morphology
definition: Any unspecified morphological anomaly of the m. geniohyoideus primordium, such as, for example, abnormal shape or colour.
has_exact_synonym: abnormal morphology of m. geniohyoideus primordium

abnormal prechordal plate morphology
type: Class
subclass of: abnormal prechordal plate
subclass of: abnormal embryonic structure morphology
definition: Any unspecified morphological anomaly of the prechordal plate, such as, for example, abnormal shape or colour.
has_exact_synonym: abnormal morphology of prechordal plate

abnormal basal forebrain morphology
type: Class
subclass of: abnormal basal forebrain
subclass of: abnormal multi-tissue structure morphology
definition: Any unspecified morphological anomaly of the basal forebrain, such as, for example, abnormal shape or colour.
has_exact_synonym: abnormal morphology of basal forebrain

abnormal retinal pigmented epithelium morphology
type: Class
subclass of: abnormal retinal pigmented epithelium
subclass of: abnormal epithelium morphology
definition: Any unspecified morphological anomaly of the retinal pigmented epithelium, such as, for example, abnormal shape or colour.
has_exact_synonym: abnormal morphology of retinal pigmented epithelium

abnormal pancreas morphology
type: Class
subclass of: abnormal pancreas
subclass of: abnormal compound organ morphology
subclass of: abnormal viscus morphology
definition: Any unspecified morphological anomaly of the pancreas, such as, for example, abnormal shape or colour.
has_exact_synonym: abnormal morphology of pancreas

abnormal involuted ventral mesoderm morphology
type: Class
subclass of: abnormal involuted ventral mesoderm
subclass of: abnormal tissue morphology
definition: Any unspecified morphological anomaly of the involuted ventral mesoderm, such as, for example, abnormal shape or colour.
has_exact_synonym: abnormal morphology of involuted ventral mesoderm

abnormal appendage morphology
type: Class
subclass of: abnormal appendage
subclass of: abnormal organism subdivision morphology
definition: Any unspecified morphological anomaly of the appendage, such as, for example, abnormal shape or colour.
has_exact_synonym: abnormal morphology of appendage

abnormal hypophysis morphology
type: Class
subclass of: abnormal hypophysis
subclass of: abnormal multi-tissue structure morphology
definition: Any unspecified morphological anomaly of the hypophysis, such as, for example, abnormal shape or colour.
has_exact_synonym: abnormal morphology of hypophysis

abnormal unilaminar epithelium morphology
type: Class
subclass of: abnormal unilaminar epithelium
subclass of: abnormal epithelium morphology
definition: Any unspecified morphological anomaly of the unilaminar epithelium, such as, for example, abnormal shape or colour.
has_exact_synonym: abnormal morphology of unilaminar epithelium

abnormal periosteum (sensu osteogenic layer) morphology
type: Class
subclass of: abnormal periosteum (sensu osteogenic layer)
subclass of: abnormal connective tissue morphology
definition: Any unspecified morphological anomaly of the periosteum (sensu osteogenic layer), such as, for example, abnormal shape or colour.
has_exact_synonym: abnormal morphology of periosteum (sensu osteogenic layer)

abnormal m. constrictor laryngis primordium morphology
type: Class
subclass of: abnormal m. constrictor laryngis primordium
subclass of: abnormal cranial muscle primordium morphology
definition: Any unspecified morphological anomaly of the m. constrictor laryngis primordium, such as, for example, abnormal shape or colour.
has_exact_synonym: abnormal morphology of m. constrictor laryngis primordium

abnormal mitral cell layer of the olfactory bulb morphology
type: Class
subclass of: abnormal mitral cell layer of the olfactory bulb
subclass of: abnormal tissue morphology
definition: Any unspecified morphological anomaly of the mitral cell layer of the olfactory bulb, such as, for example, abnormal shape or colour.
has_exact_synonym: abnormal morphology of mitral cell layer of the olfactory bulb

abnormal ventral blood island morphology
type: Class
subclass of: abnormal ventral blood island
subclass of: abnormal tissue morphology
definition: Any unspecified morphological anomaly of the ventral blood island, such as, for example, abnormal shape or colour.
has_exact_synonym: abnormal morphology of ventral blood island

abnormal forebrain morphology
type: Class
subclass of: abnormal forebrain
subclass of: abnormal multi-tissue structure morphology
definition: Any unspecified morphological anomaly of the forebrain, such as, for example, abnormal shape or colour.
has_exact_synonym: abnormal morphology of forebrain

abnormal locus coeruleus morphology
type: Class
subclass of: abnormal locus coeruleus
subclass of: abnormal neural nucleus morphology
definition: Any unspecified morphological anomaly of the locus coeruleus, such as, for example, abnormal shape or colour.
has_exact_synonym: abnormal morphology of locus coeruleus

abnormal interrenal vein morphology
type: Class
subclass of: abnormal interrenal vein
subclass of: abnormal vein morphology
definition: Any unspecified morphological anomaly of the interrenal vein, such as, for example, abnormal shape or colour.
has_exact_synonym: abnormal morphology of interrenal vein

abnormal pericardium morphology
type: Class
subclass of: abnormal pericardium
subclass of: abnormal peritoneum morphology
definition: Any unspecified morphological anomaly of the pericardium, such as, for example, abnormal shape or colour.
has_exact_synonym: abnormal morphology of pericardium

abnormal peritoneum morphology
type: Class
subclass of: abnormal peritoneum
subclass of: abnormal serous membrane morphology
definition: Any unspecified morphological anomaly of the peritoneum, such as, for example, abnormal shape or colour.
has_exact_synonym: abnormal morphology of peritoneum

abnormal tail somite 18 morphology
type: Class
subclass of: abnormal tail somite 18
subclass of: abnormal tail somite morphology
definition: Any unspecified morphological anomaly of the tail somite 18, such as, for example, abnormal shape or colour.
has_exact_synonym: abnormal morphology of tail somite 18

abnormal olfactory sensory neuron morphology
type: Class
subclass of: abnormal olfactory sensory neuron
subclass of: abnormal neuron morphology
definition: Any unspecified morphological anomaly of the olfactory sensory neuron, such as, for example, abnormal shape or colour.
has_exact_synonym: abnormal morphology of olfactory sensory neuron

abnormal neuroectoderm morphology
type: Class
subclass of: abnormal neuroectoderm
subclass of: abnormal tissue morphology
definition: Any unspecified morphological anomaly of the neuroectoderm, such as, for example, abnormal shape or colour.
has_exact_synonym: abnormal morphology of neuroectoderm

abnormal dorsolateral placode region morphology
type: Class
subclass of: abnormal dorsolateral placode region
subclass of: abnormal tissue morphology
definition: Any unspecified morphological anomaly of the dorsolateral placode region, such as, for example, abnormal shape or colour.
has_exact_synonym: abnormal morphology of dorsolateral placode region

abnormal primordial germ cell morphology
type: Class
subclass of: abnormal primordial germ cell
subclass of: abnormal germ cell morphology
definition: Any unspecified morphological anomaly of the primordial germ cell, such as, for example, abnormal shape or colour.
has_exact_synonym: abnormal morphology of primordial germ cell

abnormal pharyngeal region morphology
type: Class
subclass of: abnormal pharyngeal region
subclass of: XPO_0141316
definition: Any unspecified morphological anomaly of the pharyngeal region, such as, for example, abnormal shape or colour.
has_exact_synonym: abnormal morphology of pharyngeal region

abnormal primary oogonium morphology
type: Class
subclass of: abnormal primary oogonium
subclass of: abnormal germ cell morphology
definition: Any unspecified morphological anomaly of the primary oogonium, such as, for example, abnormal shape or colour.
has_exact_synonym: abnormal morphology of primary oogonium

abnormal branchial arch 2 morphology
type: Class
subclass of: abnormal branchial arch 2
subclass of: abnormal branchial arch morphology
definition: Any unspecified morphological anomaly of the branchial arch 2, such as, for example, abnormal shape or colour.
has_exact_synonym: abnormal morphology of branchial arch 2

abnormal neurocoel morphology
type: Class
subclass of: abnormal neurocoel
subclass of: abnormal anatomical space morphology
definition: Any unspecified morphological anomaly of the neurocoel, such as, for example, abnormal shape or colour.
has_exact_synonym: abnormal morphology of neurocoel

abnormal anterodorsal lateral line placode morphology
type: Class
subclass of: abnormal anterodorsal lateral line placode
subclass of: abnormal lateral line placode morphology
definition: Any unspecified morphological anomaly of the anterodorsal lateral line placode, such as, for example, abnormal shape or colour.
has_exact_synonym: abnormal morphology of anterodorsal lateral line placode

abnormal trunk somite 3 morphology
type: Class
subclass of: abnormal trunk somite 3
subclass of: abnormal trunk somite morphology
definition: Any unspecified morphological anomaly of the trunk somite 3, such as, for example, abnormal shape or colour.
has_exact_synonym: abnormal morphology of trunk somite 3

abnormal horizontal cell morphology
type: Class
subclass of: abnormal horizontal cell
subclass of: abnormal neuron morphology
definition: Any unspecified morphological anomaly of the horizontal cell, such as, for example, abnormal shape or colour.
has_exact_synonym: abnormal morphology of horizontal cell

abnormal sympathetic chain morphology
type: Class
subclass of: abnormal sympathetic chain
subclass of: abnormal nerve morphology
definition: Any unspecified morphological anomaly of the sympathetic chain, such as, for example, abnormal shape or colour.
has_exact_synonym: abnormal morphology of sympathetic chain

abnormal neuropil of the optic tectum morphology
type: Class
subclass of: abnormal neuropil of the optic tectum
subclass of: abnormal tissue morphology
definition: Any unspecified morphological anomaly of the neuropil of the optic tectum, such as, for example, abnormal shape or colour.
has_exact_synonym: abnormal morphology of neuropil of the optic tectum

abnormal m. levator mandibulae articularis primordium morphology
type: Class
subclass of: abnormal m. levator mandibulae articularis primordium
subclass of: abnormal cranial muscle primordium morphology
definition: Any unspecified morphological anomaly of the m. levator mandibulae articularis primordium, such as, for example, abnormal shape or colour.
has_exact_synonym: abnormal morphology of m. levator mandibulae articularis primordium

abnormal polar body morphology
type: Class
subclass of: abnormal polar body
subclass of: abnormal cell morphology
definition: Any unspecified morphological anomaly of the polar body, such as, for example, abnormal shape or colour.
has_exact_synonym: abnormal morphology of polar body

abnormal notochordal sheath morphology
type: Class
subclass of: abnormal notochordal sheath
subclass of: abnormal tissue morphology
definition: Any unspecified morphological anomaly of the notochordal sheath, such as, for example, abnormal shape or colour.
has_exact_synonym: abnormal morphology of notochordal sheath

abnormal metencephalic vein morphology
type: Class
subclass of: abnormal metencephalic vein
subclass of: abnormal vein morphology
definition: Any unspecified morphological anomaly of the metencephalic vein, such as, for example, abnormal shape or colour.
has_exact_synonym: abnormal morphology of metencephalic vein

abnormal gustatory system morphology
type: Class
subclass of: abnormal gustatory system
subclass of: abnormal sensory system morphology
definition: Any unspecified morphological anomaly of the gustatory system, such as, for example, abnormal shape or colour.
has_exact_synonym: abnormal morphology of gustatory system

abnormal thoracic region morphology
type: Class
subclass of: abnormal thoracic region
subclass of: XPO_0141316
definition: Any unspecified morphological anomaly of the thoracic region, such as, for example, abnormal shape or colour.
has_exact_synonym: abnormal morphology of thoracic region

abnormal smooth muscle myocyte morphology
type: Class
subclass of: abnormal smooth muscle myocyte
subclass of: abnormal myocyte morphology
definition: Any unspecified morphological anomaly of the smooth muscle myocyte, such as, for example, abnormal shape or colour.
has_exact_synonym: abnormal morphology of smooth muscle myocyte

abnormal hypaxial muscle morphology
type: Class
subclass of: abnormal hypaxial muscle
subclass of: abnormal skeletal muscle morphology
definition: Any unspecified morphological anomaly of the hypaxial muscle, such as, for example, abnormal shape or colour.
has_exact_synonym: abnormal morphology of hypaxial muscle

abnormal pre-dentine morphology
type: Class
subclass of: abnormal pre-dentine
subclass of: abnormal odontoid tissue morphology
definition: Any unspecified morphological anomaly of the pre-dentine, such as, for example, abnormal shape or colour.
has_exact_synonym: abnormal morphology of pre-dentine

abnormal mouth morphology
type: Class
subclass of: abnormal mouth
subclass of: abnormal anatomical space morphology
definition: Any unspecified morphological anomaly of the mouth, such as, for example, abnormal shape or colour.
has_exact_synonym: abnormal morphology of mouth

abnormal myotome of trunk somite 6 morphology
type: Class
subclass of: abnormal myotome of trunk somite 6
subclass of: abnormal myotome morphology
definition: Any unspecified morphological anomaly of the myotome of trunk somite 6, such as, for example, abnormal shape or colour.
has_exact_synonym: abnormal morphology of myotome of trunk somite 6

abnormal growth cone morphology
type: Class
subclass of: abnormal growth cone
subclass of: abnormal cell part morphology
definition: Any unspecified morphological anomaly of the growth cone, such as, for example, abnormal shape or colour.
has_exact_synonym: abnormal morphology of growth cone

abnormal prosomere morphology
type: Class
subclass of: abnormal prosomere
subclass of: abnormal neuromere morphology
definition: Any unspecified morphological anomaly of the prosomere, such as, for example, abnormal shape or colour.
has_exact_synonym: abnormal morphology of prosomere

abnormal rhombomere R4 morphology
type: Class
subclass of: abnormal rhombomere R4
subclass of: abnormal rhombomere morphology
definition: Any unspecified morphological anomaly of the rhombomere R4, such as, for example, abnormal shape or colour.
has_exact_synonym: abnormal morphology of rhombomere R4

abnormal medial cardinal vein morphology
type: Class
subclass of: abnormal medial cardinal vein
subclass of: abnormal vein morphology
definition: Any unspecified morphological anomaly of the medial cardinal vein, such as, for example, abnormal shape or colour.
has_exact_synonym: abnormal morphology of medial cardinal vein

abnormal myoblast morphology
type: Class
subclass of: abnormal myoblast
subclass of: abnormal cell morphology
definition: Any unspecified morphological anomaly of the myoblast, such as, for example, abnormal shape or colour.
has_exact_synonym: abnormal morphology of myoblast

abnormal blastomere V2.1 morphology
type: Class
subclass of: abnormal blastomere V2.1
subclass of: abnormal ventral vegetal hemisphere blastomere morphology
definition: Any unspecified morphological anomaly of the blastomere V2.1, such as, for example, abnormal shape or colour.
has_exact_synonym: abnormal morphology of blastomere V2.1

abnormal posteroventral tegmental nucleus morphology
type: Class
subclass of: abnormal posteroventral tegmental nucleus
subclass of: abnormal neural nucleus morphology
definition: Any unspecified morphological anomaly of the posteroventral tegmental nucleus, such as, for example, abnormal shape or colour.
has_exact_synonym: abnormal morphology of posteroventral tegmental nucleus

abnormal ventral hypothalamic nucleus morphology
type: Class
subclass of: abnormal ventral hypothalamic nucleus
subclass of: abnormal neural nucleus morphology
definition: Any unspecified morphological anomaly of the ventral hypothalamic nucleus, such as, for example, abnormal shape or colour.
has_exact_synonym: abnormal morphology of ventral hypothalamic nucleus

abnormal m. rectus cervicis primordium morphology
type: Class
subclass of: abnormal m. rectus cervicis primordium
subclass of: abnormal cranial muscle primordium morphology
definition: Any unspecified morphological anomaly of the m. rectus cervicis primordium, such as, for example, abnormal shape or colour.
has_exact_synonym: abnormal morphology of m. rectus cervicis primordium

abnormal visceral pouch 3 morphology
type: Class
subclass of: abnormal visceral pouch 3
subclass of: abnormal visceral pouch morphology
definition: Any unspecified morphological anomaly of the visceral pouch 3, such as, for example, abnormal shape or colour.
has_exact_synonym: abnormal morphology of visceral pouch 3

abnormal anterior cardinal vein morphology
type: Class
subclass of: abnormal anterior cardinal vein
subclass of: abnormal vein morphology
definition: Any unspecified morphological anomaly of the anterior cardinal vein, such as, for example, abnormal shape or colour.
has_exact_synonym: abnormal morphology of anterior cardinal vein

abnormal gill primordium morphology
type: Class
subclass of: abnormal gill primordium
subclass of: abnormal primordium morphology
definition: Any unspecified morphological anomaly of the gill primordium, such as, for example, abnormal shape or colour.
has_exact_synonym: abnormal morphology of gill primordium

abnormal lung primordium morphology
type: Class
subclass of: abnormal lung primordium
subclass of: abnormal multi-tissue structure morphology
definition: Any unspecified morphological anomaly of the lung primordium, such as, for example, abnormal shape or colour.
has_exact_synonym: abnormal morphology of lung primordium

abnormal enteric neuron morphology
type: Class
subclass of: abnormal enteric neuron
subclass of: abnormal neuron morphology
definition: Any unspecified morphological anomaly of the enteric neuron, such as, for example, abnormal shape or colour.
has_exact_synonym: abnormal morphology of enteric neuron

abnormal periocular region morphology
type: Class
subclass of: abnormal periocular region
subclass of: XPO_0141316
definition: Any unspecified morphological anomaly of the periocular region, such as, for example, abnormal shape or colour.
has_exact_synonym: abnormal morphology of periocular region

abnormal egg jelly morphology
type: Class
subclass of: abnormal egg jelly
subclass of: abnormal acellular anatomical structure morphology
definition: Any unspecified morphological anomaly of the egg jelly, such as, for example, abnormal shape or colour.
has_exact_synonym: abnormal morphology of egg jelly

abnormal primary spermatogonium morphology
type: Class
subclass of: abnormal primary spermatogonium
subclass of: abnormal germ cell morphology
definition: Any unspecified morphological anomaly of the primary spermatogonium, such as, for example, abnormal shape or colour.
has_exact_synonym: abnormal morphology of primary spermatogonium

abnormal vegetal yolk mass morphology
type: Class
subclass of: abnormal vegetal yolk mass
subclass of: abnormal embryonic structure morphology
definition: Any unspecified morphological anomaly of the vegetal yolk mass, such as, for example, abnormal shape or colour.
has_exact_synonym: abnormal morphology of vegetal yolk mass

abnormal posterior lateral line ganglion morphology
type: Class
subclass of: abnormal posterior lateral line ganglion
subclass of: abnormal lateral line ganglion morphology
definition: Any unspecified morphological anomaly of the posterior lateral line ganglion, such as, for example, abnormal shape or colour.
has_exact_synonym: abnormal morphology of posterior lateral line ganglion

abnormal forelimb zeugopod morphology
type: Class
subclass of: abnormal forelimb zeugopod
subclass of: abnormal zeugopod morphology
definition: Any unspecified morphological anomaly of the forelimb zeugopod, such as, for example, abnormal shape or colour.
has_exact_synonym: abnormal morphology of forelimb zeugopod

abnormal myotome of trunk somite 1 morphology
type: Class
subclass of: abnormal myotome of trunk somite 1
subclass of: abnormal myotome morphology
definition: Any unspecified morphological anomaly of the myotome of trunk somite 1, such as, for example, abnormal shape or colour.
has_exact_synonym: abnormal morphology of myotome of trunk somite 1

abnormal m. transversus ventralis II primordium morphology
type: Class
subclass of: abnormal m. transversus ventralis II primordium
subclass of: abnormal cranial muscle primordium morphology
definition: Any unspecified morphological anomaly of the m. transversus ventralis II primordium, such as, for example, abnormal shape or colour.
has_exact_synonym: abnormal morphology of m. transversus ventralis II primordium

abnormal anterior dorsal lateral plate region morphology
type: Class
subclass of: abnormal anterior dorsal lateral plate region
subclass of: abnormal embryonic structure morphology
definition: Any unspecified morphological anomaly of the anterior dorsal lateral plate region, such as, for example, abnormal shape or colour.
has_exact_synonym: abnormal morphology of anterior dorsal lateral plate region

abnormal secondary oogonium morphology
type: Class
subclass of: abnormal secondary oogonium
subclass of: abnormal germ cell morphology
definition: Any unspecified morphological anomaly of the secondary oogonium, such as, for example, abnormal shape or colour.
has_exact_synonym: abnormal morphology of secondary oogonium

abnormal dorsal vegetal hemisphere blastomere morphology
type: Class
subclass of: abnormal dorsal vegetal hemisphere blastomere
subclass of: abnormal vegetal blastomere morphology
definition: Any unspecified morphological anomaly of the dorsal vegetal hemisphere blastomere, such as, for example, abnormal shape or colour.
has_exact_synonym: abnormal morphology of dorsal vegetal hemisphere blastomere

abnormal blastomere D2.2 morphology
type: Class
subclass of: abnormal blastomere D2.2
subclass of: abnormal dorsal vegetal hemisphere blastomere morphology
definition: Any unspecified morphological anomaly of the blastomere D2.2, such as, for example, abnormal shape or colour.
has_exact_synonym: abnormal morphology of blastomere D2.2

abnormal neural fold morphology
type: Class
subclass of: abnormal neural fold
subclass of: abnormal tissue morphology
definition: Any unspecified morphological anomaly of the neural fold, such as, for example, abnormal shape or colour.
has_exact_synonym: abnormal morphology of neural fold

abnormal m. levator scapulae inferior morphology
type: Class
subclass of: abnormal m. levator scapulae inferior
subclass of: abnormal cranial muscle morphology
definition: Any unspecified morphological anomaly of the m. levator scapulae inferior, such as, for example, abnormal shape or colour.
has_exact_synonym: abnormal morphology of m. levator scapulae inferior

abnormal left channel of ventral aorta morphology
type: Class
subclass of: abnormal left channel of ventral aorta
subclass of: abnormal artery morphology
definition: Any unspecified morphological anomaly of the left channel of ventral aorta, such as, for example, abnormal shape or colour.
has_exact_synonym: abnormal morphology of left channel of ventral aorta

abnormal epidermis outer layer morphology
type: Class
subclass of: abnormal epidermis outer layer
subclass of: abnormal epithelium morphology
definition: Any unspecified morphological anomaly of the epidermis outer layer, such as, for example, abnormal shape or colour.
has_exact_synonym: abnormal morphology of epidermis outer layer

abnormal myotome of tail somite 16 morphology
type: Class
subclass of: abnormal myotome of tail somite 16
subclass of: abnormal myotome morphology
definition: Any unspecified morphological anomaly of the myotome of tail somite 16, such as, for example, abnormal shape or colour.
has_exact_synonym: abnormal morphology of myotome of tail somite 16

abnormal iliofibularis morphology
type: Class
subclass of: abnormal iliofibularis
subclass of: XPO_0141574
definition: Any unspecified morphological anomaly of the iliofibularis, such as, for example, abnormal shape or colour.
has_exact_synonym: abnormal morphology of iliofibularis

abnormal trunk somite 1 morphology
type: Class
subclass of: abnormal trunk somite 1
subclass of: abnormal trunk somite morphology
definition: Any unspecified morphological anomaly of the trunk somite 1, such as, for example, abnormal shape or colour.
has_exact_synonym: abnormal morphology of trunk somite 1

abnormal dorsal tail fin morphology
type: Class
subclass of: abnormal dorsal tail fin
subclass of: abnormal fin morphology
definition: Any unspecified morphological anomaly of the dorsal tail fin, such as, for example, abnormal shape or colour.
has_exact_synonym: abnormal morphology of dorsal tail fin

abnormal m. quadrato-hyoangularis primordium morphology
type: Class
subclass of: abnormal m. quadrato-hyoangularis primordium
subclass of: abnormal cranial muscle primordium morphology
definition: Any unspecified morphological anomaly of the m. quadrato-hyoangularis primordium, such as, for example, abnormal shape or colour.
has_exact_synonym: abnormal morphology of m. quadrato-hyoangularis primordium

abnormal olfactory organ morphology
type: Class
subclass of: abnormal olfactory organ
subclass of: abnormal cavitated compound organ morphology
definition: Any unspecified morphological anomaly of the olfactory organ, such as, for example, abnormal shape or colour.
has_exact_synonym: abnormal morphology of olfactory organ

abnormal periotic region morphology
type: Class
subclass of: abnormal periotic region
subclass of: XPO_0141316
definition: Any unspecified morphological anomaly of the periotic region, such as, for example, abnormal shape or colour.
has_exact_synonym: abnormal morphology of periotic region

abnormal adipose tissue morphology
type: Class
subclass of: abnormal adipose tissue
subclass of: abnormal tissue morphology
definition: Any unspecified morphological anomaly of the adipose tissue, such as, for example, abnormal shape or colour.
has_exact_synonym: abnormal morphology of adipose tissue

abnormal involuting marginal zone epithelial layer morphology
type: Class
subclass of: abnormal involuting marginal zone epithelial layer
subclass of: abnormal tissue morphology
definition: Any unspecified morphological anomaly of the involuting marginal zone epithelial layer, such as, for example, abnormal shape or colour.
has_exact_synonym: abnormal morphology of involuting marginal zone epithelial layer

abnormal dorsal fin morphology
type: Class
subclass of: abnormal dorsal fin
subclass of: abnormal fin morphology
definition: Any unspecified morphological anomaly of the dorsal fin, such as, for example, abnormal shape or colour.
has_exact_synonym: abnormal morphology of dorsal fin

abnormal keratin accumulating cell morphology
type: Class
subclass of: abnormal keratin accumulating cell
subclass of: abnormal cell morphology
definition: Any unspecified morphological anomaly of the keratin accumulating cell, such as, for example, abnormal shape or colour.
has_exact_synonym: abnormal morphology of keratin accumulating cell

abnormal vertebral centrum morphology
type: Class
subclass of: abnormal vertebral centrum
subclass of: abnormal skeletal element morphology
definition: Any unspecified morphological anomaly of the vertebral centrum, such as, for example, abnormal shape or colour.
has_exact_synonym: abnormal morphology of vertebral centrum

abnormal lateral line primordium morphology
type: Class
subclass of: abnormal lateral line primordium
subclass of: abnormal primordium morphology
definition: Any unspecified morphological anomaly of the lateral line primordium, such as, for example, abnormal shape or colour.
has_exact_synonym: abnormal morphology of lateral line primordium

abnormal zona limitans intrathalamica morphology
type: Class
subclass of: abnormal zona limitans intrathalamica
subclass of: abnormal tissue morphology
definition: Any unspecified morphological anomaly of the zona limitans intrathalamica, such as, for example, abnormal shape or colour.
has_exact_synonym: abnormal morphology of zona limitans intrathalamica

abnormal sesamoid morphology
type: Class
subclass of: abnormal sesamoid
subclass of: abnormal ossicle morphology
definition: Any unspecified morphological anomaly of the sesamoid, such as, for example, abnormal shape or colour.
has_exact_synonym: abnormal morphology of sesamoid

abnormal caudal artery morphology
type: Class
subclass of: abnormal caudal artery
subclass of: abnormal artery morphology
definition: Any unspecified morphological anomaly of the caudal artery, such as, for example, abnormal shape or colour.
has_exact_synonym: abnormal morphology of caudal artery

abnormal optic stalk morphology
type: Class
subclass of: abnormal optic stalk
subclass of: abnormal tissue morphology
definition: Any unspecified morphological anomaly of the optic stalk, such as, for example, abnormal shape or colour.
has_exact_synonym: abnormal morphology of optic stalk

abnormal parachordal morphology
type: Class
subclass of: abnormal parachordal
subclass of: abnormal cartilage element morphology
definition: Any unspecified morphological anomaly of the parachordal, such as, for example, abnormal shape or colour.
has_exact_synonym: abnormal morphology of parachordal

abnormal sclerotome of tail somite 14 morphology
type: Class
subclass of: abnormal sclerotome of tail somite 14
subclass of: abnormal sclerotome morphology
definition: Any unspecified morphological anomaly of the sclerotome of tail somite 14, such as, for example, abnormal shape or colour.
has_exact_synonym: abnormal morphology of sclerotome of tail somite 14

abnormal microglial cell morphology
type: Class
subclass of: abnormal microglial cell
subclass of: abnormal glial cell morphology
definition: Any unspecified morphological anomaly of the microglial cell, such as, for example, abnormal shape or colour.
has_exact_synonym: abnormal morphology of microglial cell

abnormal glial cell morphology
type: Class
subclass of: abnormal glial cell
subclass of: abnormal cell morphology
definition: Any unspecified morphological anomaly of the glial cell, such as, for example, abnormal shape or colour.
has_exact_synonym: abnormal morphology of glial cell

obsolete abnormal morphology of head region
type: Class
IAO_0000125: abnormal head morphology
deprecated: true

abnormal Merkel cell morphology
type: Class
subclass of: abnormal Merkel cell
subclass of: abnormal cell morphology
definition: Any unspecified morphological anomaly of the Merkel cell, such as, for example, abnormal shape or colour.
has_exact_synonym: abnormal morphology of Merkel cell

abnormal processus retroarticularis of Meckel's cartilage morphology
type: Class
subclass of: abnormal processus retroarticularis of Meckel's cartilage
subclass of: abnormal cartilage element morphology
definition: Any unspecified morphological anomaly of the processus retroarticularis of Meckel's cartilage, such as, for example, abnormal shape or colour.
has_exact_synonym: abnormal morphology of processus retroarticularis of Meckel's cartilage

abnormal myotome of trunk somite 3 morphology
type: Class
subclass of: abnormal myotome of trunk somite 3
subclass of: abnormal myotome morphology
definition: Any unspecified morphological anomaly of the myotome of trunk somite 3, such as, for example, abnormal shape or colour.
has_exact_synonym: abnormal morphology of myotome of trunk somite 3

abnormal central vegetal yolk mass morphology
type: Class
subclass of: abnormal central vegetal yolk mass
subclass of: abnormal embryonic structure morphology
definition: Any unspecified morphological anomaly of the central vegetal yolk mass, such as, for example, abnormal shape or colour.
has_exact_synonym: abnormal morphology of central vegetal yolk mass

abnormal laryngeal muscle morphology
type: Class
subclass of: abnormal laryngeal muscle
subclass of: abnormal cranial muscle morphology
definition: Any unspecified morphological anomaly of the laryngeal muscle, such as, for example, abnormal shape or colour.
has_exact_synonym: abnormal morphology of laryngeal muscle

abnormal pre-chordal neural plate morphology
type: Class
subclass of: abnormal pre-chordal neural plate
subclass of: abnormal tissue morphology
definition: Any unspecified morphological anomaly of the pre-chordal neural plate, such as, for example, abnormal shape or colour.
has_exact_synonym: abnormal morphology of pre-chordal neural plate

abnormal hyaloid vein morphology
type: Class
subclass of: abnormal hyaloid vein
subclass of: abnormal hyaloid blood vessel morphology
definition: Any unspecified morphological anomaly of the hyaloid vein, such as, for example, abnormal shape or colour.
has_exact_synonym: abnormal morphology of hyaloid vein

abnormal ischium morphology
type: Class
subclass of: abnormal ischium
subclass of: abnormal endochondral bone morphology
definition: Any unspecified morphological anomaly of the ischium, such as, for example, abnormal shape or colour.
has_exact_synonym: abnormal morphology of ischium

abnormal ciliated epidermal cell morphology
type: Class
subclass of: abnormal ciliated epidermal cell
subclass of: abnormal epidermal cell morphology
subclass of: abnormal ciliated cell morphology
definition: Any unspecified morphological anomaly of the ciliated epidermal cell, such as, for example, abnormal shape or colour.
has_exact_synonym: abnormal morphology of ciliated epidermal cell

abnormal monociliated cell morphology
type: Class
subclass of: abnormal monociliated cell
subclass of: abnormal ciliated cell morphology
definition: Any unspecified morphological anomaly of the monociliated cell, such as, for example, abnormal shape or colour.
has_exact_synonym: abnormal morphology of monociliated cell

abnormal epidermal cell morphology
type: Class
subclass of: abnormal epidermal cell
subclass of: abnormal epithelial cell morphology
definition: Any unspecified morphological anomaly of the epidermal cell, such as, for example, abnormal shape or colour.
has_exact_synonym: abnormal morphology of epidermal cell

abnormal ciliated cell morphology
type: Class
subclass of: abnormal ciliated cell
subclass of: abnormal cell morphology
definition: Any unspecified morphological anomaly of the ciliated cell, such as, for example, abnormal shape or colour.
has_exact_synonym: abnormal morphology of ciliated cell

abnormal aortic arch 3 morphology
type: Class
subclass of: abnormal aortic arch 3
subclass of: abnormal aortic arch morphology
definition: Any unspecified morphological anomaly of the aortic arch 3, such as, for example, abnormal shape or colour.
has_exact_synonym: abnormal morphology of aortic arch 3

abnormal metacarpus morphology
type: Class
subclass of: abnormal metacarpus
subclass of: abnormal bone element morphology
definition: Any unspecified morphological anomaly of the metacarpus, such as, for example, abnormal shape or colour.
has_exact_synonym: abnormal morphology of metacarpus

abnormal ventral pancreatic bud morphology
type: Class
subclass of: abnormal ventral pancreatic bud
subclass of: abnormal multi-tissue structure morphology
definition: Any unspecified morphological anomaly of the ventral pancreatic bud, such as, for example, abnormal shape or colour.
has_exact_synonym: abnormal morphology of ventral pancreatic bud

abnormal sphenoid region morphology
type: Class
subclass of: abnormal sphenoid region
subclass of: abnormal anatomical cluster morphology
definition: Any unspecified morphological anomaly of the sphenoid region, such as, for example, abnormal shape or colour.
has_exact_synonym: abnormal morphology of sphenoid region

abnormal ilium morphology
type: Class
subclass of: abnormal ilium
subclass of: abnormal endochondral bone morphology
definition: Any unspecified morphological anomaly of the ilium, such as, for example, abnormal shape or colour.
has_exact_synonym: abnormal morphology of ilium

abnormal centromere morphology
type: Class
subclass of: abnormal centromere
subclass of: abnormal cell part morphology
definition: Any unspecified morphological anomaly of the centromere, such as, for example, abnormal shape or colour.
has_exact_synonym: abnormal morphology of centromere

abnormal barbel morphology
type: Class
subclass of: abnormal barbel
subclass of: abnormal surface structure morphology
definition: Any unspecified morphological anomaly of the barbel, such as, for example, abnormal shape or colour.
has_exact_synonym: abnormal morphology of barbel

abnormal lateral postcardinal vein morphology
type: Class
subclass of: abnormal lateral postcardinal vein
subclass of: abnormal vein morphology
definition: Any unspecified morphological anomaly of the lateral postcardinal vein, such as, for example, abnormal shape or colour.
has_exact_synonym: abnormal morphology of lateral postcardinal vein

abnormal kinetochore morphology
type: Class
subclass of: abnormal kinetochore
subclass of: abnormal cell part morphology
definition: Any unspecified morphological anomaly of the kinetochore, such as, for example, abnormal shape or colour.
has_exact_synonym: abnormal morphology of kinetochore

abnormal subpallium morphology
type: Class
subclass of: abnormal subpallium
subclass of: abnormal multi-tissue structure morphology
definition: Any unspecified morphological anomaly of the subpallium, such as, for example, abnormal shape or colour.
has_exact_synonym: abnormal morphology of subpallium

abnormal tail morphology
type: Class
subclass of: abnormal tail
subclass of: abnormal organism subdivision morphology
definition: Any unspecified morphological anomaly of the tail, such as, for example, abnormal shape or colour.
has_exact_synonym: abnormal morphology of tail

abnormal odontogenic papilla morphology
type: Class
subclass of: abnormal odontogenic papilla
subclass of: abnormal cell condensation morphology
definition: Any unspecified morphological anomaly of the odontogenic papilla, such as, for example, abnormal shape or colour.
has_exact_synonym: abnormal morphology of odontogenic papilla

abnormal cell condensation morphology
type: Class
subclass of: abnormal cell condensation
subclass of: abnormal anatomical structure morphology
definition: Any unspecified morphological anomaly of the cell condensation, such as, for example, abnormal shape or colour.
has_exact_synonym: abnormal morphology of cell condensation

abnormal thalamus morphology
type: Class
subclass of: abnormal thalamus
subclass of: abnormal multi-tissue structure morphology
definition: Any unspecified morphological anomaly of the thalamus, such as, for example, abnormal shape or colour.
has_exact_synonym: abnormal morphology of thalamus

abnormal m. subarcualis rectus I morphology
type: Class
subclass of: abnormal m. subarcualis rectus I
subclass of: abnormal branchial head muscle morphology
definition: Any unspecified morphological anomaly of the m. subarcualis rectus I, such as, for example, abnormal shape or colour.
has_exact_synonym: abnormal morphology of m. subarcualis rectus I

abnormal arterial endothelium morphology
type: Class
subclass of: abnormal arterial endothelium
subclass of: abnormal epithelium morphology
definition: Any unspecified morphological anomaly of the arterial endothelium, such as, for example, abnormal shape or colour.
has_exact_synonym: abnormal morphology of arterial endothelium

abnormal tendon fibroblast morphology
type: Class
subclass of: abnormal tendon fibroblast
subclass of: abnormal fibroblast morphology
definition: Any unspecified morphological anomaly of the tendon fibroblast, such as, for example, abnormal shape or colour.
has_exact_synonym: abnormal morphology of tendon fibroblast

abnormal fibroblast morphology
type: Class
subclass of: abnormal fibroblast
subclass of: abnormal mesodermal cell morphology
definition: Any unspecified morphological anomaly of the fibroblast, such as, for example, abnormal shape or colour.
has_exact_synonym: abnormal morphology of fibroblast

abnormal lateral line system morphology
type: Class
subclass of: abnormal lateral line system
subclass of: abnormal sensory system morphology
definition: Any unspecified morphological anomaly of the lateral line system, such as, for example, abnormal shape or colour.
has_exact_synonym: abnormal morphology of lateral line system

abnormal hindgut morphology
type: Class
subclass of: abnormal hindgut
subclass of: abnormal embryonic structure morphology
definition: Any unspecified morphological anomaly of the hindgut, such as, for example, abnormal shape or colour.
has_exact_synonym: abnormal morphology of hindgut

abnormal cardiac ventricle morphology
type: Class
subclass of: abnormal cardiac ventricle
subclass of: abnormal cavitated compound organ morphology
definition: Any unspecified morphological anomaly of the cardiac ventricle, such as, for example, abnormal shape or colour.
has_exact_synonym: abnormal morphology of cardiac ventricle

abnormal epiphysis morphology
type: Class
subclass of: abnormal epiphysis
subclass of: abnormal organ part morphology
definition: Any unspecified morphological anomaly of the epiphysis, such as, for example, abnormal shape or colour.
has_exact_synonym: abnormal morphology of epiphysis

abnormal trunk somite 5 morphology
type: Class
subclass of: abnormal trunk somite 5
subclass of: abnormal trunk somite morphology
definition: Any unspecified morphological anomaly of the trunk somite 5, such as, for example, abnormal shape or colour.
has_exact_synonym: abnormal morphology of trunk somite 5

abnormal hypoglossal nerve morphology
type: Class
subclass of: abnormal hypoglossal nerve
subclass of: abnormal cranial nerve morphology
definition: Any unspecified morphological anomaly of the hypoglossal nerve, such as, for example, abnormal shape or colour.
has_exact_synonym: abnormal morphology of hypoglossal nerve

abnormal profundal placode morphology
type: Class
subclass of: abnormal profundal placode
subclass of: abnormal neurogenic placode morphology
definition: Any unspecified morphological anomaly of the profundal placode, such as, for example, abnormal shape or colour.
has_exact_synonym: abnormal morphology of profundal placode

abnormal blastopore morphology
type: Class
subclass of: abnormal blastopore
subclass of: abnormal embryonic structure morphology
definition: Any unspecified morphological anomaly of the blastopore, such as, for example, abnormal shape or colour.
has_exact_synonym: abnormal morphology of blastopore

abnormal musculoskeletal system morphology
type: Class
subclass of: abnormal musculoskeletal system
subclass of: abnormal anatomical system morphology
definition: Any unspecified morphological anomaly of the musculoskeletal system, such as, for example, abnormal shape or colour.
has_exact_synonym: abnormal morphology of musculoskeletal system

abnormal mm. levator arcuum branchialium I primordium morphology
type: Class
subclass of: abnormal mm. levator arcuum branchialium I primordium
subclass of: abnormal cranial muscle primordium morphology
definition: Any unspecified morphological anomaly of the mm. levator arcuum branchialium I primordium, such as, for example, abnormal shape or colour.
has_exact_synonym: abnormal morphology of mm. levator arcuum branchialium I primordium

abnormal chordal neural plate border morphology
type: Class
subclass of: abnormal chordal neural plate border
subclass of: abnormal tissue morphology
definition: Any unspecified morphological anomaly of the chordal neural plate border, such as, for example, abnormal shape or colour.
has_exact_synonym: abnormal morphology of chordal neural plate border

abnormal anterior lymph sac morphology
type: Class
subclass of: abnormal anterior lymph sac
subclass of: abnormal tissue morphology
definition: Any unspecified morphological anomaly of the anterior lymph sac, such as, for example, abnormal shape or colour.
has_exact_synonym: abnormal morphology of anterior lymph sac

abnormal smooth muscle morphology
type: Class
subclass of: abnormal smooth muscle
subclass of: abnormal muscle morphology
definition: Any unspecified morphological anomaly of the smooth muscle, such as, for example, abnormal shape or colour.
has_exact_synonym: abnormal morphology of smooth muscle

abnormal basilar papilla morphology
type: Class
subclass of: abnormal basilar papilla
subclass of: abnormal tissue morphology
definition: Any unspecified morphological anomaly of the basilar papilla, such as, for example, abnormal shape or colour.
has_exact_synonym: abnormal morphology of basilar papilla

abnormal rhombic lip morphology
type: Class
subclass of: abnormal rhombic lip
subclass of: abnormal primordium morphology
definition: Any unspecified morphological anomaly of the rhombic lip, such as, for example, abnormal shape or colour.
has_exact_synonym: abnormal morphology of rhombic lip

abnormal mucociliary epithelium morphology
type: Class
subclass of: abnormal mucociliary epithelium
subclass of: abnormal epithelium morphology
definition: Any unspecified morphological anomaly of the mucociliary epithelium, such as, for example, abnormal shape or colour.
has_exact_synonym: abnormal morphology of mucociliary epithelium

abnormal regenerating fin morphology
type: Class
subclass of: abnormal regenerating fin
subclass of: abnormal regenerating tissue morphology
definition: Any unspecified morphological anomaly of the regenerating fin, such as, for example, abnormal shape or colour.
has_exact_synonym: abnormal morphology of regenerating fin

abnormal coracoid bone morphology
type: Class
subclass of: abnormal coracoid bone
subclass of: abnormal endochondral bone morphology
definition: Any unspecified morphological anomaly of the coracoid bone, such as, for example, abnormal shape or colour.
has_exact_synonym: abnormal morphology of coracoid bone

abnormal chordal neural plate morphology
type: Class
subclass of: abnormal chordal neural plate
subclass of: abnormal tissue morphology
definition: Any unspecified morphological anomaly of the chordal neural plate, such as, for example, abnormal shape or colour.
has_exact_synonym: abnormal morphology of chordal neural plate

abnormal stria terminalis morphology
type: Class
subclass of: abnormal stria terminalis
subclass of: abnormal anatomical cluster morphology
definition: Any unspecified morphological anomaly of the stria terminalis, such as, for example, abnormal shape or colour.
has_exact_synonym: abnormal morphology of stria terminalis

abnormal electrically active cell morphology
type: Class
subclass of: abnormal electrically active cell
subclass of: abnormal cell morphology
definition: Any unspecified morphological anomaly of the electrically active cell, such as, for example, abnormal shape or colour.
has_exact_synonym: abnormal morphology of electrically active cell

abnormal wound epidermis outer layer morphology
type: Class
subclass of: abnormal wound epidermis outer layer
subclass of: abnormal regenerating tissue morphology
definition: Any unspecified morphological anomaly of the wound epidermis outer layer, such as, for example, abnormal shape or colour.
has_exact_synonym: abnormal morphology of wound epidermis outer layer

abnormal adrenal medulla morphology
type: Class
subclass of: abnormal adrenal medulla
subclass of: abnormal tissue morphology
definition: Any unspecified morphological anomaly of the adrenal medulla, such as, for example, abnormal shape or colour.
has_exact_synonym: abnormal morphology of adrenal medulla

abnormal bed nucleus of the stria terminalis morphology
type: Class
subclass of: abnormal bed nucleus of the stria terminalis
subclass of: abnormal neural nucleus morphology
definition: Any unspecified morphological anomaly of the bed nucleus of the stria terminalis, such as, for example, abnormal shape or colour.
has_exact_synonym: abnormal morphology of bed nucleus of the stria terminalis

abnormal tail bud morphology
type: Class
subclass of: abnormal tail bud
subclass of: abnormal multi-tissue structure morphology
definition: Any unspecified morphological anomaly of the tail bud, such as, for example, abnormal shape or colour.
has_exact_synonym: abnormal morphology of tail bud

abnormal Stirnorgan morphology
type: Class
subclass of: abnormal Stirnorgan
subclass of: abnormal multi-tissue structure morphology
definition: Any unspecified morphological anomaly of the Stirnorgan, such as, for example, abnormal shape or colour.
has_exact_synonym: abnormal morphology of Stirnorgan

abnormal ureter morphology
type: Class
subclass of: abnormal ureter
subclass of: abnormal multi-tissue structure morphology
definition: Any unspecified morphological anomaly of the ureter, such as, for example, abnormal shape or colour.
has_exact_synonym: abnormal morphology of ureter

abnormal intersomitic region morphology
type: Class
subclass of: abnormal intersomitic region
subclass of: XPO_0141316
definition: Any unspecified morphological anomaly of the intersomitic region, such as, for example, abnormal shape or colour.
has_exact_synonym: abnormal morphology of intersomitic region

abnormal pretectum morphology
type: Class
subclass of: abnormal pretectum
subclass of: abnormal multi-tissue structure morphology
definition: Any unspecified morphological anomaly of the pretectum, such as, for example, abnormal shape or colour.
has_exact_synonym: abnormal morphology of pretectum

abnormal paraxial mesoderm morphology
type: Class
subclass of: abnormal paraxial mesoderm
subclass of: abnormal embryonic structure morphology
definition: Any unspecified morphological anomaly of the paraxial mesoderm, such as, for example, abnormal shape or colour.
has_exact_synonym: abnormal morphology of paraxial mesoderm

abnormal male genitalia morphology
type: Class
subclass of: abnormal male genitalia
subclass of: abnormal genital system morphology
definition: Any unspecified morphological anomaly of the male genitalia, such as, for example, abnormal shape or colour.
has_exact_synonym: abnormal morphology of male genitalia

abnormal Meckel's cartilage morphology
type: Class
subclass of: abnormal Meckel's cartilage
subclass of: abnormal cartilage element morphology
definition: Any unspecified morphological anomaly of the Meckel's cartilage, such as, for example, abnormal shape or colour.
has_exact_synonym: abnormal morphology of Meckel's cartilage

abnormal late distal tubule morphology
type: Class
subclass of: abnormal late distal tubule
subclass of: abnormal tissue morphology
definition: Any unspecified morphological anomaly of the late distal tubule, such as, for example, abnormal shape or colour.
has_exact_synonym: abnormal morphology of late distal tubule

abnormal pectoral girdle morphology
type: Class
subclass of: abnormal pectoral girdle
subclass of: abnormal skeletal subdivision morphology
definition: Any unspecified morphological anomaly of the pectoral girdle, such as, for example, abnormal shape or colour.
has_exact_synonym: abnormal morphology of pectoral girdle

abnormal neurocranium morphology
type: Class
subclass of: abnormal neurocranium
subclass of: abnormal anatomical cluster morphology
definition: Any unspecified morphological anomaly of the neurocranium, such as, for example, abnormal shape or colour.
has_exact_synonym: abnormal morphology of neurocranium

abnormal m. rectus superior primordium morphology
type: Class
subclass of: abnormal m. rectus superior primordium
subclass of: abnormal cranial muscle primordium morphology
definition: Any unspecified morphological anomaly of the m. rectus superior primordium, such as, for example, abnormal shape or colour.
has_exact_synonym: abnormal morphology of m. rectus superior primordium

abnormal distal stomach morphology
type: Class
subclass of: abnormal distal stomach
subclass of: abnormal multi-tissue structure morphology
definition: Any unspecified morphological anomaly of the distal stomach, such as, for example, abnormal shape or colour.
has_exact_synonym: abnormal morphology of distal stomach

abnormal animal cap inner layer morphology
type: Class
subclass of: abnormal animal cap inner layer
subclass of: abnormal tissue morphology
definition: Any unspecified morphological anomaly of the animal cap inner layer, such as, for example, abnormal shape or colour.
has_exact_synonym: abnormal morphology of animal cap inner layer

abnormal profundus ganglion morphology
type: Class
subclass of: abnormal profundus ganglion
subclass of: abnormal ganglion morphology
definition: Any unspecified morphological anomaly of the profundus ganglion, such as, for example, abnormal shape or colour.
has_exact_synonym: abnormal morphology of profundus ganglion

abnormal m. levator mandibulae articularis morphology
type: Class
subclass of: abnormal m. levator mandibulae articularis
subclass of: abnormal mandibular head muscle morphology
definition: Any unspecified morphological anomaly of the m. levator mandibulae articularis, such as, for example, abnormal shape or colour.
has_exact_synonym: abnormal morphology of m. levator mandibulae articularis

abnormal rectal diverticulum morphology
type: Class
subclass of: abnormal rectal diverticulum
subclass of: abnormal multi-tissue structure morphology
definition: Any unspecified morphological anomaly of the rectal diverticulum, such as, for example, abnormal shape or colour.
has_exact_synonym: abnormal morphology of rectal diverticulum

abnormal fin crest morphology
type: Class
subclass of: abnormal fin crest
subclass of: abnormal surface structure morphology
definition: Any unspecified morphological anomaly of the fin crest, such as, for example, abnormal shape or colour.
has_exact_synonym: abnormal morphology of fin crest

abnormal posterior cerebral vein morphology
type: Class
subclass of: abnormal posterior cerebral vein
subclass of: abnormal cerebral vein morphology
definition: Any unspecified morphological anomaly of the posterior cerebral vein, such as, for example, abnormal shape or colour.
has_exact_synonym: abnormal morphology of posterior cerebral vein

abnormal mesonephric kidney morphology
type: Class
subclass of: abnormal mesonephric kidney
subclass of: abnormal adult kidney morphology
definition: Any unspecified morphological anomaly of the mesonephric kidney, such as, for example, abnormal shape or colour.
has_exact_synonym: abnormal morphology of mesonephric kidney

abnormal optic choroid vascular plexus morphology
type: Class
subclass of: abnormal optic choroid vascular plexus
subclass of: abnormal vascular plexus morphology
definition: Any unspecified morphological anomaly of the optic choroid vascular plexus, such as, for example, abnormal shape or colour.
has_exact_synonym: abnormal morphology of optic choroid vascular plexus

abnormal vascular plexus morphology
type: Class
subclass of: abnormal vascular plexus
subclass of: abnormal blood vessel morphology
definition: Any unspecified morphological anomaly of the vascular plexus, such as, for example, abnormal shape or colour.
has_exact_synonym: abnormal morphology of vascular plexus

abnormal presumptive ectoderm morphology
type: Class
subclass of: abnormal presumptive ectoderm
subclass of: abnormal embryonic structure morphology
definition: Any unspecified morphological anomaly of the presumptive ectoderm, such as, for example, abnormal shape or colour.
has_exact_synonym: abnormal morphology of presumptive ectoderm

abnormal suprarostral plate morphology
type: Class
subclass of: abnormal suprarostral plate
subclass of: abnormal cartilage element morphology
definition: Any unspecified morphological anomaly of the suprarostral plate, such as, for example, abnormal shape or colour.
has_exact_synonym: abnormal morphology of suprarostral plate

abnormal supraoptoparaventricular region morphology
type: Class
subclass of: abnormal supraoptoparaventricular region
subclass of: abnormal neural nucleus morphology
definition: Any unspecified morphological anomaly of the supraoptoparaventricular region, such as, for example, abnormal shape or colour.
has_exact_synonym: abnormal morphology of supraoptoparaventricular region

abnormal left blastomere morphology
type: Class
subclass of: abnormal left blastomere
subclass of: abnormal blastomere morphology
definition: Any unspecified morphological anomaly of the left blastomere, such as, for example, abnormal shape or colour.
has_exact_synonym: abnormal morphology of left blastomere

abnormal mesencephalic artery morphology
type: Class
subclass of: abnormal mesencephalic artery
subclass of: abnormal artery morphology
definition: Any unspecified morphological anomaly of the mesencephalic artery, such as, for example, abnormal shape or colour.
has_exact_synonym: abnormal morphology of mesencephalic artery

abnormal presumptive axial mesoderm morphology
type: Class
subclass of: abnormal presumptive axial mesoderm
subclass of: abnormal embryonic structure morphology
definition: Any unspecified morphological anomaly of the presumptive axial mesoderm, such as, for example, abnormal shape or colour.
has_exact_synonym: abnormal morphology of presumptive axial mesoderm

abnormal posterior neural tube morphology
type: Class
subclass of: abnormal posterior neural tube
subclass of: abnormal embryonic structure morphology
definition: Any unspecified morphological anomaly of the posterior neural tube, such as, for example, abnormal shape or colour.
has_exact_synonym: abnormal morphology of posterior neural tube

abnormal branchial arch 4 morphology
type: Class
subclass of: abnormal branchial arch 4
subclass of: abnormal branchial arch morphology
definition: Any unspecified morphological anomaly of the branchial arch 4, such as, for example, abnormal shape or colour.
has_exact_synonym: abnormal morphology of branchial arch 4

abnormal occipitovertebral artery morphology
type: Class
subclass of: abnormal occipitovertebral artery
subclass of: abnormal artery morphology
definition: Any unspecified morphological anomaly of the occipitovertebral artery, such as, for example, abnormal shape or colour.
has_exact_synonym: abnormal morphology of occipitovertebral artery

abnormal splanchnic layer of lateral plate mesoderm morphology
type: Class
subclass of: abnormal splanchnic layer of lateral plate mesoderm
subclass of: abnormal embryonic structure morphology
definition: Any unspecified morphological anomaly of the splanchnic layer of lateral plate mesoderm, such as, for example, abnormal shape or colour.
has_exact_synonym: abnormal morphology of splanchnic layer of lateral plate mesoderm

abnormal multiciliated cell precursor morphology
type: Class
subclass of: abnormal multiciliated cell precursor
subclass of: abnormal cell morphology
definition: Any unspecified morphological anomaly of the multiciliated cell precursor, such as, for example, abnormal shape or colour.
has_exact_synonym: abnormal morphology of multiciliated cell precursor

abnormal capillary morphology
type: Class
subclass of: abnormal capillary
subclass of: abnormal blood vessel morphology
definition: Any unspecified morphological anomaly of the capillary, such as, for example, abnormal shape or colour.
has_exact_synonym: abnormal morphology of capillary

abnormal omphalomesenteric vein morphology
type: Class
subclass of: abnormal omphalomesenteric vein
subclass of: abnormal vein morphology
definition: Any unspecified morphological anomaly of the omphalomesenteric vein, such as, for example, abnormal shape or colour.
has_exact_synonym: abnormal morphology of omphalomesenteric vein

abnormal liver morphology
type: Class
subclass of: abnormal liver
subclass of: abnormal solid compound organ morphology
subclass of: abnormal viscus morphology
definition: Any unspecified morphological anomaly of the liver, such as, for example, abnormal shape or colour.
has_exact_synonym: abnormal morphology of liver

abnormal posterior wall of neurenteric canal morphology
type: Class
subclass of: abnormal posterior wall of neurenteric canal
subclass of: abnormal tissue morphology
definition: Any unspecified morphological anomaly of the posterior wall of neurenteric canal, such as, for example, abnormal shape or colour.
has_exact_synonym: abnormal morphology of posterior wall of neurenteric canal

abnormal pseudoblastema morphology
type: Class
subclass of: abnormal pseudoblastema
subclass of: abnormal regenerating tissue morphology
definition: Any unspecified morphological anomaly of the pseudoblastema, such as, for example, abnormal shape or colour.
has_exact_synonym: abnormal morphology of pseudoblastema

abnormal esophagus morphology
type: Class
subclass of: abnormal esophagus
subclass of: abnormal multi-tissue structure morphology
definition: Any unspecified morphological anomaly of the esophagus, such as, for example, abnormal shape or colour.
has_exact_synonym: abnormal morphology of esophagus

abnormal mm. levator arcuum branchialium I morphology
type: Class
subclass of: abnormal mm. levator arcuum branchialium I
subclass of: abnormal branchial head muscle morphology
definition: Any unspecified morphological anomaly of the mm. levator arcuum branchialium I, such as, for example, abnormal shape or colour.
has_exact_synonym: abnormal morphology of mm. levator arcuum branchialium I

abnormal genital ridge morphology
type: Class
subclass of: abnormal genital ridge
subclass of: abnormal tissue morphology
definition: Any unspecified morphological anomaly of the genital ridge, such as, for example, abnormal shape or colour.
has_exact_synonym: abnormal morphology of genital ridge

abnormal ventral marginal zone morphology
type: Class
subclass of: abnormal ventral marginal zone
subclass of: abnormal marginal zone morphology
definition: Any unspecified morphological anomaly of the ventral marginal zone, such as, for example, abnormal shape or colour.
has_exact_synonym: abnormal morphology of ventral marginal zone

abnormal vena capitis lateralis morphology
type: Class
subclass of: abnormal vena capitis lateralis
subclass of: abnormal vein morphology
definition: Any unspecified morphological anomaly of the vena capitis lateralis, such as, for example, abnormal shape or colour.
has_exact_synonym: abnormal morphology of vena capitis lateralis

abnormal exocrine cell morphology
type: Class
subclass of: abnormal exocrine cell
subclass of: abnormal cell morphology
definition: Any unspecified morphological anomaly of the exocrine cell, such as, for example, abnormal shape or colour.
has_exact_synonym: abnormal morphology of exocrine cell

abnormal sclerotomal mesenchyme morphology
type: Class
subclass of: abnormal sclerotomal mesenchyme
subclass of: abnormal mesenchyme morphology
definition: Any unspecified morphological anomaly of the sclerotomal mesenchyme, such as, for example, abnormal shape or colour.
has_exact_synonym: abnormal morphology of sclerotomal mesenchyme

abnormal larynx morphology
type: Class
subclass of: abnormal larynx
subclass of: abnormal cavitated compound organ morphology
definition: Any unspecified morphological anomaly of the larynx, such as, for example, abnormal shape or colour.
has_exact_synonym: abnormal morphology of larynx

abnormal lower blastopore lip morphology
type: Class
subclass of: abnormal lower blastopore lip
subclass of: abnormal embryonic structure morphology
definition: Any unspecified morphological anomaly of the lower blastopore lip, such as, for example, abnormal shape or colour.
has_exact_synonym: abnormal morphology of lower blastopore lip

abnormal osteoid morphology
type: Class
subclass of: abnormal osteoid
subclass of: abnormal bone tissue morphology
subclass of: abnormal matrix-based tissue morphology
definition: Any unspecified morphological anomaly of the osteoid, such as, for example, abnormal shape or colour.
has_exact_synonym: abnormal morphology of osteoid

abnormal matrix-based tissue morphology
type: Class
subclass of: abnormal matrix-based tissue
subclass of: abnormal tissue morphology
definition: Any unspecified morphological anomaly of the matrix-based tissue, such as, for example, abnormal shape or colour.
has_exact_synonym: abnormal morphology of matrix-based tissue

abnormal cardiac jelly morphology
type: Class
subclass of: abnormal cardiac jelly
subclass of: abnormal extracellular matrix morphology
definition: Any unspecified morphological anomaly of the cardiac jelly, such as, for example, abnormal shape or colour.
has_exact_synonym: abnormal morphology of cardiac jelly

abnormal retinal inner plexiform layer morphology
type: Class
subclass of: abnormal retinal inner plexiform layer
subclass of: abnormal tissue morphology
definition: Any unspecified morphological anomaly of the retinal inner plexiform layer, such as, for example, abnormal shape or colour.
has_exact_synonym: abnormal morphology of retinal inner plexiform layer

abnormal medial pallium morphology
type: Class
subclass of: abnormal medial pallium
subclass of: abnormal multi-tissue structure morphology
definition: Any unspecified morphological anomaly of the medial pallium, such as, for example, abnormal shape or colour.
has_exact_synonym: abnormal morphology of medial pallium

abnormal vena capitis medialis morphology
type: Class
subclass of: abnormal vena capitis medialis
subclass of: abnormal vein morphology
definition: Any unspecified morphological anomaly of the vena capitis medialis, such as, for example, abnormal shape or colour.
has_exact_synonym: abnormal morphology of vena capitis medialis

abnormal sulcus limitans of neural tube morphology
type: Class
subclass of: abnormal sulcus limitans of neural tube
subclass of: abnormal surface structure morphology
definition: Any unspecified morphological anomaly of the sulcus limitans of neural tube, such as, for example, abnormal shape or colour.
has_exact_synonym: abnormal morphology of sulcus limitans of neural tube

abnormal branchial arch 3 morphology
type: Class
subclass of: abnormal branchial arch 3
subclass of: abnormal branchial arch morphology
definition: Any unspecified morphological anomaly of the branchial arch 3, such as, for example, abnormal shape or colour.
has_exact_synonym: abnormal morphology of branchial arch 3

abnormal natural killer cell morphology
type: Class
subclass of: abnormal natural killer cell
subclass of: abnormal T cell morphology
definition: Any unspecified morphological anomaly of the natural killer cell, such as, for example, abnormal shape or colour.
has_exact_synonym: abnormal morphology of natural killer cell

abnormal presumptive paraxial mesoderm morphology
type: Class
subclass of: abnormal presumptive paraxial mesoderm
subclass of: abnormal embryonic structure morphology
definition: Any unspecified morphological anomaly of the presumptive paraxial mesoderm, such as, for example, abnormal shape or colour.
has_exact_synonym: abnormal morphology of presumptive paraxial mesoderm

abnormal blastocoel anlage morphology
type: Class
subclass of: abnormal blastocoel anlage
subclass of: abnormal primordium morphology
definition: Any unspecified morphological anomaly of the blastocoel anlage, such as, for example, abnormal shape or colour.
has_exact_synonym: abnormal morphology of blastocoel anlage

abnormal intersomitic neuron morphology
type: Class
subclass of: abnormal intersomitic neuron
subclass of: abnormal neuron morphology
definition: Any unspecified morphological anomaly of the intersomitic neuron, such as, for example, abnormal shape or colour.
has_exact_synonym: abnormal morphology of intersomitic neuron

abnormal retinal stem cell morphology
type: Class
subclass of: abnormal retinal stem cell
subclass of: abnormal stem cell morphology
definition: Any unspecified morphological anomaly of the retinal stem cell, such as, for example, abnormal shape or colour.
has_exact_synonym: abnormal morphology of retinal stem cell

abnormal sclerotome of trunk somite 6 morphology
type: Class
subclass of: abnormal sclerotome of trunk somite 6
subclass of: abnormal sclerotome morphology
definition: Any unspecified morphological anomaly of the sclerotome of trunk somite 6, such as, for example, abnormal shape or colour.
has_exact_synonym: abnormal morphology of sclerotome of trunk somite 6

abnormal hindgut primordium morphology
type: Class
subclass of: abnormal hindgut primordium
subclass of: abnormal primordium morphology
definition: Any unspecified morphological anomaly of the hindgut primordium, such as, for example, abnormal shape or colour.
has_exact_synonym: abnormal morphology of hindgut primordium

abnormal hindlimb zeugopod morphology
type: Class
subclass of: abnormal hindlimb zeugopod
subclass of: abnormal zeugopod morphology
definition: Any unspecified morphological anomaly of the hindlimb zeugopod, such as, for example, abnormal shape or colour.
has_exact_synonym: abnormal morphology of hindlimb zeugopod

abnormal blood morphology
type: Class
subclass of: abnormal blood
subclass of: abnormal portion of organism substance morphology
definition: Any unspecified morphological anomaly of the blood, such as, for example, abnormal shape or colour.
has_exact_synonym: abnormal morphology of blood

abnormal rhombomere R2 morphology
type: Class
subclass of: abnormal rhombomere R2
subclass of: abnormal rhombomere morphology
definition: Any unspecified morphological anomaly of the rhombomere R2, such as, for example, abnormal shape or colour.
has_exact_synonym: abnormal morphology of rhombomere R2

abnormal claw of hindlimb digit 2 morphology
type: Class
subclass of: abnormal claw of hindlimb digit 2
subclass of: abnormal claw morphology
definition: Any unspecified morphological anomaly of the claw of hindlimb digit 2, such as, for example, abnormal shape or colour.
has_exact_synonym: abnormal morphology of claw of hindlimb digit 2

abnormal m. rectus inferior primordium morphology
type: Class
subclass of: abnormal m. rectus inferior primordium
subclass of: abnormal cranial muscle primordium morphology
definition: Any unspecified morphological anomaly of the m. rectus inferior primordium, such as, for example, abnormal shape or colour.
has_exact_synonym: abnormal morphology of m. rectus inferior primordium

abnormal atypical epithelium morphology
type: Class
subclass of: abnormal atypical epithelium
subclass of: abnormal epithelium morphology
definition: Any unspecified morphological anomaly of the atypical epithelium, such as, for example, abnormal shape or colour.
has_exact_synonym: abnormal morphology of atypical epithelium

abnormal atrioventricular valve leaflet morphology
type: Class
subclass of: abnormal atrioventricular valve leaflet
subclass of: abnormal tissue morphology
definition: Any unspecified morphological anomaly of the atrioventricular valve leaflet, such as, for example, abnormal shape or colour.
has_exact_synonym: abnormal morphology of atrioventricular valve leaflet

abnormal postcranial axial skeleton morphology
type: Class
subclass of: abnormal postcranial axial skeleton
subclass of: abnormal skeletal subdivision morphology
definition: Any unspecified morphological anomaly of the postcranial axial skeleton, such as, for example, abnormal shape or colour.
has_exact_synonym: abnormal morphology of postcranial axial skeleton

abnormal midgut primordium morphology
type: Class
subclass of: abnormal midgut primordium
subclass of: abnormal primordium morphology
definition: Any unspecified morphological anomaly of the midgut primordium, such as, for example, abnormal shape or colour.
has_exact_synonym: abnormal morphology of midgut primordium

abnormal bladder morphology
type: Class
subclass of: abnormal bladder
subclass of: abnormal cavitated compound organ morphology
subclass of: abnormal viscus morphology
definition: Any unspecified morphological anomaly of the bladder, such as, for example, abnormal shape or colour.
has_exact_synonym: abnormal morphology of bladder

abnormal sciatic nerve morphology
type: Class
subclass of: abnormal sciatic nerve
subclass of: abnormal nerve morphology
definition: Any unspecified morphological anomaly of the sciatic nerve, such as, for example, abnormal shape or colour.
has_exact_synonym: abnormal morphology of sciatic nerve

abnormal archenteron roof midline morphology
type: Class
subclass of: abnormal archenteron roof midline
subclass of: abnormal anatomical line morphology
definition: Any unspecified morphological anomaly of the archenteron roof midline, such as, for example, abnormal shape or colour.
has_exact_synonym: abnormal morphology of archenteron roof midline

abnormal ventral lateral line morphology
type: Class
subclass of: abnormal ventral lateral line
subclass of: abnormal lateral line morphology
definition: Any unspecified morphological anomaly of the ventral lateral line, such as, for example, abnormal shape or colour.
has_exact_synonym: abnormal morphology of ventral lateral line

abnormal pronephric tubule morphology
type: Class
subclass of: abnormal pronephric tubule
subclass of: abnormal tissue morphology
definition: Any unspecified morphological anomaly of the pronephric tubule, such as, for example, abnormal shape or colour.
has_exact_synonym: abnormal morphology of pronephric tubule

abnormal dorsal fin vasculature morphology
type: Class
subclass of: abnormal dorsal fin vasculature
subclass of: abnormal blood vessel morphology
definition: Any unspecified morphological anomaly of the dorsal fin vasculature, such as, for example, abnormal shape or colour.
has_exact_synonym: abnormal morphology of dorsal fin vasculature

abnormal atrioventricular canal morphology
type: Class
subclass of: abnormal atrioventricular canal
subclass of: abnormal multi-tissue structure morphology
definition: Any unspecified morphological anomaly of the atrioventricular canal, such as, for example, abnormal shape or colour.
has_exact_synonym: abnormal morphology of atrioventricular canal

abnormal m. rectus posterior primordium morphology
type: Class
subclass of: abnormal m. rectus posterior primordium
subclass of: abnormal cranial muscle primordium morphology
definition: Any unspecified morphological anomaly of the m. rectus posterior primordium, such as, for example, abnormal shape or colour.
has_exact_synonym: abnormal morphology of m. rectus posterior primordium

abnormal skeletal myocyte morphology
type: Class
subclass of: abnormal skeletal myocyte
subclass of: abnormal myocyte morphology
definition: Any unspecified morphological anomaly of the skeletal myocyte, such as, for example, abnormal shape or colour.
has_exact_synonym: abnormal morphology of skeletal myocyte

abnormal thyroid morphology
type: Class
subclass of: abnormal thyroid
subclass of: abnormal compound organ morphology
definition: Any unspecified morphological anomaly of the thyroid, such as, for example, abnormal shape or colour.
has_exact_synonym: abnormal morphology of thyroid

abnormal large intestine morphology
type: Class
subclass of: abnormal large intestine
subclass of: abnormal multi-tissue structure morphology
definition: Any unspecified morphological anomaly of the large intestine, such as, for example, abnormal shape or colour.
has_exact_synonym: abnormal morphology of large intestine

abnormal left-dorsal blastomere morphology
type: Class
subclass of: abnormal left-dorsal blastomere
subclass of: abnormal blastomere morphology
definition: Any unspecified morphological anomaly of the left-dorsal blastomere, such as, for example, abnormal shape or colour.
has_exact_synonym: abnormal morphology of left-dorsal blastomere

abnormal fasciculated network of fibrils morphology
type: Class
subclass of: abnormal fasciculated network of fibrils
subclass of: abnormal tissue morphology
subclass of: abnormal extraembryonic structure morphology
definition: Any unspecified morphological anomaly of the fasciculated network of fibrils, such as, for example, abnormal shape or colour.
has_exact_synonym: abnormal morphology of fasciculated network of fibrils

abnormal lens transitional zone morphology
type: Class
subclass of: abnormal lens transitional zone
subclass of: abnormal tissue morphology
definition: Any unspecified morphological anomaly of the lens transitional zone, such as, for example, abnormal shape or colour.
has_exact_synonym: abnormal morphology of lens transitional zone

abnormal basihyal morphology
type: Class
subclass of: abnormal basihyal
subclass of: abnormal cartilage element morphology
definition: Any unspecified morphological anomaly of the basihyal, such as, for example, abnormal shape or colour.
has_exact_synonym: abnormal morphology of basihyal

abnormal hindlimb morphology
type: Class
subclass of: abnormal hindlimb
subclass of: abnormal limb morphology
definition: Any unspecified morphological anomaly of the hindlimb, such as, for example, abnormal shape or colour.
has_exact_synonym: abnormal morphology of hindlimb

abnormal stomach morphology
type: Class
subclass of: abnormal stomach
subclass of: abnormal cavitated compound organ morphology
subclass of: abnormal viscus morphology
definition: Any unspecified morphological anomaly of the stomach, such as, for example, abnormal shape or colour.
has_exact_synonym: abnormal morphology of stomach

abnormal glossopharyngeal epibranchial placode morphology
type: Class
subclass of: abnormal glossopharyngeal epibranchial placode
subclass of: abnormal epibranchial placode morphology
definition: Any unspecified morphological anomaly of the glossopharyngeal epibranchial placode, such as, for example, abnormal shape or colour.
has_exact_synonym: abnormal morphology of glossopharyngeal epibranchial placode

abnormal abducens nerve morphology
type: Class
subclass of: abnormal abducens nerve
subclass of: abnormal cranial nerve morphology
definition: Any unspecified morphological anomaly of the abducens nerve, such as, for example, abnormal shape or colour.
has_exact_synonym: abnormal morphology of abducens nerve

abnormal auditory tube morphology
type: Class
subclass of: abnormal auditory tube
subclass of: abnormal multi-tissue structure morphology
definition: Any unspecified morphological anomaly of the auditory tube, such as, for example, abnormal shape or colour.
has_exact_synonym: abnormal morphology of auditory tube

abnormal infraorbital lateral line primordium morphology
type: Class
subclass of: abnormal infraorbital lateral line primordium
subclass of: abnormal lateral line primordium morphology
definition: Any unspecified morphological anomaly of the infraorbital lateral line primordium, such as, for example, abnormal shape or colour.
has_exact_synonym: abnormal morphology of infraorbital lateral line primordium

abnormal interdigital region morphology
type: Class
subclass of: abnormal interdigital region
subclass of: XPO_0141316
definition: Any unspecified morphological anomaly of the interdigital region, such as, for example, abnormal shape or colour.
has_exact_synonym: abnormal morphology of interdigital region

abnormal osseous labyrinth morphology
type: Class
subclass of: abnormal osseous labyrinth
subclass of: abnormal multi-tissue structure morphology
definition: Any unspecified morphological anomaly of the osseous labyrinth, such as, for example, abnormal shape or colour.
has_exact_synonym: abnormal morphology of osseous labyrinth

abnormal spiracle morphology
type: Class
subclass of: abnormal spiracle
subclass of: abnormal surface structure morphology
definition: Any unspecified morphological anomaly of the spiracle, such as, for example, abnormal shape or colour.
has_exact_synonym: abnormal morphology of spiracle

abnormal posterior placodal area morphology
type: Class
subclass of: abnormal posterior placodal area
subclass of: abnormal tissue morphology
definition: Any unspecified morphological anomaly of the posterior placodal area, such as, for example, abnormal shape or colour.
has_exact_synonym: abnormal morphology of posterior placodal area

abnormal simple organ morphology
type: Class
subclass of: abnormal simple organ
subclass of: abnormal multi-tissue structure morphology
definition: Any unspecified morphological anomaly of the simple organ, such as, for example, abnormal shape or colour.
has_exact_synonym: abnormal morphology of simple organ

abnormal periosteum (sensu fibrous layer) morphology
type: Class
subclass of: abnormal periosteum (sensu fibrous layer)
subclass of: abnormal connective tissue morphology
definition: Any unspecified morphological anomaly of the periosteum (sensu fibrous layer), such as, for example, abnormal shape or colour.
has_exact_synonym: abnormal morphology of periosteum (sensu fibrous layer)

abnormal presumptive midbrain-hindbrain boundary morphology
type: Class
subclass of: abnormal presumptive midbrain-hindbrain boundary
subclass of: abnormal embryonic structure morphology
definition: Any unspecified morphological anomaly of the presumptive midbrain-hindbrain boundary, such as, for example, abnormal shape or colour.
has_exact_synonym: abnormal morphology of presumptive midbrain-hindbrain boundary

abnormal blastomere V1.1.2 morphology
type: Class
subclass of: abnormal blastomere V1.1.2
subclass of: abnormal ventral animal hemisphere blastomere morphology
definition: Any unspecified morphological anomaly of the blastomere V1.1.2, such as, for example, abnormal shape or colour.
has_exact_synonym: abnormal morphology of blastomere V1.1.2

abnormal parathyroid morphology
type: Class
subclass of: abnormal parathyroid
subclass of: abnormal multi-tissue structure morphology
definition: Any unspecified morphological anomaly of the parathyroid, such as, for example, abnormal shape or colour.
has_exact_synonym: abnormal morphology of parathyroid

abnormal blastomere D2.2.2 morphology
type: Class
subclass of: abnormal blastomere D2.2.2
subclass of: abnormal dorsal vegetal hemisphere blastomere morphology
definition: Any unspecified morphological anomaly of the blastomere D2.2.2, such as, for example, abnormal shape or colour.
has_exact_synonym: abnormal morphology of blastomere D2.2.2

abnormal blastomere V1 morphology
type: Class
subclass of: abnormal blastomere V1
subclass of: abnormal blastomere morphology
definition: Any unspecified morphological anomaly of the blastomere V1, such as, for example, abnormal shape or colour.
has_exact_synonym: abnormal morphology of blastomere V1

abnormal spinal neuron morphology
type: Class
subclass of: abnormal spinal neuron
subclass of: abnormal neuron morphology
definition: Any unspecified morphological anomaly of the spinal neuron, such as, for example, abnormal shape or colour.
has_exact_synonym: abnormal morphology of spinal neuron

abnormal dorsolateral ascending neuron morphology
type: Class
subclass of: abnormal dorsolateral ascending neuron
subclass of: abnormal neuron morphology
definition: Any unspecified morphological anomaly of the dorsolateral ascending neuron, such as, for example, abnormal shape or colour.
has_exact_synonym: abnormal morphology of dorsolateral ascending neuron

abnormal trunk musculature morphology
type: Class
subclass of: abnormal trunk musculature
subclass of: abnormal anatomical cluster morphology
definition: Any unspecified morphological anomaly of the trunk musculature, such as, for example, abnormal shape or colour.
has_exact_synonym: abnormal morphology of trunk musculature

abnormal liver primordium morphology
type: Class
subclass of: abnormal liver primordium
subclass of: abnormal primordium morphology
definition: Any unspecified morphological anomaly of the liver primordium, such as, for example, abnormal shape or colour.
has_exact_synonym: abnormal morphology of liver primordium

abnormal apical mesenchyme morphology
type: Class
subclass of: abnormal apical mesenchyme
subclass of: abnormal regenerating tissue morphology
definition: Any unspecified morphological anomaly of the apical mesenchyme, such as, for example, abnormal shape or colour.
has_exact_synonym: abnormal morphology of apical mesenchyme

abnormal transporting epithelium morphology
type: Class
subclass of: abnormal transporting epithelium
subclass of: abnormal epithelium morphology
definition: Any unspecified morphological anomaly of the transporting epithelium, such as, for example, abnormal shape or colour.
has_exact_synonym: abnormal morphology of transporting epithelium

abnormal m. transversus anterior primordium morphology
type: Class
subclass of: abnormal m. transversus anterior primordium
subclass of: abnormal cranial muscle primordium morphology
definition: Any unspecified morphological anomaly of the m. transversus anterior primordium, such as, for example, abnormal shape or colour.
has_exact_synonym: abnormal morphology of m. transversus anterior primordium

abnormal pulmonary epithelium morphology
type: Class
subclass of: abnormal pulmonary epithelium
subclass of: abnormal epithelium morphology
definition: Any unspecified morphological anomaly of the pulmonary epithelium, such as, for example, abnormal shape or colour.
has_exact_synonym: abnormal morphology of pulmonary epithelium

abnormal posterior palatine artery morphology
type: Class
subclass of: abnormal posterior palatine artery
subclass of: abnormal artery morphology
definition: Any unspecified morphological anomaly of the posterior palatine artery, such as, for example, abnormal shape or colour.
has_exact_synonym: abnormal morphology of posterior palatine artery

abnormal neuroendocrine cell morphology
type: Class
subclass of: abnormal neuroendocrine cell
subclass of: abnormal endocrine cell morphology
definition: Any unspecified morphological anomaly of the neuroendocrine cell, such as, for example, abnormal shape or colour.
has_exact_synonym: abnormal morphology of neuroendocrine cell

abnormal retinal stem cell region morphology
type: Class
subclass of: abnormal retinal stem cell region
subclass of: XPO_0141316
definition: Any unspecified morphological anomaly of the retinal stem cell region, such as, for example, abnormal shape or colour.
has_exact_synonym: abnormal morphology of retinal stem cell region

abnormal occipital lateral line morphology
type: Class
subclass of: abnormal occipital lateral line
subclass of: abnormal lateral line morphology
definition: Any unspecified morphological anomaly of the occipital lateral line, such as, for example, abnormal shape or colour.
has_exact_synonym: abnormal morphology of occipital lateral line

abnormal oropharynx morphology
type: Class
subclass of: abnormal oropharynx
subclass of: abnormal anatomical cluster morphology
definition: Any unspecified morphological anomaly of the oropharynx, such as, for example, abnormal shape or colour.
has_exact_synonym: abnormal morphology of oropharynx

abnormal m. levator mandibulae longus superior primordium morphology
type: Class
subclass of: abnormal m. levator mandibulae longus superior primordium
subclass of: abnormal cranial muscle primordium morphology
definition: Any unspecified morphological anomaly of the m. levator mandibulae longus superior primordium, such as, for example, abnormal shape or colour.
has_exact_synonym: abnormal morphology of m. levator mandibulae longus superior primordium

abnormal lateral septum morphology
type: Class
subclass of: abnormal lateral septum
subclass of: XPO_0141720
definition: Any unspecified morphological anomaly of the lateral septum, such as, for example, abnormal shape or colour.
has_exact_synonym: abnormal morphology of lateral septum

abnormal right atrium morphology
type: Class
subclass of: abnormal right atrium
subclass of: abnormal cavitated compound organ morphology
definition: Any unspecified morphological anomaly of the right atrium, such as, for example, abnormal shape or colour.
has_exact_synonym: abnormal morphology of right atrium

abnormal m. depressor mandibulae morphology
type: Class
subclass of: abnormal m. depressor mandibulae
subclass of: abnormal cranial muscle morphology
definition: Any unspecified morphological anomaly of the m. depressor mandibulae, such as, for example, abnormal shape or colour.
has_exact_synonym: abnormal morphology of m. depressor mandibulae

abnormal head mesoderm morphology
type: Class
subclass of: abnormal head mesoderm
subclass of: abnormal tissue morphology
definition: Any unspecified morphological anomaly of the head mesoderm, such as, for example, abnormal shape or colour.
has_exact_synonym: abnormal morphology of head mesoderm

abnormal sclera morphology
type: Class
subclass of: abnormal sclera
subclass of: abnormal multi-tissue structure morphology
definition: Any unspecified morphological anomaly of the sclera, such as, for example, abnormal shape or colour.
has_exact_synonym: abnormal morphology of sclera

abnormal perichondrial cell morphology
type: Class
subclass of: abnormal perichondrial cell
subclass of: abnormal cell morphology
definition: Any unspecified morphological anomaly of the perichondrial cell, such as, for example, abnormal shape or colour.
has_exact_synonym: abnormal morphology of perichondrial cell

abnormal acellular bone tissue morphology
type: Class
subclass of: abnormal acellular bone tissue
subclass of: abnormal mineralized bone tissue morphology
definition: Any unspecified morphological anomaly of the acellular bone tissue, such as, for example, abnormal shape or colour.
has_exact_synonym: abnormal morphology of acellular bone tissue

abnormal dorsal fin margin morphology
type: Class
subclass of: abnormal dorsal fin margin
subclass of: abnormal fin margin morphology
definition: Any unspecified morphological anomaly of the dorsal fin margin, such as, for example, abnormal shape or colour.
has_exact_synonym: abnormal morphology of dorsal fin margin

abnormal m. subarcualis rectus I primordium morphology
type: Class
subclass of: abnormal m. subarcualis rectus I primordium
subclass of: abnormal cranial muscle primordium morphology
definition: Any unspecified morphological anomaly of the m. subarcualis rectus I primordium, such as, for example, abnormal shape or colour.
has_exact_synonym: abnormal morphology of m. subarcualis rectus I primordium

abnormal myotome of tail somite 18 morphology
type: Class
subclass of: abnormal myotome of tail somite 18
subclass of: abnormal myotome morphology
definition: Any unspecified morphological anomaly of the myotome of tail somite 18, such as, for example, abnormal shape or colour.
has_exact_synonym: abnormal morphology of myotome of tail somite 18

abnormal right-dorsal blastomere morphology
type: Class
subclass of: abnormal right-dorsal blastomere
subclass of: abnormal blastomere morphology
definition: Any unspecified morphological anomaly of the right-dorsal blastomere, such as, for example, abnormal shape or colour.
has_exact_synonym: abnormal morphology of right-dorsal blastomere

abnormal microtubule morphology
type: Class
subclass of: abnormal microtubule
subclass of: abnormal cell part morphology
definition: Any unspecified morphological anomaly of the microtubule, such as, for example, abnormal shape or colour.
has_exact_synonym: abnormal morphology of microtubule

abnormal epaxial muscle morphology
type: Class
subclass of: abnormal epaxial muscle
subclass of: abnormal skeletal muscle morphology
definition: Any unspecified morphological anomaly of the epaxial muscle, such as, for example, abnormal shape or colour.
has_exact_synonym: abnormal morphology of epaxial muscle

abnormal pharyngeal cavity morphology
type: Class
subclass of: abnormal pharyngeal cavity
subclass of: abnormal anatomical space morphology
definition: Any unspecified morphological anomaly of the pharyngeal cavity, such as, for example, abnormal shape or colour.
has_exact_synonym: abnormal morphology of pharyngeal cavity

abnormal dorsal lateral line morphology
type: Class
subclass of: abnormal dorsal lateral line
subclass of: abnormal lateral line morphology
definition: Any unspecified morphological anomaly of the dorsal lateral line, such as, for example, abnormal shape or colour.
has_exact_synonym: abnormal morphology of dorsal lateral line

abnormal hyoid arch morphology
type: Class
subclass of: abnormal hyoid arch
subclass of: abnormal pharyngeal arch morphology
definition: Any unspecified morphological anomaly of the hyoid arch, such as, for example, abnormal shape or colour.
has_exact_synonym: abnormal morphology of hyoid arch

abnormal nucleus morphology
type: Class
subclass of: abnormal nucleus
subclass of: abnormal cell part morphology
definition: Any unspecified morphological anomaly of the nucleus, such as, for example, abnormal shape or colour.
has_exact_synonym: abnormal morphology of nucleus

abnormal presacral vertebra morphology
type: Class
subclass of: abnormal presacral vertebra
subclass of: abnormal vertebra morphology
definition: Any unspecified morphological anomaly of the presacral vertebra, such as, for example, abnormal shape or colour.
has_exact_synonym: abnormal morphology of presacral vertebra

abnormal bronchus morphology
type: Class
subclass of: abnormal bronchus
subclass of: abnormal cavitated compound organ morphology
definition: Any unspecified morphological anomaly of the bronchus, such as, for example, abnormal shape or colour.
has_exact_synonym: abnormal morphology of bronchus

abnormal forelimb digit 4 morphology
type: Class
subclass of: abnormal forelimb digit 4
subclass of: abnormal forelimb digit morphology
definition: Any unspecified morphological anomaly of the forelimb digit 4, such as, for example, abnormal shape or colour.
has_exact_synonym: abnormal morphology of forelimb digit 4

abnormal hindlimb stylopod morphology
type: Class
subclass of: abnormal hindlimb stylopod
subclass of: abnormal stylopod morphology
definition: Any unspecified morphological anomaly of the hindlimb stylopod, such as, for example, abnormal shape or colour.
has_exact_synonym: abnormal morphology of hindlimb stylopod

abnormal secondary spermatogonium morphology
type: Class
subclass of: abnormal secondary spermatogonium
subclass of: abnormal germ cell morphology
definition: Any unspecified morphological anomaly of the secondary spermatogonium, such as, for example, abnormal shape or colour.
has_exact_synonym: abnormal morphology of secondary spermatogonium

abnormal angioblast morphology
type: Class
subclass of: abnormal angioblast
subclass of: abnormal cell morphology
definition: Any unspecified morphological anomaly of the angioblast, such as, for example, abnormal shape or colour.
has_exact_synonym: abnormal morphology of angioblast

abnormal blastomere D1.2.2 morphology
type: Class
subclass of: abnormal blastomere D1.2.2
subclass of: abnormal dorsal animal hemisphere blastomere morphology
definition: Any unspecified morphological anomaly of the blastomere D1.2.2, such as, for example, abnormal shape or colour.
has_exact_synonym: abnormal morphology of blastomere D1.2.2

abnormal spermatocyte morphology
type: Class
subclass of: abnormal spermatocyte
subclass of: abnormal germ cell morphology
definition: Any unspecified morphological anomaly of the spermatocyte, such as, for example, abnormal shape or colour.
has_exact_synonym: abnormal morphology of spermatocyte

abnormal dorsal pancreatic bud morphology
type: Class
subclass of: abnormal dorsal pancreatic bud
subclass of: abnormal primordium morphology
definition: Any unspecified morphological anomaly of the dorsal pancreatic bud, such as, for example, abnormal shape or colour.
has_exact_synonym: abnormal morphology of dorsal pancreatic bud

abnormal sensorial layer of neurectoderm morphology
type: Class
subclass of: abnormal sensorial layer of neurectoderm
subclass of: abnormal tissue morphology
definition: Any unspecified morphological anomaly of the sensorial layer of neurectoderm, such as, for example, abnormal shape or colour.
has_exact_synonym: abnormal morphology of sensorial layer of neurectoderm

abnormal left-right organizer primordium morphology
type: Class
subclass of: abnormal left-right organizer primordium
subclass of: abnormal primordium morphology
definition: Any unspecified morphological anomaly of the left-right organizer primordium, such as, for example, abnormal shape or colour.
has_exact_synonym: abnormal morphology of left-right organizer primordium

abnormal lateral nasal prominence morphology
type: Class
subclass of: abnormal lateral nasal prominence
subclass of: abnormal embryonic structure morphology
definition: Any unspecified morphological anomaly of the lateral nasal prominence, such as, for example, abnormal shape or colour.
has_exact_synonym: abnormal morphology of lateral nasal prominence

abnormal cytoplasm morphology
type: Class
subclass of: abnormal cytoplasm
subclass of: abnormal cell part morphology
definition: Any unspecified morphological anomaly of the cytoplasm, such as, for example, abnormal shape or colour.
has_exact_synonym: abnormal morphology of cytoplasm

abnormal dorsal tegmentum morphology
type: Class
subclass of: abnormal dorsal tegmentum
subclass of: abnormal multi-tissue structure morphology
definition: Any unspecified morphological anomaly of the dorsal tegmentum, such as, for example, abnormal shape or colour.
has_exact_synonym: abnormal morphology of dorsal tegmentum

abnormal choroid fissure morphology
type: Class
subclass of: abnormal choroid fissure
subclass of: abnormal embryonic structure morphology
definition: Any unspecified morphological anomaly of the choroid fissure, such as, for example, abnormal shape or colour.
has_exact_synonym: abnormal morphology of choroid fissure

abnormal vacuolated notochordal tissue morphology
type: Class
subclass of: abnormal vacuolated notochordal tissue
subclass of: abnormal connective tissue morphology
definition: Any unspecified morphological anomaly of the vacuolated notochordal tissue, such as, for example, abnormal shape or colour.
has_exact_synonym: abnormal morphology of vacuolated notochordal tissue

abnormal pre-enamel morphology
type: Class
subclass of: abnormal pre-enamel
subclass of: abnormal odontoid tissue morphology
definition: Any unspecified morphological anomaly of the pre-enamel, such as, for example, abnormal shape or colour.
has_exact_synonym: abnormal morphology of pre-enamel

abnormal trabecula morphology
type: Class
subclass of: abnormal trabecula
subclass of: abnormal tissue morphology
definition: Any unspecified morphological anomaly of the trabecula, such as, for example, abnormal shape or colour.
has_exact_synonym: abnormal morphology of trabecula

abnormal Brachet's cleft morphology
type: Class
subclass of: abnormal Brachet's cleft
subclass of: abnormal embryonic structure morphology
definition: Any unspecified morphological anomaly of the Brachet's cleft, such as, for example, abnormal shape or colour.
has_exact_synonym: abnormal morphology of Brachet's cleft

abnormal pars intermedia morphology
type: Class
subclass of: abnormal pars intermedia
subclass of: abnormal organ part morphology
definition: Any unspecified morphological anomaly of the pars intermedia, such as, for example, abnormal shape or colour.
has_exact_synonym: abnormal morphology of pars intermedia

abnormal dermal system morphology
type: Class
subclass of: abnormal dermal system
subclass of: abnormal anatomical system morphology
definition: Any unspecified morphological anomaly of the dermal system, such as, for example, abnormal shape or colour.
has_exact_synonym: abnormal morphology of dermal system

abnormal principal cavity morphology
type: Class
subclass of: abnormal principal cavity
subclass of: abnormal anatomical space morphology
definition: Any unspecified morphological anomaly of the principal cavity, such as, for example, abnormal shape or colour.
has_exact_synonym: abnormal morphology of principal cavity

abnormal stage III oocyte morphology
type: Class
subclass of: abnormal stage III oocyte
subclass of: abnormal oocyte morphology
definition: Any unspecified morphological anomaly of the stage III oocyte, such as, for example, abnormal shape or colour.
has_exact_synonym: abnormal morphology of stage III oocyte

abnormal lens morphology
type: Class
subclass of: abnormal lens
subclass of: abnormal multi-tissue structure morphology
definition: Any unspecified morphological anomaly of the lens, such as, for example, abnormal shape or colour.
has_exact_synonym: abnormal morphology of lens

abnormal branchial arch skeleton 1 morphology
type: Class
subclass of: abnormal branchial arch skeleton 1
subclass of: abnormal branchial arch skeleton morphology
definition: Any unspecified morphological anomaly of the branchial arch skeleton 1, such as, for example, abnormal shape or colour.
has_exact_synonym: abnormal morphology of branchial arch skeleton 1

abnormal branchial arch skeleton morphology
type: Class
subclass of: abnormal branchial arch skeleton
subclass of: abnormal skeletal subdivision morphology
definition: Any unspecified morphological anomaly of the branchial arch skeleton, such as, for example, abnormal shape or colour.
has_exact_synonym: abnormal morphology of branchial arch skeleton

abnormal dorsal caudal lymphatic vessel morphology
type: Class
subclass of: abnormal dorsal caudal lymphatic vessel
subclass of: abnormal lymph vessel morphology
definition: Any unspecified morphological anomaly of the dorsal caudal lymphatic vessel, such as, for example, abnormal shape or colour.
has_exact_synonym: abnormal morphology of dorsal caudal lymphatic vessel

abnormal lymph vessel morphology
type: Class
subclass of: abnormal lymph vessel
subclass of: abnormal multi-tissue structure morphology
definition: Any unspecified morphological anomaly of the lymph vessel, such as, for example, abnormal shape or colour.
has_exact_synonym: abnormal morphology of lymph vessel

abnormal granule cell layer of the cerebellum morphology
type: Class
subclass of: abnormal granule cell layer of the cerebellum
subclass of: abnormal tissue morphology
definition: Any unspecified morphological anomaly of the granule cell layer of the cerebellum, such as, for example, abnormal shape or colour.
has_exact_synonym: abnormal morphology of granule cell layer of the cerebellum

abnormal spermatozoon morphology
type: Class
subclass of: abnormal spermatozoon
subclass of: abnormal gamete morphology
definition: Any unspecified morphological anomaly of the spermatozoon, such as, for example, abnormal shape or colour.
has_exact_synonym: abnormal morphology of spermatozoon

abnormal visceral pouch 5 morphology
type: Class
subclass of: abnormal visceral pouch 5
subclass of: abnormal visceral pouch morphology
definition: Any unspecified morphological anomaly of the visceral pouch 5, such as, for example, abnormal shape or colour.
has_exact_synonym: abnormal morphology of visceral pouch 5

abnormal mm. constrictores branchiales II primordium morphology
type: Class
subclass of: abnormal mm. constrictores branchiales II primordium
subclass of: abnormal cranial muscle primordium morphology
definition: Any unspecified morphological anomaly of the mm. constrictores branchiales II primordium, such as, for example, abnormal shape or colour.
has_exact_synonym: abnormal morphology of mm. constrictores branchiales II primordium

abnormal sacral vertebra morphology
type: Class
subclass of: abnormal sacral vertebra
subclass of: abnormal vertebra morphology
definition: Any unspecified morphological anomaly of the sacral vertebra, such as, for example, abnormal shape or colour.
has_exact_synonym: abnormal morphology of sacral vertebra

abnormal m. levator mandibulae externus morphology
type: Class
subclass of: abnormal m. levator mandibulae externus
subclass of: abnormal mandibular head muscle morphology
definition: Any unspecified morphological anomaly of the m. levator mandibulae externus, such as, for example, abnormal shape or colour.
has_exact_synonym: abnormal morphology of m. levator mandibulae externus

abnormal dermis morphology
type: Class
subclass of: abnormal dermis
subclass of: abnormal multi-tissue structure morphology
definition: Any unspecified morphological anomaly of the dermis, such as, for example, abnormal shape or colour.
has_exact_synonym: abnormal morphology of dermis

abnormal anterior tectum morphology
type: Class
subclass of: abnormal anterior tectum
subclass of: abnormal multi-tissue structure morphology
definition: Any unspecified morphological anomaly of the anterior tectum, such as, for example, abnormal shape or colour.
has_exact_synonym: abnormal morphology of anterior tectum

abnormal hyoid arch skeleton morphology
type: Class
subclass of: abnormal hyoid arch skeleton
subclass of: abnormal skeletal subdivision morphology
definition: Any unspecified morphological anomaly of the hyoid arch skeleton, such as, for example, abnormal shape or colour.
has_exact_synonym: abnormal morphology of hyoid arch skeleton

abnormal olfactory region morphology
type: Class
subclass of: abnormal olfactory region
subclass of: abnormal anatomical cluster morphology
definition: Any unspecified morphological anomaly of the olfactory region, such as, for example, abnormal shape or colour.
has_exact_synonym: abnormal morphology of olfactory region

abnormal branchial vein morphology
type: Class
subclass of: abnormal branchial vein
subclass of: abnormal vein morphology
definition: Any unspecified morphological anomaly of the branchial vein, such as, for example, abnormal shape or colour.
has_exact_synonym: abnormal morphology of branchial vein

abnormal claw primordium morphology
type: Class
subclass of: abnormal claw primordium
subclass of: abnormal tissue morphology
definition: Any unspecified morphological anomaly of the claw primordium, such as, for example, abnormal shape or colour.
has_exact_synonym: abnormal morphology of claw primordium

abnormal skeleton morphology
type: Class
subclass of: abnormal skeleton
subclass of: abnormal anatomical cluster morphology
definition: Any unspecified morphological anomaly of the skeleton, such as, for example, abnormal shape or colour.
has_exact_synonym: abnormal morphology of skeleton

abnormal osteoblast morphology
type: Class
subclass of: abnormal osteoblast
subclass of: abnormal cell morphology
definition: Any unspecified morphological anomaly of the osteoblast, such as, for example, abnormal shape or colour.
has_exact_synonym: abnormal morphology of osteoblast

abnormal duct of Cuvier morphology
type: Class
subclass of: abnormal duct of Cuvier
subclass of: abnormal vein morphology
definition: Any unspecified morphological anomaly of the duct of Cuvier, such as, for example, abnormal shape or colour.
has_exact_synonym: abnormal morphology of duct of Cuvier

abnormal ceratobranchial II morphology
type: Class
subclass of: abnormal ceratobranchial II
subclass of: abnormal cartilage element morphology
definition: Any unspecified morphological anomaly of the ceratobranchial II, such as, for example, abnormal shape or colour.
has_exact_synonym: abnormal morphology of ceratobranchial II

abnormal hatching gland primordium morphology
type: Class
subclass of: abnormal hatching gland primordium
subclass of: abnormal primordium morphology
definition: Any unspecified morphological anomaly of the hatching gland primordium, such as, for example, abnormal shape or colour.
has_exact_synonym: abnormal morphology of hatching gland primordium

abnormal secondary heart field morphology
type: Class
subclass of: abnormal secondary heart field
subclass of: abnormal tissue morphology
definition: Any unspecified morphological anomaly of the secondary heart field, such as, for example, abnormal shape or colour.
has_exact_synonym: abnormal morphology of secondary heart field

abnormal regenerating forelimb morphology
type: Class
subclass of: abnormal regenerating forelimb
subclass of: abnormal regenerating limb morphology
definition: Any unspecified morphological anomaly of the regenerating forelimb, such as, for example, abnormal shape or colour.
has_exact_synonym: abnormal morphology of regenerating forelimb

abnormal caudal vein morphology
type: Class
subclass of: abnormal caudal vein
subclass of: abnormal vein morphology
definition: Any unspecified morphological anomaly of the caudal vein, such as, for example, abnormal shape or colour.
has_exact_synonym: abnormal morphology of caudal vein

abnormal ethmoid bone morphology
type: Class
subclass of: abnormal ethmoid bone
subclass of: abnormal endochondral bone morphology
definition: Any unspecified morphological anomaly of the ethmoid bone, such as, for example, abnormal shape or colour.
has_exact_synonym: abnormal morphology of ethmoid bone

abnormal sclerotome of trunk somite 13 morphology
type: Class
subclass of: abnormal sclerotome of trunk somite 13
subclass of: abnormal sclerotome morphology
definition: Any unspecified morphological anomaly of the sclerotome of trunk somite 13, such as, for example, abnormal shape or colour.
has_exact_synonym: abnormal morphology of sclerotome of trunk somite 13

abnormal melanotrope morphology
type: Class
subclass of: abnormal melanotrope
subclass of: abnormal cell morphology
definition: Any unspecified morphological anomaly of the melanotrope, such as, for example, abnormal shape or colour.
has_exact_synonym: abnormal morphology of melanotrope

abnormal middle lateral line placode morphology
type: Class
subclass of: abnormal middle lateral line placode
subclass of: abnormal lateral line placode morphology
definition: Any unspecified morphological anomaly of the middle lateral line placode, such as, for example, abnormal shape or colour.
has_exact_synonym: abnormal morphology of middle lateral line placode

abnormal m. petrohyoideus morphology
type: Class
subclass of: abnormal m. petrohyoideus
subclass of: abnormal cranial muscle morphology
definition: Any unspecified morphological anomaly of the m. petrohyoideus, such as, for example, abnormal shape or colour.
has_exact_synonym: abnormal morphology of m. petrohyoideus

abnormal outer limiting membrane morphology
type: Class
subclass of: abnormal outer limiting membrane
subclass of: abnormal tissue morphology
definition: Any unspecified morphological anomaly of the outer limiting membrane, such as, for example, abnormal shape or colour.
has_exact_synonym: abnormal morphology of outer limiting membrane

abnormal pronephric nephron morphology
type: Class
subclass of: abnormal pronephric nephron
subclass of: abnormal multi-tissue structure morphology
definition: Any unspecified morphological anomaly of the pronephric nephron, such as, for example, abnormal shape or colour.
has_exact_synonym: abnormal morphology of pronephric nephron

abnormal adenohypophysis morphology
type: Class
subclass of: abnormal adenohypophysis
subclass of: abnormal multi-tissue structure morphology
definition: Any unspecified morphological anomaly of the adenohypophysis, such as, for example, abnormal shape or colour.
has_exact_synonym: abnormal morphology of adenohypophysis

abnormal dorsal septum morphology
type: Class
subclass of: abnormal dorsal septum
subclass of: XPO_0141720
definition: Any unspecified morphological anomaly of the dorsal septum, such as, for example, abnormal shape or colour.
has_exact_synonym: abnormal morphology of dorsal septum

abnormal mesonephric duct morphology
type: Class
subclass of: abnormal mesonephric duct
subclass of: abnormal duct morphology
definition: Any unspecified morphological anomaly of the mesonephric duct, such as, for example, abnormal shape or colour.
has_exact_synonym: abnormal morphology of mesonephric duct

abnormal neural progenitor cell morphology
type: Class
subclass of: abnormal neural progenitor cell
subclass of: abnormal progenitor cell morphology
definition: Any unspecified morphological anomaly of the neural progenitor cell, such as, for example, abnormal shape or colour.
has_exact_synonym: abnormal morphology of neural progenitor cell

abnormal internal jugular vein morphology
type: Class
subclass of: abnormal internal jugular vein
subclass of: abnormal vein morphology
definition: Any unspecified morphological anomaly of the internal jugular vein, such as, for example, abnormal shape or colour.
has_exact_synonym: abnormal morphology of internal jugular vein

abnormal centrosome morphology
type: Class
subclass of: abnormal centrosome
subclass of: abnormal cell part morphology
definition: Any unspecified morphological anomaly of the centrosome, such as, for example, abnormal shape or colour.
has_exact_synonym: abnormal morphology of centrosome

abnormal tail somite 14 morphology
type: Class
subclass of: abnormal tail somite 14
subclass of: abnormal tail somite morphology
definition: Any unspecified morphological anomaly of the tail somite 14, such as, for example, abnormal shape or colour.
has_exact_synonym: abnormal morphology of tail somite 14

abnormal monociliated epidermal cell morphology
type: Class
subclass of: abnormal monociliated epidermal cell
subclass of: abnormal ciliated epidermal cell morphology
subclass of: abnormal monociliated cell morphology
definition: Any unspecified morphological anomaly of the monociliated epidermal cell, such as, for example, abnormal shape or colour.
has_exact_synonym: abnormal morphology of monociliated epidermal cell

abnormal postmigratory neural crest cell morphology
type: Class
subclass of: abnormal postmigratory neural crest cell
subclass of: abnormal cell morphology
definition: Any unspecified morphological anomaly of the postmigratory neural crest cell, such as, for example, abnormal shape or colour.
has_exact_synonym: abnormal morphology of postmigratory neural crest cell

abnormal dorsal thalamus morphology
type: Class
subclass of: abnormal dorsal thalamus
subclass of: abnormal multi-tissue structure morphology
definition: Any unspecified morphological anomaly of the dorsal thalamus, such as, for example, abnormal shape or colour.
has_exact_synonym: abnormal morphology of dorsal thalamus

abnormal trunk somite 4 morphology
type: Class
subclass of: abnormal trunk somite 4
subclass of: abnormal trunk somite morphology
definition: Any unspecified morphological anomaly of the trunk somite 4, such as, for example, abnormal shape or colour.
has_exact_synonym: abnormal morphology of trunk somite 4

abnormal follicle layer morphology
type: Class
subclass of: abnormal follicle layer
subclass of: abnormal tissue morphology
definition: Any unspecified morphological anomaly of the follicle layer, such as, for example, abnormal shape or colour.
has_exact_synonym: abnormal morphology of follicle layer

abnormal blastomere V2.2 morphology
type: Class
subclass of: abnormal blastomere V2.2
subclass of: abnormal ventral vegetal hemisphere blastomere morphology
definition: Any unspecified morphological anomaly of the blastomere V2.2, such as, for example, abnormal shape or colour.
has_exact_synonym: abnormal morphology of blastomere V2.2

abnormal forelimb digit 3 morphology
type: Class
subclass of: abnormal forelimb digit 3
subclass of: abnormal forelimb digit morphology
definition: Any unspecified morphological anomaly of the forelimb digit 3, such as, for example, abnormal shape or colour.
has_exact_synonym: abnormal morphology of forelimb digit 3

abnormal blastomere V2.1.2 morphology
type: Class
subclass of: abnormal blastomere V2.1.2
subclass of: abnormal ventral vegetal hemisphere blastomere morphology
definition: Any unspecified morphological anomaly of the blastomere V2.1.2, such as, for example, abnormal shape or colour.
has_exact_synonym: abnormal morphology of blastomere V2.1.2

abnormal cervical vertebra morphology
type: Class
subclass of: abnormal cervical vertebra
subclass of: abnormal vertebra morphology
definition: Any unspecified morphological anomaly of the cervical vertebra, such as, for example, abnormal shape or colour.
has_exact_synonym: abnormal morphology of cervical vertebra

abnormal disaggregated/reaggregated ectoderm treated with activin morphology
type: Class
subclass of: abnormal disaggregated/reaggregated ectoderm treated with activin
subclass of: abnormal anatomical entity in vitro morphology
definition: Any unspecified morphological anomaly of the disaggregated/reaggregated ectoderm treated with activin, such as, for example, abnormal shape or colour.
has_exact_synonym: abnormal morphology of disaggregated/reaggregated ectoderm treated with activin

abnormal carpus morphology
type: Class
subclass of: abnormal carpus
subclass of: abnormal bone element morphology
definition: Any unspecified morphological anomaly of the carpus, such as, for example, abnormal shape or colour.
has_exact_synonym: abnormal morphology of carpus

abnormal prethalamus basal plate morphology
type: Class
subclass of: abnormal prethalamus basal plate
subclass of: abnormal tissue morphology
definition: Any unspecified morphological anomaly of the prethalamus basal plate, such as, for example, abnormal shape or colour.
has_exact_synonym: abnormal morphology of prethalamus basal plate

abnormal ventral pallidum morphology
type: Class
subclass of: abnormal ventral pallidum
subclass of: abnormal anatomical cluster morphology
definition: Any unspecified morphological anomaly of the ventral pallidum, such as, for example, abnormal shape or colour.
has_exact_synonym: abnormal morphology of ventral pallidum

abnormal dermal skeleton morphology
type: Class
subclass of: abnormal dermal skeleton
subclass of: abnormal skeletal subdivision morphology
definition: Any unspecified morphological anomaly of the dermal skeleton, such as, for example, abnormal shape or colour.
has_exact_synonym: abnormal morphology of dermal skeleton

abnormal cardiac mesoderm morphology
type: Class
subclass of: abnormal cardiac mesoderm
subclass of: abnormal embryonic structure morphology
definition: Any unspecified morphological anomaly of the cardiac mesoderm, such as, for example, abnormal shape or colour.
has_exact_synonym: abnormal morphology of cardiac mesoderm

abnormal multiciliated epidermal cell morphology
type: Class
subclass of: abnormal multiciliated epidermal cell
subclass of: abnormal ciliated epidermal cell morphology
subclass of: abnormal multiciliated cell morphology
definition: Any unspecified morphological anomaly of the multiciliated epidermal cell, such as, for example, abnormal shape or colour.
has_exact_synonym: abnormal morphology of multiciliated epidermal cell

abnormal multiciliated cell morphology
type: Class
subclass of: abnormal multiciliated cell
subclass of: abnormal ciliated cell morphology
definition: Any unspecified morphological anomaly of the multiciliated cell, such as, for example, abnormal shape or colour.
has_exact_synonym: abnormal morphology of multiciliated cell

abnormal m. obliquus inferior morphology
type: Class
subclass of: abnormal m. obliquus inferior
subclass of: abnormal eye muscle morphology
definition: Any unspecified morphological anomaly of the m. obliquus inferior, such as, for example, abnormal shape or colour.
has_exact_synonym: abnormal morphology of m. obliquus inferior

abnormal mm. levator arcuum branchialium II primordium morphology
type: Class
subclass of: abnormal mm. levator arcuum branchialium II primordium
subclass of: abnormal cranial muscle primordium morphology
definition: Any unspecified morphological anomaly of the mm. levator arcuum branchialium II primordium, such as, for example, abnormal shape or colour.
has_exact_synonym: abnormal morphology of mm. levator arcuum branchialium II primordium

abnormal neuroectoderm inner layer morphology
type: Class
subclass of: abnormal neuroectoderm inner layer
subclass of: abnormal tissue morphology
definition: Any unspecified morphological anomaly of the neuroectoderm inner layer, such as, for example, abnormal shape or colour.
has_exact_synonym: abnormal morphology of neuroectoderm inner layer

abnormal dorsal longitudinal anastomosing vessel - left branch morphology
type: Class
subclass of: abnormal dorsal longitudinal anastomosing vessel - left branch
subclass of: abnormal dorsal longitudinal anastomosing vessel morphology
definition: Any unspecified morphological anomaly of the dorsal longitudinal anastomosing vessel - left branch, such as, for example, abnormal shape or colour.
has_exact_synonym: abnormal morphology of dorsal longitudinal anastomosing vessel - left branch

abnormal dorsal longitudinal anastomosing vessel morphology
type: Class
subclass of: abnormal dorsal longitudinal anastomosing vessel
subclass of: abnormal blood vessel morphology
definition: Any unspecified morphological anomaly of the dorsal longitudinal anastomosing vessel, such as, for example, abnormal shape or colour.
has_exact_synonym: abnormal morphology of dorsal longitudinal anastomosing vessel

abnormal stapes morphology
type: Class
subclass of: abnormal stapes
subclass of: abnormal cartilage element morphology
subclass of: abnormal auditory ossicle morphology
definition: Any unspecified morphological anomaly of the stapes, such as, for example, abnormal shape or colour.
has_exact_synonym: abnormal morphology of stapes

abnormal skin gland morphology
type: Class
subclass of: abnormal skin gland
subclass of: abnormal surface structure morphology
definition: Any unspecified morphological anomaly of the skin gland, such as, for example, abnormal shape or colour.
has_exact_synonym: abnormal morphology of skin gland

abnormal adult intestinal epithelium morphology
type: Class
subclass of: abnormal adult intestinal epithelium
subclass of: abnormal simple columnar epithelium morphology
subclass of: abnormal gut epithelium morphology
definition: Any unspecified morphological anomaly of the adult intestinal epithelium, such as, for example, abnormal shape or colour.
has_exact_synonym: abnormal morphology of adult intestinal epithelium

abnormal simple columnar epithelium morphology
type: Class
subclass of: abnormal simple columnar epithelium
subclass of: abnormal unilaminar epithelium morphology
definition: Any unspecified morphological anomaly of the simple columnar epithelium, such as, for example, abnormal shape or colour.
has_exact_synonym: abnormal morphology of simple columnar epithelium

abnormal gut epithelium morphology
type: Class
subclass of: abnormal gut epithelium
subclass of: abnormal epithelium morphology
definition: Any unspecified morphological anomaly of the gut epithelium, such as, for example, abnormal shape or colour.
has_exact_synonym: abnormal morphology of gut epithelium

abnormal larval aorta morphology
type: Class
subclass of: abnormal larval aorta
subclass of: abnormal artery morphology
definition: Any unspecified morphological anomaly of the larval aorta, such as, for example, abnormal shape or colour.
has_exact_synonym: abnormal morphology of larval aorta

abnormal habenula morphology
type: Class
subclass of: abnormal habenula
subclass of: abnormal multi-tissue structure morphology
definition: Any unspecified morphological anomaly of the habenula, such as, for example, abnormal shape or colour.
has_exact_synonym: abnormal morphology of habenula

abnormal right blastomere morphology
type: Class
subclass of: abnormal right blastomere
subclass of: abnormal blastomere morphology
definition: Any unspecified morphological anomaly of the right blastomere, such as, for example, abnormal shape or colour.
has_exact_synonym: abnormal morphology of right blastomere

abnormal myotome of head somite 4 morphology
type: Class
subclass of: abnormal myotome of head somite 4
subclass of: abnormal myotome morphology
definition: Any unspecified morphological anomaly of the myotome of head somite 4, such as, for example, abnormal shape or colour.
has_exact_synonym: abnormal morphology of myotome of head somite 4

abnormal iliac process primordium morphology
type: Class
subclass of: abnormal iliac process primordium
subclass of: abnormal multi-tissue structure morphology
definition: Any unspecified morphological anomaly of the iliac process primordium, such as, for example, abnormal shape or colour.
has_exact_synonym: abnormal morphology of iliac process primordium

abnormal visceral pouch 6 morphology
type: Class
subclass of: abnormal visceral pouch 6
subclass of: abnormal visceral pouch morphology
definition: Any unspecified morphological anomaly of the visceral pouch 6, such as, for example, abnormal shape or colour.
has_exact_synonym: abnormal morphology of visceral pouch 6

abnormal ligament cell morphology
type: Class
subclass of: abnormal ligament cell
subclass of: abnormal cell morphology
definition: Any unspecified morphological anomaly of the ligament cell, such as, for example, abnormal shape or colour.
has_exact_synonym: abnormal morphology of ligament cell

abnormal granular gland morphology
type: Class
subclass of: abnormal granular gland
subclass of: abnormal skin gland morphology
definition: Any unspecified morphological anomaly of the granular gland, such as, for example, abnormal shape or colour.
has_exact_synonym: abnormal morphology of granular gland

abnormal otic vesicle morphology
type: Class
subclass of: abnormal otic vesicle
subclass of: abnormal tissue morphology
definition: Any unspecified morphological anomaly of the otic vesicle, such as, for example, abnormal shape or colour.
has_exact_synonym: abnormal morphology of otic vesicle

abnormal palatoquadrati morphology
type: Class
subclass of: abnormal palatoquadrati
subclass of: abnormal cartilage element morphology
definition: Any unspecified morphological anomaly of the palatoquadrati, such as, for example, abnormal shape or colour.
has_exact_synonym: abnormal morphology of palatoquadrati

obsolete abnormal equatorial belt morphology
type: Class
deprecated: true

abnormal rostral tuberal region morphology
type: Class
subclass of: abnormal rostral tuberal region
subclass of: abnormal multi-tissue structure morphology
definition: Any unspecified morphological anomaly of the rostral tuberal region, such as, for example, abnormal shape or colour.
has_exact_synonym: abnormal morphology of rostral tuberal region

abnormal serous membrane morphology
type: Class
subclass of: abnormal serous membrane
subclass of: abnormal multi-tissue structure morphology
definition: Any unspecified morphological anomaly of the serous membrane, such as, for example, abnormal shape or colour.
has_exact_synonym: abnormal morphology of serous membrane

abnormal planum hypobranchiale morphology
type: Class
subclass of: abnormal planum hypobranchiale
subclass of: abnormal cartilage element morphology
definition: Any unspecified morphological anomaly of the planum hypobranchiale, such as, for example, abnormal shape or colour.
has_exact_synonym: abnormal morphology of planum hypobranchiale

abnormal ventricular zone morphology
type: Class
subclass of: abnormal ventricular zone
subclass of: XPO_0141316
definition: Any unspecified morphological anomaly of the ventricular zone, such as, for example, abnormal shape or colour.
has_exact_synonym: abnormal morphology of ventricular zone

abnormal ventral mesoderm morphology
type: Class
subclass of: abnormal ventral mesoderm
subclass of: abnormal embryonic structure morphology
definition: Any unspecified morphological anomaly of the ventral mesoderm, such as, for example, abnormal shape or colour.
has_exact_synonym: abnormal morphology of ventral mesoderm

abnormal acid secreting cell morphology
type: Class
subclass of: abnormal acid secreting cell
subclass of: abnormal cell morphology
definition: Any unspecified morphological anomaly of the acid secreting cell, such as, for example, abnormal shape or colour.
has_exact_synonym: abnormal morphology of acid secreting cell

abnormal middle ear morphology
type: Class
subclass of: abnormal middle ear
subclass of: abnormal anatomical cluster morphology
definition: Any unspecified morphological anomaly of the middle ear, such as, for example, abnormal shape or colour.
has_exact_synonym: abnormal morphology of middle ear

abnormal rhombomere R6 morphology
type: Class
subclass of: abnormal rhombomere R6
subclass of: abnormal rhombomere morphology
definition: Any unspecified morphological anomaly of the rhombomere R6, such as, for example, abnormal shape or colour.
has_exact_synonym: abnormal morphology of rhombomere R6

abnormal trunk somite 6 morphology
type: Class
subclass of: abnormal trunk somite 6
subclass of: abnormal trunk somite morphology
definition: Any unspecified morphological anomaly of the trunk somite 6, such as, for example, abnormal shape or colour.
has_exact_synonym: abnormal morphology of trunk somite 6

abnormal stomach body morphology
type: Class
subclass of: abnormal stomach body
subclass of: abnormal multi-tissue structure morphology
definition: Any unspecified morphological anomaly of the stomach body, such as, for example, abnormal shape or colour.
has_exact_synonym: abnormal morphology of stomach body

abnormal blastomere D1.1.1 morphology
type: Class
subclass of: abnormal blastomere D1.1.1
subclass of: abnormal dorsal animal hemisphere blastomere morphology
definition: Any unspecified morphological anomaly of the blastomere D1.1.1, such as, for example, abnormal shape or colour.
has_exact_synonym: abnormal morphology of blastomere D1.1.1

abnormal dorsal marginal zone morphology
type: Class
subclass of: abnormal dorsal marginal zone
subclass of: abnormal marginal zone morphology
definition: Any unspecified morphological anomaly of the dorsal marginal zone, such as, for example, abnormal shape or colour.
has_exact_synonym: abnormal morphology of dorsal marginal zone

abnormal facial epibranchial placode morphology
type: Class
subclass of: abnormal facial epibranchial placode
subclass of: abnormal epibranchial placode morphology
definition: Any unspecified morphological anomaly of the facial epibranchial placode, such as, for example, abnormal shape or colour.
has_exact_synonym: abnormal morphology of facial epibranchial placode

abnormal sub-blastoporal endoderm morphology
type: Class
subclass of: abnormal sub-blastoporal endoderm
subclass of: abnormal tissue morphology
definition: Any unspecified morphological anomaly of the sub-blastoporal endoderm, such as, for example, abnormal shape or colour.
has_exact_synonym: abnormal morphology of sub-blastoporal endoderm

abnormal ventral caudal lymphatic vessel morphology
type: Class
subclass of: abnormal ventral caudal lymphatic vessel
subclass of: abnormal lymph vessel morphology
definition: Any unspecified morphological anomaly of the ventral caudal lymphatic vessel, such as, for example, abnormal shape or colour.
has_exact_synonym: abnormal morphology of ventral caudal lymphatic vessel

abnormal goblet cell morphology
type: Class
subclass of: abnormal goblet cell
subclass of: abnormal epithelial cell morphology
definition: Any unspecified morphological anomaly of the goblet cell, such as, for example, abnormal shape or colour.
has_exact_synonym: abnormal morphology of goblet cell

abnormal proximal tubule morphology
type: Class
subclass of: abnormal proximal tubule
subclass of: abnormal tissue morphology
definition: Any unspecified morphological anomaly of the proximal tubule, such as, for example, abnormal shape or colour.
has_exact_synonym: abnormal morphology of proximal tubule

abnormal egg morphology
type: Class
subclass of: abnormal egg
subclass of: abnormal gamete morphology
definition: Any unspecified morphological anomaly of the egg, such as, for example, abnormal shape or colour.
has_exact_synonym: abnormal morphology of egg

abnormal outflow tract morphology
type: Class
subclass of: abnormal outflow tract
subclass of: abnormal multi-tissue structure morphology
definition: Any unspecified morphological anomaly of the outflow tract, such as, for example, abnormal shape or colour.
has_exact_synonym: abnormal morphology of outflow tract

abnormal m. rectus inferior morphology
type: Class
subclass of: abnormal m. rectus inferior
subclass of: abnormal eye muscle morphology
definition: Any unspecified morphological anomaly of the m. rectus inferior, such as, for example, abnormal shape or colour.
has_exact_synonym: abnormal morphology of m. rectus inferior

abnormal endocardial tube morphology
type: Class
subclass of: abnormal endocardial tube
subclass of: abnormal embryonic structure morphology
definition: Any unspecified morphological anomaly of the endocardial tube, such as, for example, abnormal shape or colour.
has_exact_synonym: abnormal morphology of endocardial tube

abnormal subocular cartilage morphology
type: Class
subclass of: abnormal subocular cartilage
subclass of: abnormal cartilage element morphology
definition: Any unspecified morphological anomaly of the subocular cartilage, such as, for example, abnormal shape or colour.
has_exact_synonym: abnormal morphology of subocular cartilage

abnormal dorsal foregut morphology
type: Class
subclass of: abnormal dorsal foregut
subclass of: abnormal embryonic structure morphology
definition: Any unspecified morphological anomaly of the dorsal foregut, such as, for example, abnormal shape or colour.
has_exact_synonym: abnormal morphology of dorsal foregut

abnormal blastomere V1.2 morphology
type: Class
subclass of: abnormal blastomere V1.2
subclass of: abnormal ventral animal hemisphere blastomere morphology
definition: Any unspecified morphological anomaly of the blastomere V1.2, such as, for example, abnormal shape or colour.
has_exact_synonym: abnormal morphology of blastomere V1.2

abnormal ultimobranchial body morphology
type: Class
subclass of: abnormal ultimobranchial body
subclass of: abnormal tissue morphology
definition: Any unspecified morphological anomaly of the ultimobranchial body, such as, for example, abnormal shape or colour.
has_exact_synonym: abnormal morphology of ultimobranchial body

abnormal posterior branchial crest morphology
type: Class
subclass of: abnormal posterior branchial crest
subclass of: abnormal tissue morphology
definition: Any unspecified morphological anomaly of the posterior branchial crest, such as, for example, abnormal shape or colour.
has_exact_synonym: abnormal morphology of posterior branchial crest

abnormal conjunctiva morphology
type: Class
subclass of: abnormal conjunctiva
subclass of: abnormal tissue morphology
definition: Any unspecified morphological anomaly of the conjunctiva, such as, for example, abnormal shape or colour.
has_exact_synonym: abnormal morphology of conjunctiva

abnormal m. constrictor laryngis morphology
type: Class
subclass of: abnormal m. constrictor laryngis
subclass of: abnormal laryngeal muscle morphology
definition: Any unspecified morphological anomaly of the m. constrictor laryngis, such as, for example, abnormal shape or colour.
has_exact_synonym: abnormal morphology of m. constrictor laryngis

abnormal anterior branchial crest morphology
type: Class
subclass of: abnormal anterior branchial crest
subclass of: abnormal tissue morphology
definition: Any unspecified morphological anomaly of the anterior branchial crest, such as, for example, abnormal shape or colour.
has_exact_synonym: abnormal morphology of anterior branchial crest

abnormal sacculus morphology
type: Class
subclass of: abnormal sacculus
subclass of: abnormal auditory ossicle morphology
definition: Any unspecified morphological anomaly of the sacculus, such as, for example, abnormal shape or colour.
has_exact_synonym: abnormal morphology of sacculus

abnormal right spleen primordium morphology
type: Class
subclass of: abnormal right spleen primordium
subclass of: abnormal primordium morphology
definition: Any unspecified morphological anomaly of the right spleen primordium, such as, for example, abnormal shape or colour.
has_exact_synonym: abnormal morphology of right spleen primordium

abnormal spinal nerve morphology
type: Class
subclass of: abnormal spinal nerve
subclass of: abnormal nerve morphology
definition: Any unspecified morphological anomaly of the spinal nerve, such as, for example, abnormal shape or colour.
has_exact_synonym: abnormal morphology of spinal nerve

abnormal retinal progenitor cell morphology
type: Class
subclass of: abnormal retinal progenitor cell
subclass of: abnormal progenitor cell morphology
definition: Any unspecified morphological anomaly of the retinal progenitor cell, such as, for example, abnormal shape or colour.
has_exact_synonym: abnormal morphology of retinal progenitor cell

abnormal myotome of trunk somite 8 morphology
type: Class
subclass of: abnormal myotome of trunk somite 8
subclass of: abnormal myotome morphology
definition: Any unspecified morphological anomaly of the myotome of trunk somite 8, such as, for example, abnormal shape or colour.
has_exact_synonym: abnormal morphology of myotome of trunk somite 8

abnormal suspensorium morphology
type: Class
subclass of: abnormal suspensorium
subclass of: abnormal anatomical cluster morphology
definition: Any unspecified morphological anomaly of the suspensorium, such as, for example, abnormal shape or colour.
has_exact_synonym: abnormal morphology of suspensorium

abnormal caudal fin skeleton morphology
type: Class
subclass of: abnormal caudal fin skeleton
subclass of: abnormal median fin skeleton morphology
definition: Any unspecified morphological anomaly of the caudal fin skeleton, such as, for example, abnormal shape or colour.
has_exact_synonym: abnormal morphology of caudal fin skeleton

abnormal ventrolateral neural tube morphology
type: Class
subclass of: abnormal ventrolateral neural tube
subclass of: abnormal embryonic structure morphology
definition: Any unspecified morphological anomaly of the ventrolateral neural tube, such as, for example, abnormal shape or colour.
has_exact_synonym: abnormal morphology of ventrolateral neural tube

abnormal pharynx morphology
type: Class
subclass of: abnormal pharynx
subclass of: abnormal multi-tissue structure morphology
definition: Any unspecified morphological anomaly of the pharynx, such as, for example, abnormal shape or colour.
has_exact_synonym: abnormal morphology of pharynx

abnormal hatching gland cell morphology
type: Class
subclass of: abnormal hatching gland cell
subclass of: abnormal cell morphology
definition: Any unspecified morphological anomaly of the hatching gland cell, such as, for example, abnormal shape or colour.
has_exact_synonym: abnormal morphology of hatching gland cell

abnormal hyomandibular lateral line morphology
type: Class
subclass of: abnormal hyomandibular lateral line
subclass of: abnormal lateral line morphology
definition: Any unspecified morphological anomaly of the hyomandibular lateral line, such as, for example, abnormal shape or colour.
has_exact_synonym: abnormal morphology of hyomandibular lateral line

abnormal glomeral nexus morphology
type: Class
subclass of: abnormal glomeral nexus
subclass of: abnormal tissue morphology
definition: Any unspecified morphological anomaly of the glomeral nexus, such as, for example, abnormal shape or colour.
has_exact_synonym: abnormal morphology of glomeral nexus

abnormal axial mesoderm morphology
type: Class
subclass of: abnormal axial mesoderm
subclass of: abnormal embryonic structure morphology
definition: Any unspecified morphological anomaly of the axial mesoderm, such as, for example, abnormal shape or colour.
has_exact_synonym: abnormal morphology of axial mesoderm

abnormal anterior cerebral vein morphology
type: Class
subclass of: abnormal anterior cerebral vein
subclass of: abnormal cerebral vein morphology
definition: Any unspecified morphological anomaly of the anterior cerebral vein, such as, for example, abnormal shape or colour.
has_exact_synonym: abnormal morphology of anterior cerebral vein

abnormal filter chamber morphology
type: Class
subclass of: abnormal filter chamber
subclass of: abnormal anatomical space morphology
definition: Any unspecified morphological anomaly of the filter chamber, such as, for example, abnormal shape or colour.
has_exact_synonym: abnormal morphology of filter chamber

abnormal rhombomere R7 morphology
type: Class
subclass of: abnormal rhombomere R7
subclass of: abnormal rhombomere morphology
definition: Any unspecified morphological anomaly of the rhombomere R7, such as, for example, abnormal shape or colour.
has_exact_synonym: abnormal morphology of rhombomere R7

abnormal apical ectodermal ridge morphology
type: Class
subclass of: abnormal apical ectodermal ridge
subclass of: abnormal proliferative region morphology
definition: Any unspecified morphological anomaly of the apical ectodermal ridge, such as, for example, abnormal shape or colour.
has_exact_synonym: abnormal morphology of apical ectodermal ridge

abnormal ventricular layer of the optic tectum morphology
type: Class
subclass of: abnormal ventricular layer of the optic tectum
subclass of: abnormal tissue morphology
definition: Any unspecified morphological anomaly of the ventricular layer of the optic tectum, such as, for example, abnormal shape or colour.
has_exact_synonym: abnormal morphology of ventricular layer of the optic tectum

abnormal mm. constrictores branchiales IV morphology
type: Class
subclass of: abnormal mm. constrictores branchiales IV
subclass of: abnormal branchial head muscle morphology
definition: Any unspecified morphological anomaly of the mm. constrictores branchiales IV, such as, for example, abnormal shape or colour.
has_exact_synonym: abnormal morphology of mm. constrictores branchiales IV

abnormal visceral pouch 1 morphology
type: Class
subclass of: abnormal visceral pouch 1
subclass of: abnormal visceral pouch morphology
definition: Any unspecified morphological anomaly of the visceral pouch 1, such as, for example, abnormal shape or colour.
has_exact_synonym: abnormal morphology of visceral pouch 1

abnormal cardia morphology
type: Class
subclass of: abnormal cardia
subclass of: abnormal multi-tissue structure morphology
definition: Any unspecified morphological anomaly of the cardia, such as, for example, abnormal shape or colour.
has_exact_synonym: abnormal morphology of cardia

abnormal caudal presomitic mesoderm morphology
type: Class
subclass of: abnormal caudal presomitic mesoderm
subclass of: abnormal tissue morphology
definition: Any unspecified morphological anomaly of the caudal presomitic mesoderm, such as, for example, abnormal shape or colour.
has_exact_synonym: abnormal morphology of caudal presomitic mesoderm

abnormal intersomitic vein morphology
type: Class
subclass of: abnormal intersomitic vein
subclass of: abnormal intersomitic vessel morphology
definition: Any unspecified morphological anomaly of the intersomitic vein, such as, for example, abnormal shape or colour.
has_exact_synonym: abnormal morphology of intersomitic vein

abnormal ophthalmic artery morphology
type: Class
subclass of: abnormal ophthalmic artery
subclass of: abnormal artery morphology
definition: Any unspecified morphological anomaly of the ophthalmic artery, such as, for example, abnormal shape or colour.
has_exact_synonym: abnormal morphology of ophthalmic artery

abnormal anterior hypothalamus morphology
type: Class
subclass of: abnormal anterior hypothalamus
subclass of: abnormal multi-tissue structure morphology
definition: Any unspecified morphological anomaly of the anterior hypothalamus, such as, for example, abnormal shape or colour.
has_exact_synonym: abnormal morphology of anterior hypothalamus

abnormal astrocyte morphology
type: Class
subclass of: abnormal astrocyte
subclass of: abnormal glial cell morphology
definition: Any unspecified morphological anomaly of the astrocyte, such as, for example, abnormal shape or colour.
has_exact_synonym: abnormal morphology of astrocyte

abnormal m. intermandibularis primordium morphology
type: Class
subclass of: abnormal m. intermandibularis primordium
subclass of: abnormal cranial muscle primordium morphology
definition: Any unspecified morphological anomaly of the m. intermandibularis primordium, such as, for example, abnormal shape or colour.
has_exact_synonym: abnormal morphology of m. intermandibularis primordium

abnormal anterior ventral blood island morphology
type: Class
subclass of: abnormal anterior ventral blood island
subclass of: abnormal tissue morphology
definition: Any unspecified morphological anomaly of the anterior ventral blood island, such as, for example, abnormal shape or colour.
has_exact_synonym: abnormal morphology of anterior ventral blood island

abnormal vegetal pole morphology
type: Class
subclass of: abnormal vegetal pole
subclass of: XPO_0141316
definition: Any unspecified morphological anomaly of the vegetal pole, such as, for example, abnormal shape or colour.
has_exact_synonym: abnormal morphology of vegetal pole

abnormal dorsal hyoid arch skeleton morphology
type: Class
subclass of: abnormal dorsal hyoid arch skeleton
subclass of: abnormal tissue morphology
definition: Any unspecified morphological anomaly of the dorsal hyoid arch skeleton, such as, for example, abnormal shape or colour.
has_exact_synonym: abnormal morphology of dorsal hyoid arch skeleton

abnormal non-involuting marginal zone morphology
type: Class
subclass of: abnormal non-involuting marginal zone
subclass of: abnormal marginal zone morphology
definition: Any unspecified morphological anomaly of the non-involuting marginal zone, such as, for example, abnormal shape or colour.
has_exact_synonym: abnormal morphology of non-involuting marginal zone

abnormal m. rectus superior morphology
type: Class
subclass of: abnormal m. rectus superior
subclass of: abnormal eye muscle morphology
definition: Any unspecified morphological anomaly of the m. rectus superior, such as, for example, abnormal shape or colour.
has_exact_synonym: abnormal morphology of m. rectus superior

abnormal plasma membrane morphology
type: Class
subclass of: abnormal plasma membrane
subclass of: abnormal cell part morphology
definition: Any unspecified morphological anomaly of the plasma membrane, such as, for example, abnormal shape or colour.
has_exact_synonym: abnormal morphology of plasma membrane

abnormal animal part, late involuting morphology
type: Class
subclass of: abnormal animal part, late involuting
subclass of: abnormal tissue morphology
definition: Any unspecified morphological anomaly of the animal part, late involuting, such as, for example, abnormal shape or colour.
has_exact_synonym: abnormal morphology of animal part, late involuting

abnormal metencephalic artery morphology
type: Class
subclass of: abnormal metencephalic artery
subclass of: abnormal artery morphology
definition: Any unspecified morphological anomaly of the metencephalic artery, such as, for example, abnormal shape or colour.
has_exact_synonym: abnormal morphology of metencephalic artery

abnormal accessory olfactory bulb morphology
type: Class
subclass of: abnormal accessory olfactory bulb
subclass of: abnormal multi-tissue structure morphology
definition: Any unspecified morphological anomaly of the accessory olfactory bulb, such as, for example, abnormal shape or colour.
has_exact_synonym: abnormal morphology of accessory olfactory bulb

abnormal visceral pouch 4 morphology
type: Class
subclass of: abnormal visceral pouch 4
subclass of: abnormal visceral pouch morphology
definition: Any unspecified morphological anomaly of the visceral pouch 4, such as, for example, abnormal shape or colour.
has_exact_synonym: abnormal morphology of visceral pouch 4

abnormal sclerotome of tail somite 15 morphology
type: Class
subclass of: abnormal sclerotome of tail somite 15
subclass of: abnormal sclerotome morphology
definition: Any unspecified morphological anomaly of the sclerotome of tail somite 15, such as, for example, abnormal shape or colour.
has_exact_synonym: abnormal morphology of sclerotome of tail somite 15

abnormal myotome of tail somite 14 morphology
type: Class
subclass of: abnormal myotome of tail somite 14
subclass of: abnormal myotome morphology
definition: Any unspecified morphological anomaly of the myotome of tail somite 14, such as, for example, abnormal shape or colour.
has_exact_synonym: abnormal morphology of myotome of tail somite 14

abnormal pineal gland morphology
type: Class
subclass of: abnormal pineal gland
subclass of: abnormal multi-tissue structure morphology
definition: Any unspecified morphological anomaly of the pineal gland, such as, for example, abnormal shape or colour.
has_exact_synonym: abnormal morphology of pineal gland

abnormal rhombomere R5 morphology
type: Class
subclass of: abnormal rhombomere R5
subclass of: abnormal rhombomere morphology
definition: Any unspecified morphological anomaly of the rhombomere R5, such as, for example, abnormal shape or colour.
has_exact_synonym: abnormal morphology of rhombomere R5

abnormal rib morphology
type: Class
subclass of: abnormal rib
subclass of: abnormal process morphology
definition: Any unspecified morphological anomaly of the rib, such as, for example, abnormal shape or colour.
has_exact_synonym: abnormal morphology of rib

abnormal endoplasmic reticulum morphology
type: Class
subclass of: abnormal endoplasmic reticulum
subclass of: abnormal cell part morphology
definition: Any unspecified morphological anomaly of the endoplasmic reticulum, such as, for example, abnormal shape or colour.
has_exact_synonym: abnormal morphology of endoplasmic reticulum

abnormal mitochondrial cloud morphology
type: Class
subclass of: abnormal mitochondrial cloud
subclass of: abnormal cell part morphology
definition: Any unspecified morphological anomaly of the mitochondrial cloud, such as, for example, abnormal shape or colour.
has_exact_synonym: abnormal morphology of mitochondrial cloud

abnormal Bowman's gland morphology
type: Class
subclass of: abnormal Bowman's gland
subclass of: abnormal multi-tissue structure morphology
definition: Any unspecified morphological anomaly of the Bowman's gland, such as, for example, abnormal shape or colour.
has_exact_synonym: abnormal morphology of Bowman's gland

abnormal germinal vesicle morphology
type: Class
subclass of: abnormal germinal vesicle
subclass of: abnormal nucleus morphology
definition: Any unspecified morphological anomaly of the germinal vesicle, such as, for example, abnormal shape or colour.
has_exact_synonym: abnormal morphology of germinal vesicle

abnormal mammilary region morphology
type: Class
subclass of: abnormal mammilary region
subclass of: abnormal multi-tissue structure morphology
definition: Any unspecified morphological anomaly of the mammilary region, such as, for example, abnormal shape or colour.
has_exact_synonym: abnormal morphology of mammilary region

abnormal footplate of the stapes morphology
type: Class
subclass of: abnormal footplate of the stapes
subclass of: abnormal cartilage element morphology
definition: Any unspecified morphological anomaly of the footplate of the stapes, such as, for example, abnormal shape or colour.
has_exact_synonym: abnormal morphology of footplate of the stapes

abnormal ventral abdominal vein morphology
type: Class
subclass of: abnormal ventral abdominal vein
subclass of: abnormal vein morphology
definition: Any unspecified morphological anomaly of the ventral abdominal vein, such as, for example, abnormal shape or colour.
has_exact_synonym: abnormal morphology of ventral abdominal vein

abnormal mucous gland morphology
type: Class
subclass of: abnormal mucous gland
subclass of: abnormal multi-tissue structure morphology
definition: Any unspecified morphological anomaly of the mucous gland, such as, for example, abnormal shape or colour.
has_exact_synonym: abnormal morphology of mucous gland

abnormal blastomere D1.1.2 morphology
type: Class
subclass of: abnormal blastomere D1.1.2
subclass of: abnormal dorsal animal hemisphere blastomere morphology
definition: Any unspecified morphological anomaly of the blastomere D1.1.2, such as, for example, abnormal shape or colour.
has_exact_synonym: abnormal morphology of blastomere D1.1.2

abnormal posterior cardinal vein morphology
type: Class
subclass of: abnormal posterior cardinal vein
subclass of: abnormal vein morphology
definition: Any unspecified morphological anomaly of the posterior cardinal vein, such as, for example, abnormal shape or colour.
has_exact_synonym: abnormal morphology of posterior cardinal vein

abnormal myotome of trunk somite 11 morphology
type: Class
subclass of: abnormal myotome of trunk somite 11
subclass of: abnormal myotome morphology
definition: Any unspecified morphological anomaly of the myotome of trunk somite 11, such as, for example, abnormal shape or colour.
has_exact_synonym: abnormal morphology of myotome of trunk somite 11

abnormal mineralized hyaline cartilage tissue morphology
type: Class
subclass of: abnormal mineralized hyaline cartilage tissue
subclass of: abnormal mineralized tissue morphology
definition: Any unspecified morphological anomaly of the mineralized hyaline cartilage tissue, such as, for example, abnormal shape or colour.
has_exact_synonym: abnormal morphology of mineralized hyaline cartilage tissue

abnormal T cell morphology
type: Class
subclass of: abnormal T cell
subclass of: abnormal lymphocyte morphology
definition: Any unspecified morphological anomaly of the T cell, such as, for example, abnormal shape or colour.
has_exact_synonym: abnormal morphology of T cell

abnormal mesentery morphology
type: Class
subclass of: abnormal mesentery
subclass of: abnormal epithelium morphology
definition: Any unspecified morphological anomaly of the mesentery, such as, for example, abnormal shape or colour.
has_exact_synonym: abnormal morphology of mesentery

abnormal forelimb bud tip morphology
type: Class
subclass of: abnormal forelimb bud tip
subclass of: abnormal tissue morphology
definition: Any unspecified morphological anomaly of the forelimb bud tip, such as, for example, abnormal shape or colour.
has_exact_synonym: abnormal morphology of forelimb bud tip

abnormal mm. levator arcuum branchialium II morphology
type: Class
subclass of: abnormal mm. levator arcuum branchialium II
subclass of: abnormal branchial head muscle morphology
definition: Any unspecified morphological anomaly of the mm. levator arcuum branchialium II, such as, for example, abnormal shape or colour.
has_exact_synonym: abnormal morphology of mm. levator arcuum branchialium II

abnormal dermatocranium morphology
type: Class
subclass of: abnormal dermatocranium
subclass of: abnormal cranium morphology
definition: Any unspecified morphological anomaly of the dermatocranium, such as, for example, abnormal shape or colour.
has_exact_synonym: abnormal morphology of dermatocranium

abnormal pylorus morphology
type: Class
subclass of: abnormal pylorus
subclass of: abnormal multi-tissue structure morphology
definition: Any unspecified morphological anomaly of the pylorus, such as, for example, abnormal shape or colour.
has_exact_synonym: abnormal morphology of pylorus

abnormal adrenal gland morphology
type: Class
subclass of: abnormal adrenal gland
subclass of: abnormal solid compound organ morphology
definition: Any unspecified morphological anomaly of the adrenal gland, such as, for example, abnormal shape or colour.
has_exact_synonym: abnormal morphology of adrenal gland

abnormal lower eyelid morphology
type: Class
subclass of: abnormal lower eyelid
subclass of: abnormal surface structure morphology
definition: Any unspecified morphological anomaly of the lower eyelid, such as, for example, abnormal shape or colour.
has_exact_synonym: abnormal morphology of lower eyelid

abnormal dorso-lateral marginal zone morphology
type: Class
subclass of: abnormal dorso-lateral marginal zone
subclass of: abnormal marginal zone morphology
definition: Any unspecified morphological anomaly of the dorso-lateral marginal zone, such as, for example, abnormal shape or colour.
has_exact_synonym: abnormal morphology of dorso-lateral marginal zone

abnormal lateral crista morphology
type: Class
subclass of: abnormal lateral crista
subclass of: abnormal sensory epithelial cell morphology
definition: Any unspecified morphological anomaly of the lateral crista, such as, for example, abnormal shape or colour.
has_exact_synonym: abnormal morphology of lateral crista

abnormal blastomere V2.2.1 morphology
type: Class
subclass of: abnormal blastomere V2.2.1
subclass of: abnormal ventral vegetal hemisphere blastomere morphology
definition: Any unspecified morphological anomaly of the blastomere V2.2.1, such as, for example, abnormal shape or colour.
has_exact_synonym: abnormal morphology of blastomere V2.2.1

abnormal skin seromucous gland morphology
type: Class
subclass of: abnormal skin seromucous gland
subclass of: abnormal skin gland morphology
definition: Any unspecified morphological anomaly of the skin seromucous gland, such as, for example, abnormal shape or colour.
has_exact_synonym: abnormal morphology of skin seromucous gland

abnormal tendon morphology
type: Class
subclass of: abnormal tendon
subclass of: abnormal dense regular connective tissue morphology
definition: Any unspecified morphological anomaly of the tendon, such as, for example, abnormal shape or colour.
has_exact_synonym: abnormal morphology of tendon

abnormal mineralized avascular GAG-rich matrix morphology
type: Class
subclass of: abnormal mineralized avascular GAG-rich matrix
subclass of: abnormal avascular GAG-rich matrix morphology
subclass of: abnormal mineralized extracellular matrix morphology
definition: Any unspecified morphological anomaly of the mineralized avascular GAG-rich matrix, such as, for example, abnormal shape or colour.
has_exact_synonym: abnormal morphology of mineralized avascular GAG-rich matrix

abnormal mineralized extracellular matrix morphology
type: Class
subclass of: abnormal mineralized extracellular matrix
subclass of: abnormal proteinaceous extracellular matrix morphology
definition: Any unspecified morphological anomaly of the mineralized extracellular matrix, such as, for example, abnormal shape or colour.
has_exact_synonym: abnormal morphology of mineralized extracellular matrix

abnormal ventro-lateral marginal zone morphology
type: Class
subclass of: abnormal ventro-lateral marginal zone
subclass of: abnormal marginal zone morphology
definition: Any unspecified morphological anomaly of the ventro-lateral marginal zone, such as, for example, abnormal shape or colour.
has_exact_synonym: abnormal morphology of ventro-lateral marginal zone

abnormal inner fin morphology
type: Class
subclass of: abnormal inner fin
subclass of: abnormal tissue morphology
definition: Any unspecified morphological anomaly of the inner fin, such as, for example, abnormal shape or colour.
has_exact_synonym: abnormal morphology of inner fin

abnormal posterior foregut morphology
type: Class
subclass of: abnormal posterior foregut
subclass of: abnormal embryonic structure morphology
definition: Any unspecified morphological anomaly of the posterior foregut, such as, for example, abnormal shape or colour.
has_exact_synonym: abnormal morphology of posterior foregut

abnormal craniofacial region morphology
type: Class
subclass of: abnormal craniofacial region
subclass of: abnormal anatomical cluster morphology
definition: Any unspecified morphological anomaly of the craniofacial region, such as, for example, abnormal shape or colour.
has_exact_synonym: abnormal morphology of craniofacial region

abnormal pharyngeal mesenchyme morphology
type: Class
subclass of: abnormal pharyngeal mesenchyme
subclass of: abnormal mesenchyme morphology
definition: Any unspecified morphological anomaly of the pharyngeal mesenchyme, such as, for example, abnormal shape or colour.
has_exact_synonym: abnormal morphology of pharyngeal mesenchyme

abnormal anteroventral lateral line placode morphology
type: Class
subclass of: abnormal anteroventral lateral line placode
subclass of: abnormal lateral line placode morphology
definition: Any unspecified morphological anomaly of the anteroventral lateral line placode, such as, for example, abnormal shape or colour.
has_exact_synonym: abnormal morphology of anteroventral lateral line placode

abnormal pre-chordal neural plate border morphology
type: Class
subclass of: abnormal pre-chordal neural plate border
subclass of: abnormal tissue morphology
definition: Any unspecified morphological anomaly of the pre-chordal neural plate border, such as, for example, abnormal shape or colour.
has_exact_synonym: abnormal morphology of pre-chordal neural plate border

abnormal caudal tuberal region morphology
type: Class
subclass of: abnormal caudal tuberal region
subclass of: abnormal multi-tissue structure morphology
definition: Any unspecified morphological anomaly of the caudal tuberal region, such as, for example, abnormal shape or colour.
has_exact_synonym: abnormal morphology of caudal tuberal region

abnormal erythroid cell morphology
type: Class
subclass of: abnormal erythroid cell
subclass of: abnormal cell morphology
definition: Any unspecified morphological anomaly of the erythroid cell, such as, for example, abnormal shape or colour.
has_exact_synonym: abnormal morphology of erythroid cell

abnormal hypobranchial head muscle morphology
type: Class
subclass of: abnormal hypobranchial head muscle
subclass of: abnormal cranial muscle morphology
definition: Any unspecified morphological anomaly of the hypobranchial head muscle, such as, for example, abnormal shape or colour.
has_exact_synonym: abnormal morphology of hypobranchial head muscle

abnormal egg cell-free extract morphology
type: Class
subclass of: abnormal egg cell-free extract
subclass of: abnormal cell-free extract morphology
definition: Any unspecified morphological anomaly of the egg cell-free extract, such as, for example, abnormal shape or colour.
has_exact_synonym: abnormal morphology of egg cell-free extract

abnormal cell-free extract morphology
type: Class
subclass of: abnormal cell-free extract
subclass of: abnormal anatomical entity in vitro morphology
definition: Any unspecified morphological anomaly of the cell-free extract, such as, for example, abnormal shape or colour.
has_exact_synonym: abnormal morphology of cell-free extract

abnormal mesonephric late distal tubule morphology
type: Class
subclass of: abnormal mesonephric late distal tubule
subclass of: abnormal mesonephric tubule morphology
definition: Any unspecified morphological anomaly of the mesonephric late distal tubule, such as, for example, abnormal shape or colour.
has_exact_synonym: abnormal morphology of mesonephric late distal tubule

abnormal antrum morphology
type: Class
subclass of: abnormal antrum
subclass of: abnormal multi-tissue structure morphology
definition: Any unspecified morphological anomaly of the antrum, such as, for example, abnormal shape or colour.
has_exact_synonym: abnormal morphology of antrum

abnormal stage IV oocyte morphology
type: Class
subclass of: abnormal stage IV oocyte
subclass of: abnormal oocyte morphology
definition: Any unspecified morphological anomaly of the stage IV oocyte, such as, for example, abnormal shape or colour.
has_exact_synonym: abnormal morphology of stage IV oocyte

abnormal forelimb digit 2 morphology
type: Class
subclass of: abnormal forelimb digit 2
subclass of: abnormal forelimb digit morphology
definition: Any unspecified morphological anomaly of the forelimb digit 2, such as, for example, abnormal shape or colour.
has_exact_synonym: abnormal morphology of forelimb digit 2

abnormal trunk lateral line morphology
type: Class
subclass of: abnormal trunk lateral line
subclass of: abnormal lateral line morphology
definition: Any unspecified morphological anomaly of the trunk lateral line, such as, for example, abnormal shape or colour.
has_exact_synonym: abnormal morphology of trunk lateral line

abnormal lateral vein morphology
type: Class
subclass of: abnormal lateral vein
subclass of: abnormal vein morphology
definition: Any unspecified morphological anomaly of the lateral vein, such as, for example, abnormal shape or colour.
has_exact_synonym: abnormal morphology of lateral vein

abnormal tuberal region morphology
type: Class
subclass of: abnormal tuberal region
subclass of: abnormal multi-tissue structure morphology
definition: Any unspecified morphological anomaly of the tuberal region, such as, for example, abnormal shape or colour.
has_exact_synonym: abnormal morphology of tuberal region

abnormal trochlear nerve morphology
type: Class
subclass of: abnormal trochlear nerve
subclass of: abnormal cranial nerve morphology
definition: Any unspecified morphological anomaly of the trochlear nerve, such as, for example, abnormal shape or colour.
has_exact_synonym: abnormal morphology of trochlear nerve

abnormal trabecula carnea morphology
type: Class
subclass of: abnormal trabecula carnea
subclass of: abnormal trabecula morphology
definition: Any unspecified morphological anomaly of the trabecula carnea, such as, for example, abnormal shape or colour.
has_exact_synonym: abnormal morphology of trabecula carnea

abnormal cardiac progenitor cell morphology
type: Class
subclass of: abnormal cardiac progenitor cell
subclass of: abnormal progenitor cell morphology
definition: Any unspecified morphological anomaly of the cardiac progenitor cell, such as, for example, abnormal shape or colour.
has_exact_synonym: abnormal morphology of cardiac progenitor cell

abnormal Rathke's pouch morphology
type: Class
subclass of: abnormal Rathke's pouch
subclass of: abnormal embryonic structure morphology
definition: Any unspecified morphological anomaly of the Rathke's pouch, such as, for example, abnormal shape or colour.
has_exact_synonym: abnormal morphology of Rathke's pouch

abnormal middle cerebral vein morphology
type: Class
subclass of: abnormal middle cerebral vein
subclass of: abnormal cerebral vein morphology
definition: Any unspecified morphological anomaly of the middle cerebral vein, such as, for example, abnormal shape or colour.
has_exact_synonym: abnormal morphology of middle cerebral vein

abnormal third ventricle morphology
type: Class
subclass of: abnormal third ventricle
subclass of: abnormal brain ventricle morphology
definition: Any unspecified morphological anomaly of the third ventricle, such as, for example, abnormal shape or colour.
has_exact_synonym: abnormal morphology of third ventricle

abnormal Muller cell morphology
type: Class
subclass of: abnormal Muller cell
subclass of: abnormal glial cell morphology
definition: Any unspecified morphological anomaly of the Muller cell, such as, for example, abnormal shape or colour.
has_exact_synonym: abnormal morphology of Muller cell

abnormal radial glial cell morphology
type: Class
subclass of: abnormal radial glial cell
subclass of: abnormal glial cell morphology
definition: Any unspecified morphological anomaly of the radial glial cell, such as, for example, abnormal shape or colour.
has_exact_synonym: abnormal morphology of radial glial cell

abnormal primary heart field morphology
type: Class
subclass of: abnormal primary heart field
subclass of: abnormal tissue morphology
definition: Any unspecified morphological anomaly of the primary heart field, such as, for example, abnormal shape or colour.
has_exact_synonym: abnormal morphology of primary heart field

abnormal cornua trabecula morphology
type: Class
subclass of: abnormal cornua trabecula
subclass of: abnormal cartilage element morphology
definition: Any unspecified morphological anomaly of the cornua trabecula, such as, for example, abnormal shape or colour.
has_exact_synonym: abnormal morphology of cornua trabecula

abnormal dorsal pallidum morphology
type: Class
subclass of: abnormal dorsal pallidum
subclass of: abnormal anatomical cluster morphology
definition: Any unspecified morphological anomaly of the dorsal pallidum, such as, for example, abnormal shape or colour.
has_exact_synonym: abnormal morphology of dorsal pallidum

abnormal cartilaginous condensation morphology
type: Class
subclass of: abnormal cartilaginous condensation
subclass of: abnormal cell condensation morphology
definition: Any unspecified morphological anomaly of the cartilaginous condensation, such as, for example, abnormal shape or colour.
has_exact_synonym: abnormal morphology of cartilaginous condensation

abnormal visceral pouch 2 morphology
type: Class
subclass of: abnormal visceral pouch 2
subclass of: abnormal visceral pouch morphology
definition: Any unspecified morphological anomaly of the visceral pouch 2, such as, for example, abnormal shape or colour.
has_exact_synonym: abnormal morphology of visceral pouch 2

abnormal hepatocyte morphology
type: Class
subclass of: abnormal hepatocyte
subclass of: abnormal epithelial cell morphology
definition: Any unspecified morphological anomaly of the hepatocyte, such as, for example, abnormal shape or colour.
has_exact_synonym: abnormal morphology of hepatocyte

abnormal apoptotic cell morphology
type: Class
subclass of: abnormal apoptotic cell
subclass of: abnormal cell morphology
definition: Any unspecified morphological anomaly of the apoptotic cell, such as, for example, abnormal shape or colour.
has_exact_synonym: abnormal morphology of apoptotic cell

abnormal motor neuron morphology
type: Class
subclass of: abnormal motor neuron
subclass of: abnormal neuron morphology
definition: Any unspecified morphological anomaly of the motor neuron, such as, for example, abnormal shape or colour.
has_exact_synonym: abnormal morphology of motor neuron

abnormal nucleus reticularis inferior morphology
type: Class
subclass of: abnormal nucleus reticularis inferior
subclass of: abnormal neural nucleus morphology
definition: Any unspecified morphological anomaly of the nucleus reticularis inferior, such as, for example, abnormal shape or colour.
has_exact_synonym: abnormal morphology of nucleus reticularis inferior

abnormal ooplasm morphology
type: Class
subclass of: abnormal ooplasm
subclass of: abnormal cell part morphology
definition: Any unspecified morphological anomaly of the ooplasm, such as, for example, abnormal shape or colour.
has_exact_synonym: abnormal morphology of ooplasm

abnormal cardiac valve morphology
type: Class
subclass of: abnormal cardiac valve
subclass of: abnormal tissue morphology
definition: Any unspecified morphological anomaly of the cardiac valve, such as, for example, abnormal shape or colour.
has_exact_synonym: abnormal morphology of cardiac valve

abnormal m. rectus cervicus morphology
type: Class
subclass of: abnormal m. rectus cervicus
subclass of: abnormal hypobranchial head muscle morphology
definition: Any unspecified morphological anomaly of the m. rectus cervicus, such as, for example, abnormal shape or colour.
has_exact_synonym: abnormal morphology of m. rectus cervicus

abnormal mitral cell morphology
type: Class
subclass of: abnormal mitral cell
subclass of: abnormal neuron morphology
definition: Any unspecified morphological anomaly of the mitral cell, such as, for example, abnormal shape or colour.
has_exact_synonym: abnormal morphology of mitral cell

abnormal ventrolateral thalamic nucleus morphology
type: Class
subclass of: abnormal ventrolateral thalamic nucleus
subclass of: abnormal neural nucleus morphology
definition: Any unspecified morphological anomaly of the ventrolateral thalamic nucleus, such as, for example, abnormal shape or colour.
has_exact_synonym: abnormal morphology of ventrolateral thalamic nucleus

abnormal Keller explant morphology
type: Class
subclass of: abnormal Keller explant
subclass of: abnormal anatomical entity in vitro morphology
definition: Any unspecified morphological anomaly of the Keller explant, such as, for example, abnormal shape or colour.
has_exact_synonym: abnormal morphology of Keller explant

abnormal prepollex morphology
type: Class
subclass of: abnormal prepollex
subclass of: abnormal cartilage element morphology
definition: Any unspecified morphological anomaly of the prepollex, such as, for example, abnormal shape or colour.
has_exact_synonym: abnormal morphology of prepollex

abnormal cell body layer of the optic tectum morphology
type: Class
subclass of: abnormal cell body layer of the optic tectum
subclass of: abnormal tissue morphology
definition: Any unspecified morphological anomaly of the cell body layer of the optic tectum, such as, for example, abnormal shape or colour.
has_exact_synonym: abnormal morphology of cell body layer of the optic tectum

abnormal fenestra subocularis morphology
type: Class
subclass of: abnormal fenestra subocularis
subclass of: abnormal anatomical space morphology
definition: Any unspecified morphological anomaly of the fenestra subocularis, such as, for example, abnormal shape or colour.
has_exact_synonym: abnormal morphology of fenestra subocularis

abnormal maxillary artery morphology
type: Class
subclass of: abnormal maxillary artery
subclass of: abnormal artery morphology
definition: Any unspecified morphological anomaly of the maxillary artery, such as, for example, abnormal shape or colour.
has_exact_synonym: abnormal morphology of maxillary artery

abnormal odontode tissue morphology
type: Class
subclass of: abnormal odontode tissue
subclass of: abnormal odontoid tissue morphology
definition: Any unspecified morphological anomaly of the odontode tissue, such as, for example, abnormal shape or colour.
has_exact_synonym: abnormal morphology of odontode tissue

abnormal mm. constrictores branchiales III primordium morphology
type: Class
subclass of: abnormal mm. constrictores branchiales III primordium
subclass of: abnormal cranial muscle primordium morphology
definition: Any unspecified morphological anomaly of the mm. constrictores branchiales III primordium, such as, for example, abnormal shape or colour.
has_exact_synonym: abnormal morphology of mm. constrictores branchiales III primordium

abnormal suprablastoporal endoderm morphology
type: Class
subclass of: abnormal suprablastoporal endoderm
subclass of: abnormal tissue morphology
definition: Any unspecified morphological anomaly of the suprablastoporal endoderm, such as, for example, abnormal shape or colour.
has_exact_synonym: abnormal morphology of suprablastoporal endoderm

abnormal amputated limb morphology
type: Class
subclass of: abnormal amputated limb
subclass of: abnormal amputated tissue morphology
definition: Any unspecified morphological anomaly of the amputated limb, such as, for example, abnormal shape or colour.
has_exact_synonym: abnormal morphology of amputated limb

abnormal infrarostral morphology
type: Class
subclass of: abnormal infrarostral
subclass of: abnormal cartilage element morphology
definition: Any unspecified morphological anomaly of the infrarostral, such as, for example, abnormal shape or colour.
has_exact_synonym: abnormal morphology of infrarostral

abnormal atrioventricular canal endocardium morphology
type: Class
subclass of: abnormal atrioventricular canal endocardium
subclass of: abnormal endocardium morphology
definition: Any unspecified morphological anomaly of the atrioventricular canal endocardium, such as, for example, abnormal shape or colour.
has_exact_synonym: abnormal morphology of atrioventricular canal endocardium

abnormal retinal progenitor cell region morphology
type: Class
subclass of: abnormal retinal progenitor cell region
subclass of: XPO_0141316
definition: Any unspecified morphological anomaly of the retinal progenitor cell region, such as, for example, abnormal shape or colour.
has_exact_synonym: abnormal morphology of retinal progenitor cell region

abnormal musculature of face morphology
type: Class
subclass of: abnormal musculature of face
subclass of: abnormal muscle morphology
definition: Any unspecified morphological anomaly of the musculature of face, such as, for example, abnormal shape or colour.
has_exact_synonym: abnormal morphology of musculature of face

abnormal external carotid artery morphology
type: Class
subclass of: abnormal external carotid artery
subclass of: abnormal artery morphology
definition: Any unspecified morphological anomaly of the external carotid artery, such as, for example, abnormal shape or colour.
has_exact_synonym: abnormal morphology of external carotid artery

abnormal forelimb digit 5 morphology
type: Class
subclass of: abnormal forelimb digit 5
subclass of: abnormal forelimb digit morphology
definition: Any unspecified morphological anomaly of the forelimb digit 5, such as, for example, abnormal shape or colour.
has_exact_synonym: abnormal morphology of forelimb digit 5

abnormal typhlosole morphology
type: Class
subclass of: abnormal typhlosole
subclass of: abnormal tissue morphology
definition: Any unspecified morphological anomaly of the typhlosole, such as, for example, abnormal shape or colour.
has_exact_synonym: abnormal morphology of typhlosole

abnormal female organism morphology
type: Class
subclass of: abnormal female organism
subclass of: abnormal whole organism morphology
definition: Any unspecified morphological anomaly of the female organism, such as, for example, abnormal shape or colour.
has_exact_synonym: abnormal morphology of female organism

abnormal blastomere V2.2.2 morphology
type: Class
subclass of: abnormal blastomere V2.2.2
subclass of: abnormal ventral vegetal hemisphere blastomere morphology
definition: Any unspecified morphological anomaly of the blastomere V2.2.2, such as, for example, abnormal shape or colour.
has_exact_synonym: abnormal morphology of blastomere V2.2.2

abnormal gastric vein morphology
type: Class
subclass of: abnormal gastric vein
subclass of: abnormal vein morphology
definition: Any unspecified morphological anomaly of the gastric vein, such as, for example, abnormal shape or colour.
has_exact_synonym: abnormal morphology of gastric vein

abnormal ventral funiculus morphology
type: Class
subclass of: abnormal ventral funiculus
subclass of: abnormal anatomical cluster morphology
definition: Any unspecified morphological anomaly of the ventral funiculus, such as, for example, abnormal shape or colour.
has_exact_synonym: abnormal morphology of ventral funiculus

abnormal anterodorsal tegmental nucleus morphology
type: Class
subclass of: abnormal anterodorsal tegmental nucleus
subclass of: abnormal neural nucleus morphology
definition: Any unspecified morphological anomaly of the anterodorsal tegmental nucleus, such as, for example, abnormal shape or colour.
has_exact_synonym: abnormal morphology of anterodorsal tegmental nucleus

abnormal stromal cell morphology
type: Class
subclass of: abnormal stromal cell
subclass of: abnormal cell morphology
definition: Any unspecified morphological anomaly of the stromal cell, such as, for example, abnormal shape or colour.
has_exact_synonym: abnormal morphology of stromal cell

abnormal branchial basket morphology
type: Class
subclass of: abnormal branchial basket
subclass of: abnormal cartilage element morphology
definition: Any unspecified morphological anomaly of the branchial basket, such as, for example, abnormal shape or colour.
has_exact_synonym: abnormal morphology of branchial basket

abnormal m. cucullaris morphology
type: Class
subclass of: abnormal m. cucullaris
subclass of: abnormal cranial muscle morphology
definition: Any unspecified morphological anomaly of the m. cucullaris, such as, for example, abnormal shape or colour.
has_exact_synonym: abnormal morphology of m. cucullaris

abnormal claw of hindlimb digit 3 morphology
type: Class
subclass of: abnormal claw of hindlimb digit 3
subclass of: abnormal claw morphology
definition: Any unspecified morphological anomaly of the claw of hindlimb digit 3, such as, for example, abnormal shape or colour.
has_exact_synonym: abnormal morphology of claw of hindlimb digit 3

abnormal premigratory neural crest cell morphology
type: Class
subclass of: abnormal premigratory neural crest cell
subclass of: abnormal cell morphology
definition: Any unspecified morphological anomaly of the premigratory neural crest cell, such as, for example, abnormal shape or colour.
has_exact_synonym: abnormal morphology of premigratory neural crest cell

abnormal dermatome morphology
type: Class
subclass of: abnormal dermatome
subclass of: abnormal tissue morphology
definition: Any unspecified morphological anomaly of the dermatome, such as, for example, abnormal shape or colour.
has_exact_synonym: abnormal morphology of dermatome

abnormal circulating cell morphology
type: Class
subclass of: abnormal circulating cell
subclass of: abnormal cell morphology
definition: Any unspecified morphological anomaly of the circulating cell, such as, for example, abnormal shape or colour.
has_exact_synonym: abnormal morphology of circulating cell

abnormal hepato-pancreatic duct morphology
type: Class
subclass of: abnormal hepato-pancreatic duct
subclass of: abnormal duct morphology
definition: Any unspecified morphological anomaly of the hepato-pancreatic duct, such as, for example, abnormal shape or colour.
has_exact_synonym: abnormal morphology of hepato-pancreatic duct

abnormal arteria subclavia morphology
type: Class
subclass of: abnormal arteria subclavia
subclass of: abnormal artery morphology
definition: Any unspecified morphological anomaly of the arteria subclavia, such as, for example, abnormal shape or colour.
has_exact_synonym: abnormal morphology of arteria subclavia

abnormal tail somite 17 morphology
type: Class
subclass of: abnormal tail somite 17
subclass of: abnormal tail somite morphology
definition: Any unspecified morphological anomaly of the tail somite 17, such as, for example, abnormal shape or colour.
has_exact_synonym: abnormal morphology of tail somite 17

abnormal pharyngeal pouch morphology
type: Class
subclass of: abnormal pharyngeal pouch
subclass of: abnormal multi-tissue structure morphology
definition: Any unspecified morphological anomaly of the pharyngeal pouch, such as, for example, abnormal shape or colour.
has_exact_synonym: abnormal morphology of pharyngeal pouch

abnormal retinal layer morphology
type: Class
subclass of: abnormal retinal layer
subclass of: abnormal tissue morphology
definition: Any unspecified morphological anomaly of the retinal layer, such as, for example, abnormal shape or colour.
has_exact_synonym: abnormal morphology of retinal layer

abnormal articular system morphology
type: Class
subclass of: abnormal articular system
subclass of: abnormal anatomical system morphology
definition: Any unspecified morphological anomaly of the articular system, such as, for example, abnormal shape or colour.
has_exact_synonym: abnormal morphology of articular system

abnormal proximal tubule branch morphology
type: Class
subclass of: abnormal proximal tubule branch
subclass of: XPO_0141316
definition: Any unspecified morphological anomaly of the proximal tubule branch, such as, for example, abnormal shape or colour.
has_exact_synonym: abnormal morphology of proximal tubule branch

abnormal non-ciliated epithelial cell morphology
type: Class
subclass of: abnormal non-ciliated epithelial cell
subclass of: abnormal epithelial cell morphology
definition: Any unspecified morphological anomaly of the non-ciliated epithelial cell, such as, for example, abnormal shape or colour.
has_exact_synonym: abnormal morphology of non-ciliated epithelial cell

abnormal m. obliquus superior morphology
type: Class
subclass of: abnormal m. obliquus superior
subclass of: abnormal eye muscle morphology
definition: Any unspecified morphological anomaly of the m. obliquus superior, such as, for example, abnormal shape or colour.
has_exact_synonym: abnormal morphology of m. obliquus superior

abnormal m. levator mandibulae longus profundus morphology
type: Class
subclass of: abnormal m. levator mandibulae longus profundus
subclass of: abnormal mandibular head muscle morphology
definition: Any unspecified morphological anomaly of the m. levator mandibulae longus profundus, such as, for example, abnormal shape or colour.
has_exact_synonym: abnormal morphology of m. levator mandibulae longus profundus

abnormal pars interna of the stapes morphology
type: Class
subclass of: abnormal pars interna of the stapes
subclass of: abnormal cartilage element morphology
definition: Any unspecified morphological anomaly of the pars interna of the stapes, such as, for example, abnormal shape or colour.
has_exact_synonym: abnormal morphology of pars interna of the stapes

abnormal sclerotome of tail somite 17 morphology
type: Class
subclass of: abnormal sclerotome of tail somite 17
subclass of: abnormal sclerotome morphology
definition: Any unspecified morphological anomaly of the sclerotome of tail somite 17, such as, for example, abnormal shape or colour.
has_exact_synonym: abnormal morphology of sclerotome of tail somite 17

abnormal regenerating hindlimb morphology
type: Class
subclass of: abnormal regenerating hindlimb
subclass of: abnormal regenerating limb morphology
definition: Any unspecified morphological anomaly of the regenerating hindlimb, such as, for example, abnormal shape or colour.
has_exact_synonym: abnormal morphology of regenerating hindlimb

abnormal late proximal tubule morphology
type: Class
subclass of: abnormal late proximal tubule
subclass of: abnormal tissue morphology
definition: Any unspecified morphological anomaly of the late proximal tubule, such as, for example, abnormal shape or colour.
has_exact_synonym: abnormal morphology of late proximal tubule

abnormal retinal ganglion cell morphology
type: Class
subclass of: abnormal retinal ganglion cell
subclass of: abnormal neuron morphology
definition: Any unspecified morphological anomaly of the retinal ganglion cell, such as, for example, abnormal shape or colour.
has_exact_synonym: abnormal morphology of retinal ganglion cell

abnormal suprachiasmatic nucleus morphology
type: Class
subclass of: abnormal suprachiasmatic nucleus
subclass of: abnormal neural nucleus morphology
definition: Any unspecified morphological anomaly of the suprachiasmatic nucleus, such as, for example, abnormal shape or colour.
has_exact_synonym: abnormal morphology of suprachiasmatic nucleus

abnormal vestibulocochlear nerve morphology
type: Class
subclass of: abnormal vestibulocochlear nerve
subclass of: abnormal cranial nerve morphology
definition: Any unspecified morphological anomaly of the vestibulocochlear nerve, such as, for example, abnormal shape or colour.
has_exact_synonym: abnormal morphology of vestibulocochlear nerve

abnormal optic chiasm morphology
type: Class
subclass of: abnormal optic chiasm
subclass of: abnormal multi-tissue structure morphology
definition: Any unspecified morphological anomaly of the optic chiasm, such as, for example, abnormal shape or colour.
has_exact_synonym: abnormal morphology of optic chiasm

abnormal dorsolateral commissural neuron morphology
type: Class
subclass of: abnormal dorsolateral commissural neuron
subclass of: abnormal neuron morphology
definition: Any unspecified morphological anomaly of the dorsolateral commissural neuron, such as, for example, abnormal shape or colour.
has_exact_synonym: abnormal morphology of dorsolateral commissural neuron

abnormal posterior ventral blood island morphology
type: Class
subclass of: abnormal posterior ventral blood island
subclass of: abnormal tissue morphology
definition: Any unspecified morphological anomaly of the posterior ventral blood island, such as, for example, abnormal shape or colour.
has_exact_synonym: abnormal morphology of posterior ventral blood island

abnormal forelimb bud morphology
type: Class
subclass of: abnormal forelimb bud
subclass of: abnormal limb bud morphology
definition: Any unspecified morphological anomaly of the forelimb bud, such as, for example, abnormal shape or colour.
has_exact_synonym: abnormal morphology of forelimb bud

abnormal myotome of head somite 1 morphology
type: Class
subclass of: abnormal myotome of head somite 1
subclass of: abnormal myotome morphology
definition: Any unspecified morphological anomaly of the myotome of head somite 1, such as, for example, abnormal shape or colour.
has_exact_synonym: abnormal morphology of myotome of head somite 1

abnormal palatoquadrate morphology
type: Class
subclass of: abnormal palatoquadrate
subclass of: abnormal tissue morphology
definition: Any unspecified morphological anomaly of the palatoquadrate, such as, for example, abnormal shape or colour.
has_exact_synonym: abnormal morphology of palatoquadrate

abnormal blastomere D2.1 morphology
type: Class
subclass of: abnormal blastomere D2.1
subclass of: abnormal dorsal vegetal hemisphere blastomere morphology
definition: Any unspecified morphological anomaly of the blastomere D2.1, such as, for example, abnormal shape or colour.
has_exact_synonym: abnormal morphology of blastomere D2.1

abnormal bile duct morphology
type: Class
subclass of: abnormal bile duct
subclass of: abnormal duct morphology
definition: Any unspecified morphological anomaly of the bile duct, such as, for example, abnormal shape or colour.
has_exact_synonym: abnormal morphology of bile duct

abnormal anterior commissure morphology
type: Class
subclass of: abnormal anterior commissure
subclass of: abnormal anatomical cluster morphology
definition: Any unspecified morphological anomaly of the anterior commissure, such as, for example, abnormal shape or colour.
has_exact_synonym: abnormal morphology of anterior commissure

abnormal femur rudiment morphology
type: Class
subclass of: abnormal femur rudiment
subclass of: abnormal cartilage element morphology
definition: Any unspecified morphological anomaly of the femur rudiment, such as, for example, abnormal shape or colour.
has_exact_synonym: abnormal morphology of femur rudiment

abnormal occipital region morphology
type: Class
subclass of: abnormal occipital region
subclass of: abnormal anatomical cluster morphology
definition: Any unspecified morphological anomaly of the occipital region, such as, for example, abnormal shape or colour.
has_exact_synonym: abnormal morphology of occipital region

abnormal sclerotome of head somite 4 morphology
type: Class
subclass of: abnormal sclerotome of head somite 4
subclass of: abnormal sclerotome morphology
definition: Any unspecified morphological anomaly of the sclerotome of head somite 4, such as, for example, abnormal shape or colour.
has_exact_synonym: abnormal morphology of sclerotome of head somite 4

abnormal digestive enzyme secreting cell morphology
type: Class
subclass of: abnormal digestive enzyme secreting cell
subclass of: abnormal cell morphology
definition: Any unspecified morphological anomaly of the digestive enzyme secreting cell, such as, for example, abnormal shape or colour.
has_exact_synonym: abnormal morphology of digestive enzyme secreting cell

abnormal optic disc morphology
type: Class
subclass of: abnormal optic disc
subclass of: XPO_0141316
definition: Any unspecified morphological anomaly of the optic disc, such as, for example, abnormal shape or colour.
has_exact_synonym: abnormal morphology of optic disc

abnormal joint region morphology
type: Class
subclass of: abnormal joint region
subclass of: XPO_0141316
definition: Any unspecified morphological anomaly of the joint region, such as, for example, abnormal shape or colour.
has_exact_synonym: abnormal morphology of joint region

abnormal isthmic nucleus morphology
type: Class
subclass of: abnormal isthmic nucleus
subclass of: abnormal neural nucleus morphology
definition: Any unspecified morphological anomaly of the isthmic nucleus, such as, for example, abnormal shape or colour.
has_exact_synonym: abnormal morphology of isthmic nucleus

abnormal thymus morphology
type: Class
subclass of: abnormal thymus
subclass of: abnormal compound organ morphology
definition: Any unspecified morphological anomaly of the thymus, such as, for example, abnormal shape or colour.
has_exact_synonym: abnormal morphology of thymus

abnormal vestibule morphology
type: Class
subclass of: abnormal vestibule
subclass of: abnormal tissue morphology
definition: Any unspecified morphological anomaly of the vestibule, such as, for example, abnormal shape or colour.
has_exact_synonym: abnormal morphology of vestibule

abnormal peripheral nerve morphology
type: Class
subclass of: abnormal peripheral nerve
subclass of: abnormal nerve morphology
definition: Any unspecified morphological anomaly of the peripheral nerve, such as, for example, abnormal shape or colour.
has_exact_synonym: abnormal morphology of peripheral nerve

abnormal glomerular epithelial cell morphology
type: Class
subclass of: abnormal glomerular epithelial cell
subclass of: abnormal epithelial cell morphology
definition: Any unspecified morphological anomaly of the glomerular epithelial cell, such as, for example, abnormal shape or colour.
has_exact_synonym: abnormal morphology of glomerular epithelial cell

abnormal ischiadic vein morphology
type: Class
subclass of: abnormal ischiadic vein
subclass of: abnormal vein morphology
definition: Any unspecified morphological anomaly of the ischiadic vein, such as, for example, abnormal shape or colour.
has_exact_synonym: abnormal morphology of ischiadic vein

abnormal glossopharyngeal nerve morphology
type: Class
subclass of: abnormal glossopharyngeal nerve
subclass of: abnormal cranial nerve morphology
definition: Any unspecified morphological anomaly of the glossopharyngeal nerve, such as, for example, abnormal shape or colour.
has_exact_synonym: abnormal morphology of glossopharyngeal nerve

abnormal stratum spongiosum morphology
type: Class
subclass of: abnormal stratum spongiosum
subclass of: abnormal tissue morphology
definition: Any unspecified morphological anomaly of the stratum spongiosum, such as, for example, abnormal shape or colour.
has_exact_synonym: abnormal morphology of stratum spongiosum

abnormal pre-enameloid morphology
type: Class
subclass of: abnormal pre-enameloid
subclass of: abnormal odontoid tissue morphology
definition: Any unspecified morphological anomaly of the pre-enameloid, such as, for example, abnormal shape or colour.
has_exact_synonym: abnormal morphology of pre-enameloid

abnormal aortic arch 2 morphology
type: Class
subclass of: abnormal aortic arch 2
subclass of: abnormal aortic arch morphology
definition: Any unspecified morphological anomaly of the aortic arch 2, such as, for example, abnormal shape or colour.
has_exact_synonym: abnormal morphology of aortic arch 2

abnormal sclerotome of trunk somite 3 morphology
type: Class
subclass of: abnormal sclerotome of trunk somite 3
subclass of: abnormal sclerotome morphology
definition: Any unspecified morphological anomaly of the sclerotome of trunk somite 3, such as, for example, abnormal shape or colour.
has_exact_synonym: abnormal morphology of sclerotome of trunk somite 3

abnormal glomeral mesenchyme morphology
type: Class
subclass of: abnormal glomeral mesenchyme
subclass of: abnormal embryonic structure morphology
definition: Any unspecified morphological anomaly of the glomeral mesenchyme, such as, for example, abnormal shape or colour.
has_exact_synonym: abnormal morphology of glomeral mesenchyme

abnormal myotome of trunk somite 2 morphology
type: Class
subclass of: abnormal myotome of trunk somite 2
subclass of: abnormal myotome morphology
definition: Any unspecified morphological anomaly of the myotome of trunk somite 2, such as, for example, abnormal shape or colour.
has_exact_synonym: abnormal morphology of myotome of trunk somite 2

abnormal ophthalmic vein morphology
type: Class
subclass of: abnormal ophthalmic vein
subclass of: abnormal vein morphology
definition: Any unspecified morphological anomaly of the ophthalmic vein, such as, for example, abnormal shape or colour.
has_exact_synonym: abnormal morphology of ophthalmic vein

abnormal migrating macrophage morphology
type: Class
subclass of: abnormal migrating macrophage
subclass of: abnormal macrophage morphology
definition: Any unspecified morphological anomaly of the migrating macrophage, such as, for example, abnormal shape or colour.
has_exact_synonym: abnormal morphology of migrating macrophage

abnormal macrophage morphology
type: Class
subclass of: abnormal macrophage
subclass of: abnormal circulating cell morphology
definition: Any unspecified morphological anomaly of the macrophage, such as, for example, abnormal shape or colour.
has_exact_synonym: abnormal morphology of macrophage

abnormal tail vein morphology
type: Class
subclass of: abnormal tail vein
subclass of: abnormal vein morphology
definition: Any unspecified morphological anomaly of the tail vein, such as, for example, abnormal shape or colour.
has_exact_synonym: abnormal morphology of tail vein

abnormal ceratobranchial III morphology
type: Class
subclass of: abnormal ceratobranchial III
subclass of: abnormal cartilage element morphology
definition: Any unspecified morphological anomaly of the ceratobranchial III, such as, for example, abnormal shape or colour.
has_exact_synonym: abnormal morphology of ceratobranchial III

abnormal retinal rod cell morphology
type: Class
subclass of: abnormal retinal rod cell
subclass of: abnormal eye photoreceptor cell morphology
definition: Any unspecified morphological anomaly of the retinal rod cell, such as, for example, abnormal shape or colour.
has_exact_synonym: abnormal morphology of retinal rod cell

abnormal centriole morphology
type: Class
subclass of: abnormal centriole
subclass of: abnormal cell part morphology
definition: Any unspecified morphological anomaly of the centriole, such as, for example, abnormal shape or colour.
has_exact_synonym: abnormal morphology of centriole

abnormal larval immune system morphology
type: Class
subclass of: abnormal larval immune system
subclass of: abnormal immune system morphology
definition: Any unspecified morphological anomaly of the larval immune system, such as, for example, abnormal shape or colour.
has_exact_synonym: abnormal morphology of larval immune system

abnormal medial septum morphology
type: Class
subclass of: abnormal medial septum
subclass of: XPO_0141720
definition: Any unspecified morphological anomaly of the medial septum, such as, for example, abnormal shape or colour.
has_exact_synonym: abnormal morphology of medial septum

abnormal Mauthner cell morphology
type: Class
subclass of: abnormal Mauthner cell
subclass of: abnormal neuron morphology
definition: Any unspecified morphological anomaly of the Mauthner cell, such as, for example, abnormal shape or colour.
has_exact_synonym: abnormal morphology of Mauthner cell

abnormal dorsal involuting marginal zone morphology
type: Class
subclass of: abnormal dorsal involuting marginal zone
subclass of: abnormal marginal zone morphology
definition: Any unspecified morphological anomaly of the dorsal involuting marginal zone, such as, for example, abnormal shape or colour.
has_exact_synonym: abnormal morphology of dorsal involuting marginal zone

abnormal m. obliquus inferior primordium morphology
type: Class
subclass of: abnormal m. obliquus inferior primordium
subclass of: abnormal cranial muscle primordium morphology
definition: Any unspecified morphological anomaly of the m. obliquus inferior primordium, such as, for example, abnormal shape or colour.
has_exact_synonym: abnormal morphology of m. obliquus inferior primordium

abnormal postsacral vertebra morphology
type: Class
subclass of: abnormal postsacral vertebra
subclass of: abnormal vertebra morphology
definition: Any unspecified morphological anomaly of the postsacral vertebra, such as, for example, abnormal shape or colour.
has_exact_synonym: abnormal morphology of postsacral vertebra

abnormal sclerotome of trunk somite 2 morphology
type: Class
subclass of: abnormal sclerotome of trunk somite 2
subclass of: abnormal sclerotome morphology
definition: Any unspecified morphological anomaly of the sclerotome of trunk somite 2, such as, for example, abnormal shape or colour.
has_exact_synonym: abnormal morphology of sclerotome of trunk somite 2

abnormal mesenchymal stem cell morphology
type: Class
subclass of: abnormal mesenchymal stem cell
subclass of: abnormal stem cell morphology
definition: Any unspecified morphological anomaly of the mesenchymal stem cell, such as, for example, abnormal shape or colour.
has_exact_synonym: abnormal morphology of mesenchymal stem cell

abnormal cementum morphology
type: Class
subclass of: abnormal cementum
subclass of: abnormal odontoid tissue morphology
definition: Any unspecified morphological anomaly of the cementum, such as, for example, abnormal shape or colour.
has_exact_synonym: abnormal morphology of cementum

abnormal iris morphology
type: Class
subclass of: abnormal iris
subclass of: abnormal multi-tissue structure morphology
definition: Any unspecified morphological anomaly of the iris, such as, for example, abnormal shape or colour.
has_exact_synonym: abnormal morphology of iris

abnormal taste bud morphology
type: Class
subclass of: abnormal taste bud
subclass of: abnormal tissue morphology
definition: Any unspecified morphological anomaly of the taste bud, such as, for example, abnormal shape or colour.
has_exact_synonym: abnormal morphology of taste bud

abnormal female genitalia morphology
type: Class
subclass of: abnormal female genitalia
subclass of: abnormal genital system morphology
definition: Any unspecified morphological anomaly of the female genitalia, such as, for example, abnormal shape or colour.
has_exact_synonym: abnormal morphology of female genitalia

abnormal scapula morphology
type: Class
subclass of: abnormal scapula
subclass of: abnormal endochondral bone morphology
definition: Any unspecified morphological anomaly of the scapula, such as, for example, abnormal shape or colour.
has_exact_synonym: abnormal morphology of scapula

abnormal gasserian ganglion morphology
type: Class
subclass of: abnormal gasserian ganglion
subclass of: abnormal ganglion morphology
definition: Any unspecified morphological anomaly of the gasserian ganglion, such as, for example, abnormal shape or colour.
has_exact_synonym: abnormal morphology of gasserian ganglion

abnormal lagena morphology
type: Class
subclass of: abnormal lagena
subclass of: abnormal multi-tissue structure morphology
definition: Any unspecified morphological anomaly of the lagena, such as, for example, abnormal shape or colour.
has_exact_synonym: abnormal morphology of lagena

abnormal cutaneous femoral vein morphology
type: Class
subclass of: abnormal cutaneous femoral vein
subclass of: abnormal vein morphology
definition: Any unspecified morphological anomaly of the cutaneous femoral vein, such as, for example, abnormal shape or colour.
has_exact_synonym: abnormal morphology of cutaneous femoral vein

abnormal mucus secreting cell morphology
type: Class
subclass of: abnormal mucus secreting cell
subclass of: abnormal cell morphology
definition: Any unspecified morphological anomaly of the mucus secreting cell, such as, for example, abnormal shape or colour.
has_exact_synonym: abnormal morphology of mucus secreting cell

abnormal olfactory epithelial support cell morphology
type: Class
subclass of: abnormal olfactory epithelial support cell
subclass of: abnormal cell morphology
definition: Any unspecified morphological anomaly of the olfactory epithelial support cell, such as, for example, abnormal shape or colour.
has_exact_synonym: abnormal morphology of olfactory epithelial support cell

abnormal ciliated non-epidermal cell morphology
type: Class
subclass of: abnormal ciliated non-epidermal cell
subclass of: abnormal ciliated cell morphology
definition: Any unspecified morphological anomaly of the ciliated non-epidermal cell, such as, for example, abnormal shape or colour.
has_exact_synonym: abnormal morphology of ciliated non-epidermal cell

abnormal nucleate erythrocyte morphology
type: Class
subclass of: abnormal nucleate erythrocyte
subclass of: abnormal cell morphology
definition: Any unspecified morphological anomaly of the nucleate erythrocyte, such as, for example, abnormal shape or colour.
has_exact_synonym: abnormal morphology of nucleate erythrocyte

abnormal endocardial cushion morphology
type: Class
subclass of: abnormal endocardial cushion
subclass of: abnormal tissue morphology
definition: Any unspecified morphological anomaly of the endocardial cushion, such as, for example, abnormal shape or colour.
has_exact_synonym: abnormal morphology of endocardial cushion

abnormal vertebral artery morphology
type: Class
subclass of: abnormal vertebral artery
subclass of: abnormal artery morphology
definition: Any unspecified morphological anomaly of the vertebral artery, such as, for example, abnormal shape or colour.
has_exact_synonym: abnormal morphology of vertebral artery

abnormal hindlimb digit 4 morphology
type: Class
subclass of: abnormal hindlimb digit 4
subclass of: abnormal hindlimb digit morphology
definition: Any unspecified morphological anomaly of the hindlimb digit 4, such as, for example, abnormal shape or colour.
has_exact_synonym: abnormal morphology of hindlimb digit 4

abnormal ventricular outflow tract morphology
type: Class
subclass of: abnormal ventricular outflow tract
subclass of: abnormal multi-tissue structure morphology
definition: Any unspecified morphological anomaly of the ventricular outflow tract, such as, for example, abnormal shape or colour.
has_exact_synonym: abnormal morphology of ventricular outflow tract

abnormal Rohon-Beard neuron morphology
type: Class
subclass of: abnormal Rohon-Beard neuron
subclass of: abnormal neuron morphology
definition: Any unspecified morphological anomaly of the Rohon-Beard neuron, such as, for example, abnormal shape or colour.
has_exact_synonym: abnormal morphology of Rohon-Beard neuron

abnormal mesonephric early proximal tubule morphology
type: Class
subclass of: abnormal mesonephric early proximal tubule
subclass of: abnormal mesonephric tubule morphology
definition: Any unspecified morphological anomaly of the mesonephric early proximal tubule, such as, for example, abnormal shape or colour.
has_exact_synonym: abnormal morphology of mesonephric early proximal tubule

abnormal digit-joint region morphology
type: Class
subclass of: abnormal digit-joint region
subclass of: abnormal joint region morphology
definition: Any unspecified morphological anomaly of the digit-joint region, such as, for example, abnormal shape or colour.
has_exact_synonym: abnormal morphology of digit-joint region

abnormal myotome of trunk somite 12 morphology
type: Class
subclass of: abnormal myotome of trunk somite 12
subclass of: abnormal myotome morphology
definition: Any unspecified morphological anomaly of the myotome of trunk somite 12, such as, for example, abnormal shape or colour.
has_exact_synonym: abnormal morphology of myotome of trunk somite 12

abnormal retinal cone cell morphology
type: Class
subclass of: abnormal retinal cone cell
subclass of: abnormal eye photoreceptor cell morphology
definition: Any unspecified morphological anomaly of the retinal cone cell, such as, for example, abnormal shape or colour.
has_exact_synonym: abnormal morphology of retinal cone cell

abnormal auditory hair cell morphology
type: Class
subclass of: abnormal auditory hair cell
subclass of: abnormal sensory epithelial cell morphology
definition: Any unspecified morphological anomaly of the auditory hair cell, such as, for example, abnormal shape or colour.
has_exact_synonym: abnormal morphology of auditory hair cell

abnormal sclerotome of trunk somite 11 morphology
type: Class
subclass of: abnormal sclerotome of trunk somite 11
subclass of: abnormal sclerotome morphology
definition: Any unspecified morphological anomaly of the sclerotome of trunk somite 11, such as, for example, abnormal shape or colour.
has_exact_synonym: abnormal morphology of sclerotome of trunk somite 11

abnormal stratum compactum morphology
type: Class
subclass of: abnormal stratum compactum
subclass of: abnormal tissue morphology
definition: Any unspecified morphological anomaly of the stratum compactum, such as, for example, abnormal shape or colour.
has_exact_synonym: abnormal morphology of stratum compactum

abnormal mesencephalic vein morphology
type: Class
subclass of: abnormal mesencephalic vein
subclass of: abnormal vein morphology
definition: Any unspecified morphological anomaly of the mesencephalic vein, such as, for example, abnormal shape or colour.
has_exact_synonym: abnormal morphology of mesencephalic vein

abnormal head endoderm morphology
type: Class
subclass of: abnormal head endoderm
subclass of: abnormal tissue morphology
definition: Any unspecified morphological anomaly of the head endoderm, such as, for example, abnormal shape or colour.
has_exact_synonym: abnormal morphology of head endoderm

abnormal coeliaco-mesenteric artery morphology
type: Class
subclass of: abnormal coeliaco-mesenteric artery
subclass of: abnormal artery morphology
definition: Any unspecified morphological anomaly of the coeliaco-mesenteric artery, such as, for example, abnormal shape or colour.
has_exact_synonym: abnormal morphology of coeliaco-mesenteric artery

abnormal dentine morphology
type: Class
subclass of: abnormal dentine
subclass of: abnormal odontoid tissue morphology
definition: Any unspecified morphological anomaly of the dentine, such as, for example, abnormal shape or colour.
has_exact_synonym: abnormal morphology of dentine

abnormal central canal morphology
type: Class
subclass of: abnormal central canal
subclass of: abnormal anatomical cluster morphology
definition: Any unspecified morphological anomaly of the central canal, such as, for example, abnormal shape or colour.
has_exact_synonym: abnormal morphology of central canal

abnormal m. dilatator laryngis morphology
type: Class
subclass of: abnormal m. dilatator laryngis
subclass of: abnormal laryngeal muscle morphology
definition: Any unspecified morphological anomaly of the m. dilatator laryngis, such as, for example, abnormal shape or colour.
has_exact_synonym: abnormal morphology of m. dilatator laryngis

abnormal oviduct morphology
type: Class
subclass of: abnormal oviduct
subclass of: abnormal duct morphology
definition: Any unspecified morphological anomaly of the oviduct, such as, for example, abnormal shape or colour.
has_exact_synonym: abnormal morphology of oviduct

abnormal blastocoel floor morphology
type: Class
subclass of: abnormal blastocoel floor
subclass of: abnormal tissue morphology
definition: Any unspecified morphological anomaly of the blastocoel floor, such as, for example, abnormal shape or colour.
has_exact_synonym: abnormal morphology of blastocoel floor

abnormal mitotic spindle morphology
type: Class
subclass of: abnormal mitotic spindle
subclass of: abnormal cell part morphology
definition: Any unspecified morphological anomaly of the mitotic spindle, such as, for example, abnormal shape or colour.
has_exact_synonym: abnormal morphology of mitotic spindle

abnormal nucleus reticularis medialis morphology
type: Class
subclass of: abnormal nucleus reticularis medialis
subclass of: abnormal neural nucleus morphology
definition: Any unspecified morphological anomaly of the nucleus reticularis medialis, such as, for example, abnormal shape or colour.
has_exact_synonym: abnormal morphology of nucleus reticularis medialis

abnormal posterior commissure morphology
type: Class
subclass of: abnormal posterior commissure
subclass of: abnormal anatomical cluster morphology
definition: Any unspecified morphological anomaly of the posterior commissure, such as, for example, abnormal shape or colour.
has_exact_synonym: abnormal morphology of posterior commissure

abnormal branchial arch skeleton 4 morphology
type: Class
subclass of: abnormal branchial arch skeleton 4
subclass of: abnormal branchial arch skeleton morphology
definition: Any unspecified morphological anomaly of the branchial arch skeleton 4, such as, for example, abnormal shape or colour.
has_exact_synonym: abnormal morphology of branchial arch skeleton 4

abnormal lateral hypothalamic nucleus morphology
type: Class
subclass of: abnormal lateral hypothalamic nucleus
subclass of: abnormal neural nucleus morphology
definition: Any unspecified morphological anomaly of the lateral hypothalamic nucleus, such as, for example, abnormal shape or colour.
has_exact_synonym: abnormal morphology of lateral hypothalamic nucleus

abnormal mesodermal cell morphology
type: Class
subclass of: abnormal mesodermal cell
subclass of: abnormal cell morphology
definition: Any unspecified morphological anomaly of the mesodermal cell, such as, for example, abnormal shape or colour.
has_exact_synonym: abnormal morphology of mesodermal cell

abnormal caudal lateral line morphology
type: Class
subclass of: abnormal caudal lateral line
subclass of: abnormal lateral line morphology
definition: Any unspecified morphological anomaly of the caudal lateral line, such as, for example, abnormal shape or colour.
has_exact_synonym: abnormal morphology of caudal lateral line

abnormal roof plate morphology
type: Class
subclass of: abnormal roof plate
subclass of: abnormal multi-tissue structure morphology
definition: Any unspecified morphological anomaly of the roof plate, such as, for example, abnormal shape or colour.
has_exact_synonym: abnormal morphology of roof plate

abnormal lateral abdominal vein morphology
type: Class
subclass of: abnormal lateral abdominal vein
subclass of: abnormal vein morphology
definition: Any unspecified morphological anomaly of the lateral abdominal vein, such as, for example, abnormal shape or colour.
has_exact_synonym: abnormal morphology of lateral abdominal vein

abnormal pubis morphology
type: Class
subclass of: abnormal pubis
subclass of: abnormal endochondral bone morphology
definition: Any unspecified morphological anomaly of the pubis, such as, for example, abnormal shape or colour.
has_exact_synonym: abnormal morphology of pubis

abnormal notoplate morphology
type: Class
subclass of: abnormal notoplate
subclass of: abnormal tissue morphology
definition: Any unspecified morphological anomaly of the notoplate, such as, for example, abnormal shape or colour.
has_exact_synonym: abnormal morphology of notoplate

abnormal hypochord morphology
type: Class
subclass of: abnormal hypochord
subclass of: abnormal tissue morphology
definition: Any unspecified morphological anomaly of the hypochord, such as, for example, abnormal shape or colour.
has_exact_synonym: abnormal morphology of hypochord

abnormal mm. levator arcuum branchialium IV morphology
type: Class
subclass of: abnormal mm. levator arcuum branchialium IV
subclass of: abnormal branchial head muscle morphology
definition: Any unspecified morphological anomaly of the mm. levator arcuum branchialium IV, such as, for example, abnormal shape or colour.
has_exact_synonym: abnormal morphology of mm. levator arcuum branchialium IV

abnormal glomerulus morphology
type: Class
subclass of: abnormal glomerulus
subclass of: abnormal multi-tissue structure morphology
definition: Any unspecified morphological anomaly of the glomerulus, such as, for example, abnormal shape or colour.
has_exact_synonym: abnormal morphology of glomerulus

abnormal pigment cell morphology
type: Class
subclass of: abnormal pigment cell
subclass of: abnormal cell morphology
definition: Any unspecified morphological anomaly of the pigment cell, such as, for example, abnormal shape or colour.
has_exact_synonym: abnormal morphology of pigment cell

abnormal hindlimb bud tip morphology
type: Class
subclass of: abnormal hindlimb bud tip
subclass of: abnormal tissue morphology
definition: Any unspecified morphological anomaly of the hindlimb bud tip, such as, for example, abnormal shape or colour.
has_exact_synonym: abnormal morphology of hindlimb bud tip

abnormal enameloid morphology
type: Class
subclass of: abnormal enameloid
subclass of: abnormal odontoid tissue morphology
definition: Any unspecified morphological anomaly of the enameloid, such as, for example, abnormal shape or colour.
has_exact_synonym: abnormal morphology of enameloid

abnormal tympanic disk morphology
type: Class
subclass of: abnormal tympanic disk
subclass of: abnormal cartilage element morphology
definition: Any unspecified morphological anomaly of the tympanic disk, such as, for example, abnormal shape or colour.
has_exact_synonym: abnormal morphology of tympanic disk

abnormal metatarsus morphology
type: Class
subclass of: abnormal metatarsus
subclass of: abnormal bone element morphology
definition: Any unspecified morphological anomaly of the metatarsus, such as, for example, abnormal shape or colour.
has_exact_synonym: abnormal morphology of metatarsus

abnormal left-ventral blastomere morphology
type: Class
subclass of: abnormal left-ventral blastomere
subclass of: abnormal blastomere morphology
definition: Any unspecified morphological anomaly of the left-ventral blastomere, such as, for example, abnormal shape or colour.
has_exact_synonym: abnormal morphology of left-ventral blastomere

abnormal ventromedial thalamic nucleus morphology
type: Class
subclass of: abnormal ventromedial thalamic nucleus
subclass of: abnormal neural nucleus morphology
definition: Any unspecified morphological anomaly of the ventromedial thalamic nucleus, such as, for example, abnormal shape or colour.
has_exact_synonym: abnormal morphology of ventromedial thalamic nucleus

abnormal rostral presomitic mesoderm morphology
type: Class
subclass of: abnormal rostral presomitic mesoderm
subclass of: abnormal tissue morphology
definition: Any unspecified morphological anomaly of the rostral presomitic mesoderm, such as, for example, abnormal shape or colour.
has_exact_synonym: abnormal morphology of rostral presomitic mesoderm

abnormal keratinocyte morphology
type: Class
subclass of: abnormal keratinocyte
subclass of: abnormal keratin accumulating cell morphology
definition: Any unspecified morphological anomaly of the keratinocyte, such as, for example, abnormal shape or colour.
has_exact_synonym: abnormal morphology of keratinocyte

abnormal neuroectoderm outer layer morphology
type: Class
subclass of: abnormal neuroectoderm outer layer
subclass of: abnormal tissue morphology
definition: Any unspecified morphological anomaly of the neuroectoderm outer layer, such as, for example, abnormal shape or colour.
has_exact_synonym: abnormal morphology of neuroectoderm outer layer

abnormal external coil of the small intestine morphology
type: Class
subclass of: abnormal external coil of the small intestine
subclass of: abnormal multi-tissue structure morphology
definition: Any unspecified morphological anomaly of the external coil of the small intestine, such as, for example, abnormal shape or colour.
has_exact_synonym: abnormal morphology of external coil of the small intestine

abnormal orbital region morphology
type: Class
subclass of: abnormal orbital region
subclass of: abnormal anatomical cluster morphology
definition: Any unspecified morphological anomaly of the orbital region, such as, for example, abnormal shape or colour.
has_exact_synonym: abnormal morphology of orbital region

abnormal mm. levator arcuum branchialium III morphology
type: Class
subclass of: abnormal mm. levator arcuum branchialium III
subclass of: abnormal branchial head muscle morphology
definition: Any unspecified morphological anomaly of the mm. levator arcuum branchialium III, such as, for example, abnormal shape or colour.
has_exact_synonym: abnormal morphology of mm. levator arcuum branchialium III

abnormal oculomotor motornucleus morphology
type: Class
subclass of: abnormal oculomotor motornucleus
subclass of: abnormal neural nucleus morphology
definition: Any unspecified morphological anomaly of the oculomotor motornucleus, such as, for example, abnormal shape or colour.
has_exact_synonym: abnormal morphology of oculomotor motornucleus

abnormal solitary tract morphology
type: Class
subclass of: abnormal solitary tract
subclass of: abnormal anatomical cluster morphology
definition: Any unspecified morphological anomaly of the solitary tract, such as, for example, abnormal shape or colour.
has_exact_synonym: abnormal morphology of solitary tract

abnormal posterior hypothalamus morphology
type: Class
subclass of: abnormal posterior hypothalamus
subclass of: abnormal multi-tissue structure morphology
definition: Any unspecified morphological anomaly of the posterior hypothalamus, such as, for example, abnormal shape or colour.
has_exact_synonym: abnormal morphology of posterior hypothalamus

abnormal branchial arch skeleton 2 morphology
type: Class
subclass of: abnormal branchial arch skeleton 2
subclass of: abnormal branchial arch skeleton morphology
definition: Any unspecified morphological anomaly of the branchial arch skeleton 2, such as, for example, abnormal shape or colour.
has_exact_synonym: abnormal morphology of branchial arch skeleton 2

abnormal claw of hindlimb digit 1 morphology
type: Class
subclass of: abnormal claw of hindlimb digit 1
subclass of: abnormal claw morphology
definition: Any unspecified morphological anomaly of the claw of hindlimb digit 1, such as, for example, abnormal shape or colour.
has_exact_synonym: abnormal morphology of claw of hindlimb digit 1

abnormal m. rectus abdominis morphology
type: Class
subclass of: abnormal m. rectus abdominis
subclass of: abnormal muscle morphology
definition: Any unspecified morphological anomaly of the m. rectus abdominis, such as, for example, abnormal shape or colour.
has_exact_synonym: abnormal morphology of m. rectus abdominis

abnormal barrier cell morphology
type: Class
subclass of: abnormal barrier cell
subclass of: abnormal cell morphology
definition: Any unspecified morphological anomaly of the barrier cell, such as, for example, abnormal shape or colour.
has_exact_synonym: abnormal morphology of barrier cell

abnormal posterior lateral line placode morphology
type: Class
subclass of: abnormal posterior lateral line placode
subclass of: abnormal lateral line placode morphology
definition: Any unspecified morphological anomaly of the posterior lateral line placode, such as, for example, abnormal shape or colour.
has_exact_synonym: abnormal morphology of posterior lateral line placode

abnormal sacral neural crest morphology
type: Class
subclass of: abnormal sacral neural crest
subclass of: XPO_0141500
definition: Any unspecified morphological anomaly of the sacral neural crest, such as, for example, abnormal shape or colour.
has_exact_synonym: abnormal morphology of sacral neural crest

abnormal lung morphology
type: Class
subclass of: abnormal lung
subclass of: abnormal cavitated compound organ morphology
subclass of: abnormal viscus morphology
definition: Any unspecified morphological anomaly of the lung, such as, for example, abnormal shape or colour.
has_exact_synonym: abnormal morphology of lung

abnormal utricle morphology
type: Class
subclass of: abnormal utricle
subclass of: abnormal auditory ossicle morphology
definition: Any unspecified morphological anomaly of the utricle, such as, for example, abnormal shape or colour.
has_exact_synonym: abnormal morphology of utricle

abnormal subcortical cytoplasm morphology
type: Class
subclass of: abnormal subcortical cytoplasm
subclass of: abnormal cell part morphology
definition: Any unspecified morphological anomaly of the subcortical cytoplasm, such as, for example, abnormal shape or colour.
has_exact_synonym: abnormal morphology of subcortical cytoplasm

abnormal bulbous arteriosis morphology
type: Class
subclass of: abnormal bulbous arteriosis
subclass of: abnormal multi-tissue structure morphology
definition: Any unspecified morphological anomaly of the bulbous arteriosis, such as, for example, abnormal shape or colour.
has_exact_synonym: abnormal morphology of bulbous arteriosis

abnormal myotome of trunk somite 7 morphology
type: Class
subclass of: abnormal myotome of trunk somite 7
subclass of: abnormal myotome morphology
definition: Any unspecified morphological anomaly of the myotome of trunk somite 7, such as, for example, abnormal shape or colour.
has_exact_synonym: abnormal morphology of myotome of trunk somite 7

abnormal ileum morphology
type: Class
subclass of: abnormal ileum
subclass of: abnormal multi-tissue structure morphology
definition: Any unspecified morphological anomaly of the ileum, such as, for example, abnormal shape or colour.
has_exact_synonym: abnormal morphology of ileum

abnormal retinal ganglion cell layer morphology
type: Class
subclass of: abnormal retinal ganglion cell layer
subclass of: abnormal tissue morphology
definition: Any unspecified morphological anomaly of the retinal ganglion cell layer, such as, for example, abnormal shape or colour.
has_exact_synonym: abnormal morphology of retinal ganglion cell layer

abnormal processus articularis palatoquadrati morphology
type: Class
subclass of: abnormal processus articularis palatoquadrati
subclass of: abnormal cartilage element morphology
definition: Any unspecified morphological anomaly of the processus articularis palatoquadrati, such as, for example, abnormal shape or colour.
has_exact_synonym: abnormal morphology of processus articularis palatoquadrati

abnormal colon morphology
type: Class
subclass of: abnormal colon
subclass of: abnormal multi-tissue structure morphology
definition: Any unspecified morphological anomaly of the colon, such as, for example, abnormal shape or colour.
has_exact_synonym: abnormal morphology of colon

abnormal pigment layer morphology
type: Class
subclass of: abnormal pigment layer
subclass of: abnormal tissue morphology
definition: Any unspecified morphological anomaly of the pigment layer, such as, for example, abnormal shape or colour.
has_exact_synonym: abnormal morphology of pigment layer

abnormal bottle cell morphology
type: Class
subclass of: abnormal bottle cell
subclass of: abnormal gastrula cell morphology
definition: Any unspecified morphological anomaly of the bottle cell, such as, for example, abnormal shape or colour.
has_exact_synonym: abnormal morphology of bottle cell

abnormal trigeminal ganglion morphology
type: Class
subclass of: abnormal trigeminal ganglion
subclass of: abnormal ganglion morphology
definition: Any unspecified morphological anomaly of the trigeminal ganglion, such as, for example, abnormal shape or colour.
has_exact_synonym: abnormal morphology of trigeminal ganglion

abnormal Eberth-Kastschenko layer morphology
type: Class
subclass of: abnormal Eberth-Kastschenko layer
subclass of: abnormal tissue morphology
definition: Any unspecified morphological anomaly of the Eberth-Kastschenko layer, such as, for example, abnormal shape or colour.
has_exact_synonym: abnormal morphology of Eberth-Kastschenko layer

abnormal retinal inner nuclear layer morphology
type: Class
subclass of: abnormal retinal inner nuclear layer
subclass of: abnormal tissue morphology
definition: Any unspecified morphological anomaly of the retinal inner nuclear layer, such as, for example, abnormal shape or colour.
has_exact_synonym: abnormal morphology of retinal inner nuclear layer

abnormal hyaloid vascular plexus morphology
type: Class
subclass of: abnormal hyaloid vascular plexus
subclass of: abnormal hyaloid blood vessel morphology
definition: Any unspecified morphological anomaly of the hyaloid vascular plexus, such as, for example, abnormal shape or colour.
has_exact_synonym: abnormal morphology of hyaloid vascular plexus

abnormal hindlimb digit 5 morphology
type: Class
subclass of: abnormal hindlimb digit 5
subclass of: abnormal hindlimb digit morphology
definition: Any unspecified morphological anomaly of the hindlimb digit 5, such as, for example, abnormal shape or colour.
has_exact_synonym: abnormal morphology of hindlimb digit 5

abnormal amphibian papilla morphology
type: Class
subclass of: abnormal amphibian papilla
subclass of: abnormal tissue morphology
definition: Any unspecified morphological anomaly of the amphibian papilla, such as, for example, abnormal shape or colour.
has_exact_synonym: abnormal morphology of amphibian papilla

abnormal dermal bone morphology
type: Class
subclass of: abnormal dermal bone
subclass of: abnormal membrane bone morphology
definition: Any unspecified morphological anomaly of the dermal bone, such as, for example, abnormal shape or colour.
has_exact_synonym: abnormal morphology of dermal bone

abnormal lateral amygdala morphology
type: Class
subclass of: abnormal lateral amygdala
subclass of: abnormal neural nucleus morphology
definition: Any unspecified morphological anomaly of the lateral amygdala, such as, for example, abnormal shape or colour.
has_exact_synonym: abnormal morphology of lateral amygdala

abnormal processus ascendens palatoquadrate morphology
type: Class
subclass of: abnormal processus ascendens palatoquadrate
subclass of: abnormal cartilage element morphology
definition: Any unspecified morphological anomaly of the processus ascendens palatoquadrate, such as, for example, abnormal shape or colour.
has_exact_synonym: abnormal morphology of processus ascendens palatoquadrate

abnormal duodenum morphology
type: Class
subclass of: abnormal duodenum
subclass of: abnormal multi-tissue structure morphology
definition: Any unspecified morphological anomaly of the duodenum, such as, for example, abnormal shape or colour.
has_exact_synonym: abnormal morphology of duodenum

abnormal iridophore morphology
type: Class
subclass of: abnormal iridophore
subclass of: abnormal pigment cell morphology
definition: Any unspecified morphological anomaly of the iridophore, such as, for example, abnormal shape or colour.
has_exact_synonym: abnormal morphology of iridophore

abnormal facies hyoidis of the palatoquadrate morphology
type: Class
subclass of: abnormal facies hyoidis of the palatoquadrate
subclass of: abnormal cartilage element morphology
definition: Any unspecified morphological anomaly of the facies hyoidis of the palatoquadrate, such as, for example, abnormal shape or colour.
has_exact_synonym: abnormal morphology of facies hyoidis of the palatoquadrate

abnormal m. transversus anterior morphology
type: Class
subclass of: abnormal m. transversus anterior
subclass of: abnormal branchial head muscle morphology
definition: Any unspecified morphological anomaly of the m. transversus anterior, such as, for example, abnormal shape or colour.
has_exact_synonym: abnormal morphology of m. transversus anterior

abnormal blastomere D2.1.1 morphology
type: Class
subclass of: abnormal blastomere D2.1.1
subclass of: abnormal dorsal vegetal hemisphere blastomere morphology
definition: Any unspecified morphological anomaly of the blastomere D2.1.1, such as, for example, abnormal shape or colour.
has_exact_synonym: abnormal morphology of blastomere D2.1.1

abnormal cementoblast morphology
type: Class
subclass of: abnormal cementoblast
subclass of: abnormal cell morphology
definition: Any unspecified morphological anomaly of the cementoblast, such as, for example, abnormal shape or colour.
has_exact_synonym: abnormal morphology of cementoblast

abnormal blastomere V1.2.1 morphology
type: Class
subclass of: abnormal blastomere V1.2.1
subclass of: abnormal ventral animal hemisphere blastomere morphology
definition: Any unspecified morphological anomaly of the blastomere V1.2.1, such as, for example, abnormal shape or colour.
has_exact_synonym: abnormal morphology of blastomere V1.2.1

abnormal oral epithelium morphology
type: Class
subclass of: abnormal oral epithelium
subclass of: abnormal epithelium morphology
definition: Any unspecified morphological anomaly of the oral epithelium, such as, for example, abnormal shape or colour.
has_exact_synonym: abnormal morphology of oral epithelium

abnormal pharyngeal epithelium morphology
type: Class
subclass of: abnormal pharyngeal epithelium
subclass of: abnormal unilaminar epithelium morphology
definition: Any unspecified morphological anomaly of the pharyngeal epithelium, such as, for example, abnormal shape or colour.
has_exact_synonym: abnormal morphology of pharyngeal epithelium

abnormal postcaval vein morphology
type: Class
subclass of: abnormal postcaval vein
subclass of: abnormal vein morphology
definition: Any unspecified morphological anomaly of the postcaval vein, such as, for example, abnormal shape or colour.
has_exact_synonym: abnormal morphology of postcaval vein

abnormal retinal outer nuclear layer morphology
type: Class
subclass of: abnormal retinal outer nuclear layer
subclass of: abnormal tissue morphology
definition: Any unspecified morphological anomaly of the retinal outer nuclear layer, such as, for example, abnormal shape or colour.
has_exact_synonym: abnormal morphology of retinal outer nuclear layer

abnormal left spleen primordium morphology
type: Class
subclass of: abnormal left spleen primordium
subclass of: abnormal multi-tissue structure morphology
definition: Any unspecified morphological anomaly of the left spleen primordium, such as, for example, abnormal shape or colour.
has_exact_synonym: abnormal morphology of left spleen primordium

abnormal barrier epithelial cell morphology
type: Class
subclass of: abnormal barrier epithelial cell
subclass of: abnormal cell morphology
definition: Any unspecified morphological anomaly of the barrier epithelial cell, such as, for example, abnormal shape or colour.
has_exact_synonym: abnormal morphology of barrier epithelial cell

abnormal olfactory pit morphology
type: Class
subclass of: abnormal olfactory pit
subclass of: abnormal anatomical space morphology
definition: Any unspecified morphological anomaly of the olfactory pit, such as, for example, abnormal shape or colour.
has_exact_synonym: abnormal morphology of olfactory pit

abnormal vagus nerve morphology
type: Class
subclass of: abnormal vagus nerve
subclass of: abnormal cranial nerve morphology
definition: Any unspecified morphological anomaly of the vagus nerve, such as, for example, abnormal shape or colour.
has_exact_synonym: abnormal morphology of vagus nerve

abnormal medial ganglionic eminence morphology
type: Class
subclass of: abnormal medial ganglionic eminence
subclass of: abnormal tissue morphology
definition: Any unspecified morphological anomaly of the medial ganglionic eminence, such as, for example, abnormal shape or colour.
has_exact_synonym: abnormal morphology of medial ganglionic eminence

abnormal posterior-proximal mesenchyme morphology
type: Class
subclass of: abnormal posterior-proximal mesenchyme
subclass of: abnormal mesenchyme morphology
definition: Any unspecified morphological anomaly of the posterior-proximal mesenchyme, such as, for example, abnormal shape or colour.
has_exact_synonym: abnormal morphology of posterior-proximal mesenchyme

abnormal rhombomere R1 morphology
type: Class
subclass of: abnormal rhombomere R1
subclass of: abnormal rhombomere morphology
definition: Any unspecified morphological anomaly of the rhombomere R1, such as, for example, abnormal shape or colour.
has_exact_synonym: abnormal morphology of rhombomere R1

abnormal myotome of trunk somite 10 morphology
type: Class
subclass of: abnormal myotome of trunk somite 10
subclass of: abnormal myotome morphology
definition: Any unspecified morphological anomaly of the myotome of trunk somite 10, such as, for example, abnormal shape or colour.
has_exact_synonym: abnormal morphology of myotome of trunk somite 10

abnormal lateral forebrain bundle morphology
type: Class
subclass of: abnormal lateral forebrain bundle
subclass of: abnormal anatomical cluster morphology
definition: Any unspecified morphological anomaly of the lateral forebrain bundle, such as, for example, abnormal shape or colour.
has_exact_synonym: abnormal morphology of lateral forebrain bundle

abnormal involuting marginal zone mesenchymal layer morphology
type: Class
subclass of: abnormal involuting marginal zone mesenchymal layer
subclass of: abnormal tissue morphology
definition: Any unspecified morphological anomaly of the involuting marginal zone mesenchymal layer, such as, for example, abnormal shape or colour.
has_exact_synonym: abnormal morphology of involuting marginal zone mesenchymal layer

abnormal trachea morphology
type: Class
subclass of: abnormal trachea
subclass of: abnormal cavitated compound organ morphology
definition: Any unspecified morphological anomaly of the trachea, such as, for example, abnormal shape or colour.
has_exact_synonym: abnormal morphology of trachea

abnormal myotome of trunk somite 5 morphology
type: Class
subclass of: abnormal myotome of trunk somite 5
subclass of: abnormal myotome morphology
definition: Any unspecified morphological anomaly of the myotome of trunk somite 5, such as, for example, abnormal shape or colour.
has_exact_synonym: abnormal morphology of myotome of trunk somite 5

abnormal saccular macula morphology
type: Class
subclass of: abnormal saccular macula
subclass of: abnormal tissue morphology
definition: Any unspecified morphological anomaly of the saccular macula, such as, for example, abnormal shape or colour.
has_exact_synonym: abnormal morphology of saccular macula

abnormal ascending interneuron morphology
type: Class
subclass of: abnormal ascending interneuron
subclass of: abnormal interneuron morphology
definition: Any unspecified morphological anomaly of the ascending interneuron, such as, for example, abnormal shape or colour.
has_exact_synonym: abnormal morphology of ascending interneuron

abnormal prosomere 6 morphology
type: Class
subclass of: abnormal prosomere 6
subclass of: abnormal prosomere morphology
definition: Any unspecified morphological anomaly of the prosomere 6, such as, for example, abnormal shape or colour.
has_exact_synonym: abnormal morphology of prosomere 6

abnormal hindlimb region morphology
type: Class
subclass of: abnormal hindlimb region
subclass of: XPO_0141316
definition: Any unspecified morphological anomaly of the hindlimb region, such as, for example, abnormal shape or colour.
has_exact_synonym: abnormal morphology of hindlimb region

abnormal perichordal tissue morphology
type: Class
subclass of: abnormal perichordal tissue
subclass of: abnormal connective tissue morphology
definition: Any unspecified morphological anomaly of the perichordal tissue, such as, for example, abnormal shape or colour.
has_exact_synonym: abnormal morphology of perichordal tissue

obsolete abnormal morphology of trunk region
type: Class
IAO_0000125: abnormal trunk morphology
deprecated: true

abnormal blastomere D2.1.2 morphology
type: Class
subclass of: abnormal blastomere D2.1.2
subclass of: abnormal dorsal vegetal hemisphere blastomere morphology
definition: Any unspecified morphological anomaly of the blastomere D2.1.2, such as, for example, abnormal shape or colour.
has_exact_synonym: abnormal morphology of blastomere D2.1.2

abnormal dorsal habenular nucleus morphology
type: Class
subclass of: abnormal dorsal habenular nucleus
subclass of: abnormal neural nucleus morphology
definition: Any unspecified morphological anomaly of the dorsal habenular nucleus, such as, for example, abnormal shape or colour.
has_exact_synonym: abnormal morphology of dorsal habenular nucleus

abnormal fourth ventricle morphology
type: Class
subclass of: abnormal fourth ventricle
subclass of: abnormal brain ventricle morphology
definition: Any unspecified morphological anomaly of the fourth ventricle, such as, for example, abnormal shape or colour.
has_exact_synonym: abnormal morphology of fourth ventricle

abnormal branchial arch skeleton 3 morphology
type: Class
subclass of: abnormal branchial arch skeleton 3
subclass of: abnormal branchial arch skeleton morphology
definition: Any unspecified morphological anomaly of the branchial arch skeleton 3, such as, for example, abnormal shape or colour.
has_exact_synonym: abnormal morphology of branchial arch skeleton 3

abnormal eminentia thalami morphology
type: Class
subclass of: abnormal eminentia thalami
subclass of: abnormal multi-tissue structure morphology
definition: Any unspecified morphological anomaly of the eminentia thalami, such as, for example, abnormal shape or colour.
has_exact_synonym: abnormal morphology of eminentia thalami

abnormal left omphalomesenteric vein morphology
type: Class
subclass of: abnormal left omphalomesenteric vein
subclass of: abnormal omphalomesenteric vein morphology
definition: Any unspecified morphological anomaly of the left omphalomesenteric vein, such as, for example, abnormal shape or colour.
has_exact_synonym: abnormal morphology of left omphalomesenteric vein

abnormal exocrine pancreas morphology
type: Class
subclass of: abnormal exocrine pancreas
subclass of: abnormal multi-tissue structure morphology
definition: Any unspecified morphological anomaly of the exocrine pancreas, such as, for example, abnormal shape or colour.
has_exact_synonym: abnormal morphology of exocrine pancreas

abnormal m. intermandibularis morphology
type: Class
subclass of: abnormal m. intermandibularis
subclass of: abnormal mandibular head muscle morphology
definition: Any unspecified morphological anomaly of the m. intermandibularis, such as, for example, abnormal shape or colour.
has_exact_synonym: abnormal morphology of m. intermandibularis

abnormal endothelial cell morphology
type: Class
subclass of: abnormal endothelial cell
subclass of: abnormal cell morphology
definition: Any unspecified morphological anomaly of the endothelial cell, such as, for example, abnormal shape or colour.
has_exact_synonym: abnormal morphology of endothelial cell

abnormal hyaloid artery morphology
type: Class
subclass of: abnormal hyaloid artery
subclass of: abnormal hyaloid blood vessel morphology
definition: Any unspecified morphological anomaly of the hyaloid artery, such as, for example, abnormal shape or colour.
has_exact_synonym: abnormal morphology of hyaloid artery

abnormal interstitial cell of Leydig morphology
type: Class
subclass of: abnormal interstitial cell of Leydig
subclass of: abnormal stromal cell morphology
definition: Any unspecified morphological anomaly of the interstitial cell of Leydig, such as, for example, abnormal shape or colour.
has_exact_synonym: abnormal morphology of interstitial cell of Leydig

abnormal musculoabdominal vein morphology
type: Class
subclass of: abnormal musculoabdominal vein
subclass of: abnormal vein morphology
definition: Any unspecified morphological anomaly of the musculoabdominal vein, such as, for example, abnormal shape or colour.
has_exact_synonym: abnormal morphology of musculoabdominal vein

abnormal vegetal cortex morphology
type: Class
subclass of: abnormal vegetal cortex
subclass of: abnormal cell part morphology
definition: Any unspecified morphological anomaly of the vegetal cortex, such as, for example, abnormal shape or colour.
has_exact_synonym: abnormal morphology of vegetal cortex

abnormal infraorbital lateral line morphology
type: Class
subclass of: abnormal infraorbital lateral line
subclass of: abnormal lateral line morphology
definition: Any unspecified morphological anomaly of the infraorbital lateral line, such as, for example, abnormal shape or colour.
has_exact_synonym: abnormal morphology of infraorbital lateral line

abnormal optic fiber layer morphology
type: Class
subclass of: abnormal optic fiber layer
subclass of: abnormal tissue morphology
definition: Any unspecified morphological anomaly of the optic fiber layer, such as, for example, abnormal shape or colour.
has_exact_synonym: abnormal morphology of optic fiber layer

abnormal larval intestinal epithelium morphology
type: Class
subclass of: abnormal larval intestinal epithelium
subclass of: abnormal simple columnar epithelium morphology
subclass of: abnormal gut epithelium morphology
definition: Any unspecified morphological anomaly of the larval intestinal epithelium, such as, for example, abnormal shape or colour.
has_exact_synonym: abnormal morphology of larval intestinal epithelium

abnormal morula cell morphology
type: Class
subclass of: abnormal morula cell
subclass of: abnormal early embryonic cell morphology
definition: Any unspecified morphological anomaly of the morula cell, such as, for example, abnormal shape or colour.
has_exact_synonym: abnormal morphology of morula cell

abnormal vestibular apparatus morphology
type: Class
subclass of: abnormal vestibular apparatus
subclass of: abnormal multi-tissue structure morphology
definition: Any unspecified morphological anomaly of the vestibular apparatus, such as, for example, abnormal shape or colour.
has_exact_synonym: abnormal morphology of vestibular apparatus

abnormal regenerating eye morphology
type: Class
subclass of: abnormal regenerating eye
subclass of: abnormal regenerating tissue morphology
definition: Any unspecified morphological anomaly of the regenerating eye, such as, for example, abnormal shape or colour.
has_exact_synonym: abnormal morphology of regenerating eye

abnormal nasociliary artery morphology
type: Class
subclass of: abnormal nasociliary artery
subclass of: abnormal artery morphology
definition: Any unspecified morphological anomaly of the nasociliary artery, such as, for example, abnormal shape or colour.
has_exact_synonym: abnormal morphology of nasociliary artery

abnormal floor plate morphology
type: Class
subclass of: abnormal floor plate
subclass of: abnormal multi-tissue structure morphology
definition: Any unspecified morphological anomaly of the floor plate, such as, for example, abnormal shape or colour.
has_exact_synonym: abnormal morphology of floor plate

abnormal facial vein morphology
type: Class
subclass of: abnormal facial vein
subclass of: abnormal vein morphology
definition: Any unspecified morphological anomaly of the facial vein, such as, for example, abnormal shape or colour.
has_exact_synonym: abnormal morphology of facial vein

abnormal seminiferous tubule morphology
type: Class
subclass of: abnormal seminiferous tubule
subclass of: abnormal tissue morphology
definition: Any unspecified morphological anomaly of the seminiferous tubule, such as, for example, abnormal shape or colour.
has_exact_synonym: abnormal morphology of seminiferous tubule

abnormal oxygen accumulating cell morphology
type: Class
subclass of: abnormal oxygen accumulating cell
subclass of: abnormal cell morphology
definition: Any unspecified morphological anomaly of the oxygen accumulating cell, such as, for example, abnormal shape or colour.
has_exact_synonym: abnormal morphology of oxygen accumulating cell

abnormal migratory neural crest cell morphology
type: Class
subclass of: abnormal migratory neural crest cell
subclass of: abnormal cell morphology
definition: Any unspecified morphological anomaly of the migratory neural crest cell, such as, for example, abnormal shape or colour.
has_exact_synonym: abnormal morphology of migratory neural crest cell

abnormal spike morphology
type: Class
subclass of: abnormal spike
subclass of: abnormal regenerating tissue morphology
definition: Any unspecified morphological anomaly of the spike, such as, for example, abnormal shape or colour.
has_exact_synonym: abnormal morphology of spike

abnormal iliac process morphology
type: Class
subclass of: abnormal iliac process
subclass of: abnormal process morphology
definition: Any unspecified morphological anomaly of the iliac process, such as, for example, abnormal shape or colour.
has_exact_synonym: abnormal morphology of iliac process

abnormal manicotto glandulare morphology
type: Class
subclass of: abnormal manicotto glandulare
subclass of: abnormal multi-tissue structure morphology
definition: Any unspecified morphological anomaly of the manicotto glandulare, such as, for example, abnormal shape or colour.
has_exact_synonym: abnormal morphology of manicotto glandulare

abnormal blastomere D1 morphology
type: Class
subclass of: abnormal blastomere D1
subclass of: abnormal blastomere morphology
definition: Any unspecified morphological anomaly of the blastomere D1, such as, for example, abnormal shape or colour.
has_exact_synonym: abnormal morphology of blastomere D1

abnormal mm. constrictores branchiales II morphology
type: Class
subclass of: abnormal mm. constrictores branchiales II
subclass of: abnormal branchial head muscle morphology
definition: Any unspecified morphological anomaly of the mm. constrictores branchiales II, such as, for example, abnormal shape or colour.
has_exact_synonym: abnormal morphology of mm. constrictores branchiales II

abnormal fibrocartilage morphology
type: Class
subclass of: abnormal fibrocartilage
subclass of: abnormal cartilage tissue morphology
definition: Any unspecified morphological anomaly of the fibrocartilage, such as, for example, abnormal shape or colour.
has_exact_synonym: abnormal morphology of fibrocartilage

abnormal ventral foregut morphology
type: Class
subclass of: abnormal ventral foregut
subclass of: abnormal embryonic structure morphology
definition: Any unspecified morphological anomaly of the ventral foregut, such as, for example, abnormal shape or colour.
has_exact_synonym: abnormal morphology of ventral foregut

abnormal chordoneural hinge morphology
type: Class
subclass of: abnormal chordoneural hinge
subclass of: abnormal tissue morphology
definition: Any unspecified morphological anomaly of the chordoneural hinge, such as, for example, abnormal shape or colour.
has_exact_synonym: abnormal morphology of chordoneural hinge

abnormal anterior semicircular canal morphology
type: Class
subclass of: abnormal anterior semicircular canal
subclass of: abnormal semicircular canal morphology
definition: Any unspecified morphological anomaly of the anterior semicircular canal, such as, for example, abnormal shape or colour.
has_exact_synonym: abnormal morphology of anterior semicircular canal

abnormal posterior tectum morphology
type: Class
subclass of: abnormal posterior tectum
subclass of: abnormal multi-tissue structure morphology
definition: Any unspecified morphological anomaly of the posterior tectum, such as, for example, abnormal shape or colour.
has_exact_synonym: abnormal morphology of posterior tectum

abnormal myotome of trunk somite 9 morphology
type: Class
subclass of: abnormal myotome of trunk somite 9
subclass of: abnormal myotome morphology
definition: Any unspecified morphological anomaly of the myotome of trunk somite 9, such as, for example, abnormal shape or colour.
has_exact_synonym: abnormal morphology of myotome of trunk somite 9

abnormal gall bladder morphology
type: Class
subclass of: abnormal gall bladder
subclass of: abnormal compound organ morphology
subclass of: abnormal viscus morphology
definition: Any unspecified morphological anomaly of the gall bladder, such as, for example, abnormal shape or colour.
has_exact_synonym: abnormal morphology of gall bladder

abnormal melanophore morphology
type: Class
subclass of: abnormal melanophore
subclass of: abnormal pigment cell morphology
definition: Any unspecified morphological anomaly of the melanophore, such as, for example, abnormal shape or colour.
has_exact_synonym: abnormal morphology of melanophore

abnormal wedge region morphology
type: Class
subclass of: abnormal wedge region
subclass of: abnormal cell part morphology
definition: Any unspecified morphological anomaly of the wedge region, such as, for example, abnormal shape or colour.
has_exact_synonym: abnormal morphology of wedge region

abnormal ciliary body morphology
type: Class
subclass of: abnormal ciliary body
subclass of: abnormal tissue morphology
definition: Any unspecified morphological anomaly of the ciliary body, such as, for example, abnormal shape or colour.
has_exact_synonym: abnormal morphology of ciliary body

abnormal sclerotome of trunk somite 4 morphology
type: Class
subclass of: abnormal sclerotome of trunk somite 4
subclass of: abnormal sclerotome morphology
definition: Any unspecified morphological anomaly of the sclerotome of trunk somite 4, such as, for example, abnormal shape or colour.
has_exact_synonym: abnormal morphology of sclerotome of trunk somite 4

abnormal sinus venosus morphology
type: Class
subclass of: abnormal sinus venosus
subclass of: abnormal multi-tissue structure morphology
definition: Any unspecified morphological anomaly of the sinus venosus, such as, for example, abnormal shape or colour.
has_exact_synonym: abnormal morphology of sinus venosus

abnormal dorsolateral neural tube morphology
type: Class
subclass of: abnormal dorsolateral neural tube
subclass of: abnormal embryonic structure morphology
definition: Any unspecified morphological anomaly of the dorsolateral neural tube, such as, for example, abnormal shape or colour.
has_exact_synonym: abnormal morphology of dorsolateral neural tube

abnormal parotic crest morphology
type: Class
subclass of: abnormal parotic crest
subclass of: abnormal cartilage element morphology
definition: Any unspecified morphological anomaly of the parotic crest, such as, for example, abnormal shape or colour.
has_exact_synonym: abnormal morphology of parotic crest

abnormal m. geniohyoideus morphology
type: Class
subclass of: abnormal m. geniohyoideus
subclass of: abnormal hypobranchial head muscle morphology
definition: Any unspecified morphological anomaly of the m. geniohyoideus, such as, for example, abnormal shape or colour.
has_exact_synonym: abnormal morphology of m. geniohyoideus

abnormal apical epithelial cap morphology
type: Class
subclass of: abnormal apical epithelial cap
subclass of: abnormal regenerating tissue morphology
definition: Any unspecified morphological anomaly of the apical epithelial cap, such as, for example, abnormal shape or colour.
has_exact_synonym: abnormal morphology of apical epithelial cap

abnormal vegetal part, early involuting morphology
type: Class
subclass of: abnormal vegetal part, early involuting
subclass of: abnormal tissue morphology
definition: Any unspecified morphological anomaly of the vegetal part, early involuting, such as, for example, abnormal shape or colour.
has_exact_synonym: abnormal morphology of vegetal part, early involuting

abnormal non-mineralized avascular GAG-rich matrix morphology
type: Class
subclass of: abnormal non-mineralized avascular GAG-rich matrix
subclass of: abnormal avascular GAG-rich matrix morphology
definition: Any unspecified morphological anomaly of the non-mineralized avascular GAG-rich matrix, such as, for example, abnormal shape or colour.
has_exact_synonym: abnormal morphology of non-mineralized avascular GAG-rich matrix

abnormal regenerating zeugopod skeleton morphology
type: Class
subclass of: abnormal regenerating zeugopod skeleton
subclass of: abnormal regenerating tissue morphology
definition: Any unspecified morphological anomaly of the regenerating zeugopod skeleton, such as, for example, abnormal shape or colour.
has_exact_synonym: abnormal morphology of regenerating zeugopod skeleton

abnormal spiral septum morphology
type: Class
subclass of: abnormal spiral septum
subclass of: XPO_0141720
definition: Any unspecified morphological anomaly of the spiral septum, such as, for example, abnormal shape or colour.
has_exact_synonym: abnormal morphology of spiral septum

abnormal neural groove morphology
type: Class
subclass of: abnormal neural groove
subclass of: abnormal tissue morphology
definition: Any unspecified morphological anomaly of the neural groove, such as, for example, abnormal shape or colour.
has_exact_synonym: abnormal morphology of neural groove

abnormal oropharyngeal papilla morphology
type: Class
subclass of: abnormal oropharyngeal papilla
subclass of: abnormal odontogenic papilla morphology
definition: Any unspecified morphological anomaly of the oropharyngeal papilla, such as, for example, abnormal shape or colour.
has_exact_synonym: abnormal morphology of oropharyngeal papilla

abnormal basal lamina morphology
type: Class
subclass of: abnormal basal lamina
subclass of: abnormal acellular anatomical structure morphology
definition: Any unspecified morphological anomaly of the basal lamina, such as, for example, abnormal shape or colour.
has_exact_synonym: abnormal morphology of basal lamina

abnormal m. interhyoideus morphology
type: Class
subclass of: abnormal m. interhyoideus
subclass of: abnormal hyoid head muscle morphology
definition: Any unspecified morphological anomaly of the m. interhyoideus, such as, for example, abnormal shape or colour.
has_exact_synonym: abnormal morphology of m. interhyoideus

abnormal ring structure morphology
type: Class
subclass of: abnormal ring structure
subclass of: abnormal cell part morphology
definition: Any unspecified morphological anomaly of the ring structure, such as, for example, abnormal shape or colour.
has_exact_synonym: abnormal morphology of ring structure

abnormal cleavage furrow morphology
type: Class
subclass of: abnormal cleavage furrow
subclass of: abnormal embryonic structure morphology
definition: Any unspecified morphological anomaly of the cleavage furrow, such as, for example, abnormal shape or colour.
has_exact_synonym: abnormal morphology of cleavage furrow

abnormal enamel morphology
type: Class
subclass of: abnormal enamel
subclass of: abnormal odontoid tissue morphology
definition: Any unspecified morphological anomaly of the enamel, such as, for example, abnormal shape or colour.
has_exact_synonym: abnormal morphology of enamel

abnormal nucleus of the diagonal band morphology
type: Class
subclass of: abnormal nucleus of the diagonal band
subclass of: abnormal neural nucleus morphology
definition: Any unspecified morphological anomaly of the nucleus of the diagonal band, such as, for example, abnormal shape or colour.
has_exact_synonym: abnormal morphology of nucleus of the diagonal band

abnormal perivitelline space morphology
type: Class
subclass of: abnormal perivitelline space
subclass of: abnormal extraembryonic structure morphology
definition: Any unspecified morphological anomaly of the perivitelline space, such as, for example, abnormal shape or colour.
has_exact_synonym: abnormal morphology of perivitelline space

abnormal ceratobranchial IV morphology
type: Class
subclass of: abnormal ceratobranchial IV
subclass of: abnormal cartilage element morphology
definition: Any unspecified morphological anomaly of the ceratobranchial IV, such as, for example, abnormal shape or colour.
has_exact_synonym: abnormal morphology of ceratobranchial IV

abnormal marginal zone (sensu neural) morphology
type: Class
subclass of: abnormal marginal zone (sensu neural)
subclass of: XPO_0141316
definition: Any unspecified morphological anomaly of the marginal zone (sensu neural), such as, for example, abnormal shape or colour.
has_exact_synonym: abnormal morphology of marginal zone (sensu neural)

abnormal claw of hindlimb digit 4 morphology
type: Class
subclass of: abnormal claw of hindlimb digit 4
subclass of: abnormal claw morphology
definition: Any unspecified morphological anomaly of the claw of hindlimb digit 4, such as, for example, abnormal shape or colour.
has_exact_synonym: abnormal morphology of claw of hindlimb digit 4

abnormal animal cap outer layer morphology
type: Class
subclass of: abnormal animal cap outer layer
subclass of: abnormal tissue morphology
definition: Any unspecified morphological anomaly of the animal cap outer layer, such as, for example, abnormal shape or colour.
has_exact_synonym: abnormal morphology of animal cap outer layer

abnormal myotome of head somite 3 morphology
type: Class
subclass of: abnormal myotome of head somite 3
subclass of: abnormal myotome morphology
definition: Any unspecified morphological anomaly of the myotome of head somite 3, such as, for example, abnormal shape or colour.
has_exact_synonym: abnormal morphology of myotome of head somite 3

abnormal cornea morphology
type: Class
subclass of: abnormal cornea
subclass of: abnormal surface structure morphology
definition: Any unspecified morphological anomaly of the cornea, such as, for example, abnormal shape or colour.
has_exact_synonym: abnormal morphology of cornea

abnormal podocyte morphology
type: Class
subclass of: abnormal podocyte
subclass of: abnormal cell morphology
definition: Any unspecified morphological anomaly of the podocyte, such as, for example, abnormal shape or colour.
has_exact_synonym: abnormal morphology of podocyte

abnormal m. levator scapulae superior morphology
type: Class
subclass of: abnormal m. levator scapulae superior
subclass of: abnormal cranial muscle morphology
definition: Any unspecified morphological anomaly of the m. levator scapulae superior, such as, for example, abnormal shape or colour.
has_exact_synonym: abnormal morphology of m. levator scapulae superior

abnormal median fin morphology
type: Class
subclass of: abnormal median fin
subclass of: abnormal fin morphology
definition: Any unspecified morphological anomaly of the median fin, such as, for example, abnormal shape or colour.
has_exact_synonym: abnormal morphology of median fin

abnormal magnocellular preoptic nucleus morphology
type: Class
subclass of: abnormal magnocellular preoptic nucleus
subclass of: abnormal neural nucleus morphology
definition: Any unspecified morphological anomaly of the magnocellular preoptic nucleus, such as, for example, abnormal shape or colour.
has_exact_synonym: abnormal morphology of magnocellular preoptic nucleus

abnormal oculomotor nerve morphology
type: Class
subclass of: abnormal oculomotor nerve
subclass of: abnormal cranial nerve morphology
definition: Any unspecified morphological anomaly of the oculomotor nerve, such as, for example, abnormal shape or colour.
has_exact_synonym: abnormal morphology of oculomotor nerve

abnormal myotome of tail somite 15 morphology
type: Class
subclass of: abnormal myotome of tail somite 15
subclass of: abnormal myotome morphology
definition: Any unspecified morphological anomaly of the myotome of tail somite 15, such as, for example, abnormal shape or colour.
has_exact_synonym: abnormal morphology of myotome of tail somite 15

abnormal posterodorsal tegmental nucleus morphology
type: Class
subclass of: abnormal posterodorsal tegmental nucleus
subclass of: abnormal neural nucleus morphology
definition: Any unspecified morphological anomaly of the posterodorsal tegmental nucleus, such as, for example, abnormal shape or colour.
has_exact_synonym: abnormal morphology of posterodorsal tegmental nucleus

abnormal coelomic epithelium morphology
type: Class
subclass of: abnormal coelomic epithelium
subclass of: abnormal epithelium morphology
definition: Any unspecified morphological anomaly of the coelomic epithelium, such as, for example, abnormal shape or colour.
has_exact_synonym: abnormal morphology of coelomic epithelium

abnormal medial amygdala morphology
type: Class
subclass of: abnormal medial amygdala
subclass of: abnormal neural nucleus morphology
definition: Any unspecified morphological anomaly of the medial amygdala, such as, for example, abnormal shape or colour.
has_exact_synonym: abnormal morphology of medial amygdala

abnormal dorsal funiculus morphology
type: Class
subclass of: abnormal dorsal funiculus
subclass of: abnormal anatomical cluster morphology
definition: Any unspecified morphological anomaly of the dorsal funiculus, such as, for example, abnormal shape or colour.
has_exact_synonym: abnormal morphology of dorsal funiculus

abnormal ampullary nerve morphology
type: Class
subclass of: abnormal ampullary nerve
subclass of: abnormal nerve morphology
definition: Any unspecified morphological anomaly of the ampullary nerve, such as, for example, abnormal shape or colour.
has_exact_synonym: abnormal morphology of ampullary nerve

abnormal processus anterior hyalis morphology
type: Class
subclass of: abnormal processus anterior hyalis
subclass of: abnormal cartilage element morphology
definition: Any unspecified morphological anomaly of the processus anterior hyalis, such as, for example, abnormal shape or colour.
has_exact_synonym: abnormal morphology of processus anterior hyalis

abnormal glomerular mesangial cell morphology
type: Class
subclass of: abnormal glomerular mesangial cell
subclass of: abnormal pericyte morphology
definition: Any unspecified morphological anomaly of the glomerular mesangial cell, such as, for example, abnormal shape or colour.
has_exact_synonym: abnormal morphology of glomerular mesangial cell

abnormal myotome of trunk somite 13 morphology
type: Class
subclass of: abnormal myotome of trunk somite 13
subclass of: abnormal myotome morphology
definition: Any unspecified morphological anomaly of the myotome of trunk somite 13, such as, for example, abnormal shape or colour.
has_exact_synonym: abnormal morphology of myotome of trunk somite 13

abnormal ischiadic artery morphology
type: Class
subclass of: abnormal ischiadic artery
subclass of: abnormal artery morphology
definition: Any unspecified morphological anomaly of the ischiadic artery, such as, for example, abnormal shape or colour.
has_exact_synonym: abnormal morphology of ischiadic artery

abnormal dorsal crest of the endoderm morphology
type: Class
subclass of: abnormal dorsal crest of the endoderm
subclass of: abnormal tissue morphology
definition: Any unspecified morphological anomaly of the dorsal crest of the endoderm, such as, for example, abnormal shape or colour.
has_exact_synonym: abnormal morphology of dorsal crest of the endoderm

abnormal paracrine cell morphology
type: Class
subclass of: abnormal paracrine cell
subclass of: abnormal cell morphology
definition: Any unspecified morphological anomaly of the paracrine cell, such as, for example, abnormal shape or colour.
has_exact_synonym: abnormal morphology of paracrine cell

abnormal ventrolateral edge of myotome morphology
type: Class
subclass of: abnormal ventrolateral edge of myotome
subclass of: abnormal tissue morphology
definition: Any unspecified morphological anomaly of the ventrolateral edge of myotome, such as, for example, abnormal shape or colour.
has_exact_synonym: abnormal morphology of ventrolateral edge of myotome

abnormal left-right organizer morphology
type: Class
subclass of: abnormal left-right organizer
subclass of: XPO_0141316
definition: Any unspecified morphological anomaly of the left-right organizer, such as, for example, abnormal shape or colour.
has_exact_synonym: abnormal morphology of left-right organizer

abnormal tarsus morphology
type: Class
subclass of: abnormal tarsus
subclass of: abnormal bone element morphology
definition: Any unspecified morphological anomaly of the tarsus, such as, for example, abnormal shape or colour.
has_exact_synonym: abnormal morphology of tarsus

abnormal interdigital webbing morphology
type: Class
subclass of: abnormal interdigital webbing
subclass of: abnormal tissue morphology
definition: Any unspecified morphological anomaly of the interdigital webbing, such as, for example, abnormal shape or colour.
has_exact_synonym: abnormal morphology of interdigital webbing

abnormal rhombomere R8 morphology
type: Class
subclass of: abnormal rhombomere R8
subclass of: abnormal rhombomere morphology
definition: Any unspecified morphological anomaly of the rhombomere R8, such as, for example, abnormal shape or colour.
has_exact_synonym: abnormal morphology of rhombomere R8

abnormal subthalamic nucleus morphology
type: Class
subclass of: abnormal subthalamic nucleus
subclass of: abnormal neural nucleus morphology
definition: Any unspecified morphological anomaly of the subthalamic nucleus, such as, for example, abnormal shape or colour.
has_exact_synonym: abnormal morphology of subthalamic nucleus

abnormal forebrain-midbrain boundary morphology
type: Class
subclass of: abnormal forebrain-midbrain boundary
subclass of: abnormal anatomical line morphology
definition: Any unspecified morphological anomaly of the forebrain-midbrain boundary, such as, for example, abnormal shape or colour.
has_exact_synonym: abnormal morphology of forebrain-midbrain boundary

abnormal sclerotome of trunk somite 10 morphology
type: Class
subclass of: abnormal sclerotome of trunk somite 10
subclass of: abnormal sclerotome morphology
definition: Any unspecified morphological anomaly of the sclerotome of trunk somite 10, such as, for example, abnormal shape or colour.
has_exact_synonym: abnormal morphology of sclerotome of trunk somite 10

abnormal transverse process morphology
type: Class
subclass of: abnormal transverse process
subclass of: abnormal process morphology
definition: Any unspecified morphological anomaly of the transverse process, such as, for example, abnormal shape or colour.
has_exact_synonym: abnormal morphology of transverse process

abnormal m. quadrato-hyoangularis morphology
type: Class
subclass of: abnormal m. quadrato-hyoangularis
subclass of: abnormal hyoid head muscle morphology
definition: Any unspecified morphological anomaly of the m. quadrato-hyoangularis, such as, for example, abnormal shape or colour.
has_exact_synonym: abnormal morphology of m. quadrato-hyoangularis

abnormal myelin accumulating cell morphology
type: Class
subclass of: abnormal myelin accumulating cell
subclass of: abnormal cell morphology
definition: Any unspecified morphological anomaly of the myelin accumulating cell, such as, for example, abnormal shape or colour.
has_exact_synonym: abnormal morphology of myelin accumulating cell

abnormal pericardial muscle morphology
type: Class
subclass of: abnormal pericardial muscle
subclass of: abnormal muscle morphology
definition: Any unspecified morphological anomaly of the pericardial muscle, such as, for example, abnormal shape or colour.
has_exact_synonym: abnormal morphology of pericardial muscle

abnormal myeloid cell morphology
type: Class
subclass of: abnormal myeloid cell
subclass of: abnormal cell morphology
definition: Any unspecified morphological anomaly of the myeloid cell, such as, for example, abnormal shape or colour.
has_exact_synonym: abnormal morphology of myeloid cell

abnormal dorsal lymph space morphology
type: Class
subclass of: abnormal dorsal lymph space
subclass of: abnormal anatomical space morphology
definition: Any unspecified morphological anomaly of the dorsal lymph space, such as, for example, abnormal shape or colour.
has_exact_synonym: abnormal morphology of dorsal lymph space

abnormal blastomere V1.1.1 morphology
type: Class
subclass of: abnormal blastomere V1.1.1
subclass of: abnormal ventral animal hemisphere blastomere morphology
definition: Any unspecified morphological anomaly of the blastomere V1.1.1, such as, for example, abnormal shape or colour.
has_exact_synonym: abnormal morphology of blastomere V1.1.1

abnormal ceratobranchial I morphology
type: Class
subclass of: abnormal ceratobranchial I
subclass of: abnormal cartilage element morphology
definition: Any unspecified morphological anomaly of the ceratobranchial I, such as, for example, abnormal shape or colour.
has_exact_synonym: abnormal morphology of ceratobranchial I

abnormal amacrine cell morphology
type: Class
subclass of: abnormal amacrine cell
subclass of: abnormal interneuron morphology
definition: Any unspecified morphological anomaly of the amacrine cell, such as, for example, abnormal shape or colour.
has_exact_synonym: abnormal morphology of amacrine cell

abnormal m. orbitohyoideus morphology
type: Class
subclass of: abnormal m. orbitohyoideus
subclass of: abnormal hyoid head muscle morphology
definition: Any unspecified morphological anomaly of the m. orbitohyoideus, such as, for example, abnormal shape or colour.
has_exact_synonym: abnormal morphology of m. orbitohyoideus

abnormal capillary system of liver morphology
type: Class
subclass of: abnormal capillary system of liver
subclass of: abnormal capillary morphology
definition: Any unspecified morphological anomaly of the capillary system of liver, such as, for example, abnormal shape or colour.
has_exact_synonym: abnormal morphology of capillary system of liver

abnormal jaw muscle morphology
type: Class
subclass of: abnormal jaw muscle
subclass of: abnormal cranial muscle morphology
definition: Any unspecified morphological anomaly of the jaw muscle, such as, for example, abnormal shape or colour.
has_exact_synonym: abnormal morphology of jaw muscle

abnormal vestibulocochlear ganglion morphology
type: Class
subclass of: abnormal vestibulocochlear ganglion
subclass of: abnormal ganglion morphology
definition: Any unspecified morphological anomaly of the vestibulocochlear ganglion, such as, for example, abnormal shape or colour.
has_exact_synonym: abnormal morphology of vestibulocochlear ganglion

abnormal arteria iliaca communis morphology
type: Class
subclass of: abnormal arteria iliaca communis
subclass of: abnormal artery morphology
definition: Any unspecified morphological anomaly of the arteria iliaca communis, such as, for example, abnormal shape or colour.
has_exact_synonym: abnormal morphology of arteria iliaca communis

abnormal fibrocellular pad morphology
type: Class
subclass of: abnormal fibrocellular pad
subclass of: abnormal regenerating tissue morphology
definition: Any unspecified morphological anomaly of the fibrocellular pad, such as, for example, abnormal shape or colour.
has_exact_synonym: abnormal morphology of fibrocellular pad

abnormal sperm entry point morphology
type: Class
subclass of: abnormal sperm entry point
subclass of: abnormal cell part morphology
definition: Any unspecified morphological anomaly of the sperm entry point, such as, for example, abnormal shape or colour.
has_exact_synonym: abnormal morphology of sperm entry point

abnormal outer fin morphology
type: Class
subclass of: abnormal outer fin
subclass of: abnormal tissue morphology
definition: Any unspecified morphological anomaly of the outer fin, such as, for example, abnormal shape or colour.
has_exact_synonym: abnormal morphology of outer fin

abnormal right-ventral blastomere morphology
type: Class
subclass of: abnormal right-ventral blastomere
subclass of: abnormal blastomere morphology
definition: Any unspecified morphological anomaly of the right-ventral blastomere, such as, for example, abnormal shape or colour.
has_exact_synonym: abnormal morphology of right-ventral blastomere

abnormal oral cavity morphology
type: Class
subclass of: abnormal oral cavity
subclass of: abnormal anatomical space morphology
definition: Any unspecified morphological anomaly of the oral cavity, such as, for example, abnormal shape or colour.
has_exact_synonym: abnormal morphology of oral cavity

abnormal sclerotome of tail somite 16 morphology
type: Class
subclass of: abnormal sclerotome of tail somite 16
subclass of: abnormal sclerotome morphology
definition: Any unspecified morphological anomaly of the sclerotome of tail somite 16, such as, for example, abnormal shape or colour.
has_exact_synonym: abnormal morphology of sclerotome of tail somite 16

abnormal secondary myofiber morphology
type: Class
subclass of: abnormal secondary myofiber
subclass of: abnormal cell morphology
definition: Any unspecified morphological anomaly of the secondary myofiber, such as, for example, abnormal shape or colour.
has_exact_synonym: abnormal morphology of secondary myofiber

abnormal alkali secreting cell morphology
type: Class
subclass of: abnormal alkali secreting cell
subclass of: abnormal cell morphology
definition: Any unspecified morphological anomaly of the alkali secreting cell, such as, for example, abnormal shape or colour.
has_exact_synonym: abnormal morphology of alkali secreting cell

abnormal stage I oocyte morphology
type: Class
subclass of: abnormal stage I oocyte
subclass of: abnormal oocyte morphology
definition: Any unspecified morphological anomaly of the stage I oocyte, such as, for example, abnormal shape or colour.
has_exact_synonym: abnormal morphology of stage I oocyte

abnormal medial nasal prominence morphology
type: Class
subclass of: abnormal medial nasal prominence
subclass of: abnormal embryonic structure morphology
definition: Any unspecified morphological anomaly of the medial nasal prominence, such as, for example, abnormal shape or colour.
has_exact_synonym: abnormal morphology of medial nasal prominence

abnormal anterior amygdala morphology
type: Class
subclass of: abnormal anterior amygdala
subclass of: abnormal neural nucleus morphology
definition: Any unspecified morphological anomaly of the anterior amygdala, such as, for example, abnormal shape or colour.
has_exact_synonym: abnormal morphology of anterior amygdala

abnormal rectum morphology
type: Class
subclass of: abnormal rectum
subclass of: abnormal multi-tissue structure morphology
definition: Any unspecified morphological anomaly of the rectum, such as, for example, abnormal shape or colour.
has_exact_synonym: abnormal morphology of rectum

abnormal zygote cortex morphology
type: Class
subclass of: abnormal zygote cortex
subclass of: abnormal cell part morphology
definition: Any unspecified morphological anomaly of the zygote cortex, such as, for example, abnormal shape or colour.
has_exact_synonym: abnormal morphology of zygote cortex

abnormal pars media of the stapes morphology
type: Class
subclass of: abnormal pars media of the stapes
subclass of: abnormal bone element morphology
definition: Any unspecified morphological anomaly of the pars media of the stapes, such as, for example, abnormal shape or colour.
has_exact_synonym: abnormal morphology of pars media of the stapes

abnormal aortic arch 5 morphology
type: Class
subclass of: abnormal aortic arch 5
subclass of: abnormal aortic arch morphology
definition: Any unspecified morphological anomaly of the aortic arch 5, such as, for example, abnormal shape or colour.
has_exact_synonym: abnormal morphology of aortic arch 5

abnormal ventral septum morphology
type: Class
subclass of: abnormal ventral septum
subclass of: XPO_0141720
definition: Any unspecified morphological anomaly of the ventral septum, such as, for example, abnormal shape or colour.
has_exact_synonym: abnormal morphology of ventral septum

abnormal vegetal endoderm morphology
type: Class
subclass of: abnormal vegetal endoderm
subclass of: abnormal embryonic structure morphology
definition: Any unspecified morphological anomaly of the vegetal endoderm, such as, for example, abnormal shape or colour.
has_exact_synonym: abnormal morphology of vegetal endoderm

abnormal ventral fin vasculature morphology
type: Class
subclass of: abnormal ventral fin vasculature
subclass of: abnormal blood vessel morphology
definition: Any unspecified morphological anomaly of the ventral fin vasculature, such as, for example, abnormal shape or colour.
has_exact_synonym: abnormal morphology of ventral fin vasculature

abnormal lens fiber cell mass morphology
type: Class
subclass of: abnormal lens fiber cell mass
subclass of: abnormal tissue morphology
definition: Any unspecified morphological anomaly of the lens fiber cell mass, such as, for example, abnormal shape or colour.
has_exact_synonym: abnormal morphology of lens fiber cell mass

abnormal urostyle morphology
type: Class
subclass of: abnormal urostyle
subclass of: abnormal bone element morphology
definition: Any unspecified morphological anomaly of the urostyle, such as, for example, abnormal shape or colour.
has_exact_synonym: abnormal morphology of urostyle

abnormal stage V oocyte morphology
type: Class
subclass of: abnormal stage V oocyte
subclass of: abnormal oocyte morphology
definition: Any unspecified morphological anomaly of the stage V oocyte, such as, for example, abnormal shape or colour.
has_exact_synonym: abnormal morphology of stage V oocyte

abnormal skeletal muscle satellite cell morphology
type: Class
subclass of: abnormal skeletal muscle satellite cell
subclass of: abnormal cell morphology
definition: Any unspecified morphological anomaly of the skeletal muscle satellite cell, such as, for example, abnormal shape or colour.
has_exact_synonym: abnormal morphology of skeletal muscle satellite cell

abnormal sclerotome of tail somite 18 morphology
type: Class
subclass of: abnormal sclerotome of tail somite 18
subclass of: abnormal sclerotome morphology
definition: Any unspecified morphological anomaly of the sclerotome of tail somite 18, such as, for example, abnormal shape or colour.
has_exact_synonym: abnormal morphology of sclerotome of tail somite 18

abnormal nostril morphology
type: Class
subclass of: abnormal nostril
subclass of: abnormal anatomical space morphology
definition: Any unspecified morphological anomaly of the nostril, such as, for example, abnormal shape or colour.
has_exact_synonym: abnormal morphology of nostril

abnormal bone marrow morphology
type: Class
subclass of: abnormal bone marrow
subclass of: abnormal tissue morphology
definition: Any unspecified morphological anomaly of the bone marrow, such as, for example, abnormal shape or colour.
has_exact_synonym: abnormal morphology of bone marrow

abnormal descending interneuron morphology
type: Class
subclass of: abnormal descending interneuron
subclass of: abnormal interneuron morphology
definition: Any unspecified morphological anomaly of the descending interneuron, such as, for example, abnormal shape or colour.
has_exact_synonym: abnormal morphology of descending interneuron

abnormal epigastric artery morphology
type: Class
subclass of: abnormal epigastric artery
subclass of: abnormal artery morphology
definition: Any unspecified morphological anomaly of the epigastric artery, such as, for example, abnormal shape or colour.
has_exact_synonym: abnormal morphology of epigastric artery

abnormal sclerotome of trunk somite 8 morphology
type: Class
subclass of: abnormal sclerotome of trunk somite 8
subclass of: abnormal sclerotome morphology
definition: Any unspecified morphological anomaly of the sclerotome of trunk somite 8, such as, for example, abnormal shape or colour.
has_exact_synonym: abnormal morphology of sclerotome of trunk somite 8

abnormal mesonephric late proximal tubule morphology
type: Class
subclass of: abnormal mesonephric late proximal tubule
subclass of: abnormal mesonephric tubule morphology
definition: Any unspecified morphological anomaly of the mesonephric late proximal tubule, such as, for example, abnormal shape or colour.
has_exact_synonym: abnormal morphology of mesonephric late proximal tubule

abnormal ectodermal cell morphology
type: Class
subclass of: abnormal ectodermal cell
subclass of: abnormal cell morphology
definition: Any unspecified morphological anomaly of the ectodermal cell, such as, for example, abnormal shape or colour.
has_exact_synonym: abnormal morphology of ectodermal cell

abnormal atrial septum morphology
type: Class
subclass of: abnormal atrial septum
subclass of: XPO_0141720
definition: Any unspecified morphological anomaly of the atrial septum, such as, for example, abnormal shape or colour.
has_exact_synonym: abnormal morphology of atrial septum

abnormal fat body morphology
type: Class
subclass of: abnormal fat body
subclass of: abnormal adipose tissue morphology
definition: Any unspecified morphological anomaly of the fat body, such as, for example, abnormal shape or colour.
has_exact_synonym: abnormal morphology of fat body

abnormal blastomere D1.2.1 morphology
type: Class
subclass of: abnormal blastomere D1.2.1
subclass of: abnormal dorsal animal hemisphere blastomere morphology
definition: Any unspecified morphological anomaly of the blastomere D1.2.1, such as, for example, abnormal shape or colour.
has_exact_synonym: abnormal morphology of blastomere D1.2.1

abnormal torus semicircularis morphology
type: Class
subclass of: abnormal torus semicircularis
subclass of: abnormal multi-tissue structure morphology
definition: Any unspecified morphological anomaly of the torus semicircularis, such as, for example, abnormal shape or colour.
has_exact_synonym: abnormal morphology of torus semicircularis

abnormal subcommissural organ morphology
type: Class
subclass of: abnormal subcommissural organ
subclass of: abnormal multi-tissue structure morphology
definition: Any unspecified morphological anomaly of the subcommissural organ, such as, for example, abnormal shape or colour.
has_exact_synonym: abnormal morphology of subcommissural organ

abnormal ciliary axoneme morphology
type: Class
subclass of: abnormal ciliary axoneme
subclass of: abnormal cell part morphology
definition: Any unspecified morphological anomaly of the ciliary axoneme, such as, for example, abnormal shape or colour.
has_exact_synonym: abnormal morphology of ciliary axoneme

abnormal stage II oocyte morphology
type: Class
subclass of: abnormal stage II oocyte
subclass of: abnormal oocyte morphology
definition: Any unspecified morphological anomaly of the stage II oocyte, such as, for example, abnormal shape or colour.
has_exact_synonym: abnormal morphology of stage II oocyte

abnormal anterior-proximal mesenchyme morphology
type: Class
subclass of: abnormal anterior-proximal mesenchyme
subclass of: abnormal mesenchyme morphology
definition: Any unspecified morphological anomaly of the anterior-proximal mesenchyme, such as, for example, abnormal shape or colour.
has_exact_synonym: abnormal morphology of anterior-proximal mesenchyme

abnormal endodermal cell morphology
type: Class
subclass of: abnormal endodermal cell
subclass of: abnormal cell morphology
definition: Any unspecified morphological anomaly of the endodermal cell, such as, for example, abnormal shape or colour.
has_exact_synonym: abnormal morphology of endodermal cell

abnormal parabrachial area morphology
type: Class
subclass of: abnormal parabrachial area
subclass of: abnormal neural nucleus morphology
definition: Any unspecified morphological anomaly of the parabrachial area, such as, for example, abnormal shape or colour.
has_exact_synonym: abnormal morphology of parabrachial area

abnormal sclerotome of trunk somite 12 morphology
type: Class
subclass of: abnormal sclerotome of trunk somite 12
subclass of: abnormal sclerotome morphology
definition: Any unspecified morphological anomaly of the sclerotome of trunk somite 12, such as, for example, abnormal shape or colour.
has_exact_synonym: abnormal morphology of sclerotome of trunk somite 12

abnormal organ cortex morphology
type: Class
subclass of: abnormal organ cortex
subclass of: abnormal multi-tissue structure morphology
definition: Any unspecified morphological anomaly of the organ cortex, such as, for example, abnormal shape or colour.
has_exact_synonym: abnormal morphology of organ cortex

abnormal blastomere D2.2.1 morphology
type: Class
subclass of: abnormal blastomere D2.2.1
subclass of: abnormal dorsal vegetal hemisphere blastomere morphology
definition: Any unspecified morphological anomaly of the blastomere D2.2.1, such as, for example, abnormal shape or colour.
has_exact_synonym: abnormal morphology of blastomere D2.2.1

abnormal processus posterior hyalis morphology
type: Class
subclass of: abnormal processus posterior hyalis
subclass of: abnormal cartilage element morphology
definition: Any unspecified morphological anomaly of the processus posterior hyalis, such as, for example, abnormal shape or colour.
has_exact_synonym: abnormal morphology of processus posterior hyalis

abnormal upper jaw morphology
type: Class
subclass of: abnormal upper jaw
subclass of: abnormal anatomical cluster morphology
definition: Any unspecified morphological anomaly of the upper jaw, such as, for example, abnormal shape or colour.
has_exact_synonym: abnormal morphology of upper jaw

abnormal femoral vein morphology
type: Class
subclass of: abnormal femoral vein
subclass of: abnormal vein morphology
definition: Any unspecified morphological anomaly of the femoral vein, such as, for example, abnormal shape or colour.
has_exact_synonym: abnormal morphology of femoral vein

abnormal endolymphatic duct morphology
type: Class
subclass of: abnormal endolymphatic duct
subclass of: abnormal duct morphology
definition: Any unspecified morphological anomaly of the endolymphatic duct, such as, for example, abnormal shape or colour.
has_exact_synonym: abnormal morphology of endolymphatic duct

abnormal optic nerve morphology
type: Class
subclass of: abnormal optic nerve
subclass of: abnormal cranial nerve morphology
definition: Any unspecified morphological anomaly of the optic nerve, such as, for example, abnormal shape or colour.
has_exact_synonym: abnormal morphology of optic nerve

abnormal myocoelic slit morphology
type: Class
subclass of: abnormal myocoelic slit
subclass of: abnormal anatomical space morphology
definition: Any unspecified morphological anomaly of the myocoelic slit, such as, for example, abnormal shape or colour.
has_exact_synonym: abnormal morphology of myocoelic slit

abnormal lateral funiculus morphology
type: Class
subclass of: abnormal lateral funiculus
subclass of: abnormal anatomical cluster morphology
definition: Any unspecified morphological anomaly of the lateral funiculus, such as, for example, abnormal shape or colour.
has_exact_synonym: abnormal morphology of lateral funiculus

abnormal basal body morphology
type: Class
subclass of: abnormal basal body
subclass of: abnormal cell part morphology
definition: Any unspecified morphological anomaly of the basal body, such as, for example, abnormal shape or colour.
has_exact_synonym: abnormal morphology of basal body

abnormal dendrite morphology
type: Class
subclass of: abnormal dendrite
subclass of: XPO_0141286
definition: Any unspecified morphological anomaly of the dendrite, such as, for example, abnormal shape or colour.
has_exact_synonym: abnormal morphology of dendrite

abnormal neuromast mantle cell morphology
type: Class
subclass of: abnormal neuromast mantle cell
subclass of: abnormal cell morphology
definition: Any unspecified morphological anomaly of the neuromast mantle cell, such as, for example, abnormal shape or colour.
has_exact_synonym: abnormal morphology of neuromast mantle cell

abnormal ventral fin margin morphology
type: Class
subclass of: abnormal ventral fin margin
subclass of: abnormal fin margin morphology
definition: Any unspecified morphological anomaly of the ventral fin margin, such as, for example, abnormal shape or colour.
has_exact_synonym: abnormal morphology of ventral fin margin

abnormal dorsal endoderm morphology
type: Class
subclass of: abnormal dorsal endoderm
subclass of: abnormal embryonic structure morphology
definition: Any unspecified morphological anomaly of the dorsal endoderm, such as, for example, abnormal shape or colour.
has_exact_synonym: abnormal morphology of dorsal endoderm

abnormal B cell morphology
type: Class
subclass of: abnormal B cell
subclass of: abnormal lymphocyte morphology
definition: Any unspecified morphological anomaly of the B cell, such as, for example, abnormal shape or colour.
has_exact_synonym: abnormal morphology of B cell

abnormal hypobranchial placode morphology
type: Class
subclass of: abnormal hypobranchial placode
subclass of: abnormal embryonic structure morphology
definition: Any unspecified morphological anomaly of the hypobranchial placode, such as, for example, abnormal shape or colour.
has_exact_synonym: abnormal morphology of hypobranchial placode

abnormal otic region morphology
type: Class
subclass of: abnormal otic region
subclass of: abnormal anatomical cluster morphology
definition: Any unspecified morphological anomaly of the otic region, such as, for example, abnormal shape or colour.
has_exact_synonym: abnormal morphology of otic region

abnormal ventral tegmentum morphology
type: Class
subclass of: abnormal ventral tegmentum
subclass of: abnormal multi-tissue structure morphology
definition: Any unspecified morphological anomaly of the ventral tegmentum, such as, for example, abnormal shape or colour.
has_exact_synonym: abnormal morphology of ventral tegmentum

abnormal m. rectus posterior morphology
type: Class
subclass of: abnormal m. rectus posterior
subclass of: abnormal eye muscle morphology
definition: Any unspecified morphological anomaly of the m. rectus posterior, such as, for example, abnormal shape or colour.
has_exact_synonym: abnormal morphology of m. rectus posterior

abnormal bipolar neuron morphology
type: Class
subclass of: abnormal bipolar neuron
subclass of: abnormal interneuron morphology
definition: Any unspecified morphological anomaly of the bipolar neuron, such as, for example, abnormal shape or colour.
has_exact_synonym: abnormal morphology of bipolar neuron

abnormal ventral blood island border morphology
type: Class
subclass of: abnormal ventral blood island border
subclass of: abnormal blood vessel morphology
definition: Any unspecified morphological anomaly of the ventral blood island border, such as, for example, abnormal shape or colour.
has_exact_synonym: abnormal morphology of ventral blood island border

abnormal posterior vena cava morphology
type: Class
subclass of: abnormal posterior vena cava
subclass of: abnormal vein morphology
definition: Any unspecified morphological anomaly of the posterior vena cava, such as, for example, abnormal shape or colour.
has_exact_synonym: abnormal morphology of posterior vena cava

abnormal infundibulum morphology
type: Class
subclass of: abnormal infundibulum
subclass of: abnormal multi-tissue structure morphology
definition: Any unspecified morphological anomaly of the infundibulum, such as, for example, abnormal shape or colour.
has_exact_synonym: abnormal morphology of infundibulum

abnormal pars externa of the stapes morphology
type: Class
subclass of: abnormal pars externa of the stapes
subclass of: abnormal cartilage element morphology
definition: Any unspecified morphological anomaly of the pars externa of the stapes, such as, for example, abnormal shape or colour.
has_exact_synonym: abnormal morphology of pars externa of the stapes

abnormal choroid morphology
type: Class
subclass of: abnormal choroid
subclass of: abnormal tissue morphology
definition: Any unspecified morphological anomaly of the choroid, such as, for example, abnormal shape or colour.
has_exact_synonym: abnormal morphology of choroid

abnormal skin mucous gland morphology
type: Class
subclass of: abnormal skin mucous gland
subclass of: abnormal skin gland morphology
subclass of: abnormal mucous gland morphology
definition: Any unspecified morphological anomaly of the skin mucous gland, such as, for example, abnormal shape or colour.
has_exact_synonym: abnormal morphology of skin mucous gland

abnormal laterodorsal tegmental nucleus morphology
type: Class
subclass of: abnormal laterodorsal tegmental nucleus
subclass of: abnormal neural nucleus morphology
definition: Any unspecified morphological anomaly of the laterodorsal tegmental nucleus, such as, for example, abnormal shape or colour.
has_exact_synonym: abnormal morphology of laterodorsal tegmental nucleus

abnormal myotome of trunk somite 4 morphology
type: Class
subclass of: abnormal myotome of trunk somite 4
subclass of: abnormal myotome morphology
definition: Any unspecified morphological anomaly of the myotome of trunk somite 4, such as, for example, abnormal shape or colour.
has_exact_synonym: abnormal morphology of myotome of trunk somite 4

abnormal endomesoderm morphology
type: Class
subclass of: abnormal endomesoderm
subclass of: abnormal primary germ layer morphology
definition: Any unspecified morphological anomaly of the endomesoderm, such as, for example, abnormal shape or colour.
has_exact_synonym: abnormal morphology of endomesoderm

abnormal simple cuboidal epithelium morphology
type: Class
subclass of: abnormal simple cuboidal epithelium
subclass of: abnormal unilaminar epithelium morphology
definition: Any unspecified morphological anomaly of the simple cuboidal epithelium, such as, for example, abnormal shape or colour.
has_exact_synonym: abnormal morphology of simple cuboidal epithelium

abnormal blastomere V2.1.1 morphology
type: Class
subclass of: abnormal blastomere V2.1.1
subclass of: abnormal ventral vegetal hemisphere blastomere morphology
definition: Any unspecified morphological anomaly of the blastomere V2.1.1, such as, for example, abnormal shape or colour.
has_exact_synonym: abnormal morphology of blastomere V2.1.1

abnormal absorptive cell morphology
type: Class
subclass of: abnormal absorptive cell
subclass of: abnormal cell morphology
definition: Any unspecified morphological anomaly of the absorptive cell, such as, for example, abnormal shape or colour.
has_exact_synonym: abnormal morphology of absorptive cell

abnormal liver parenchyme morphology
type: Class
subclass of: abnormal liver parenchyme
subclass of: abnormal tissue morphology
definition: Any unspecified morphological anomaly of the liver parenchyme, such as, for example, abnormal shape or colour.
has_exact_synonym: abnormal morphology of liver parenchyme

abnormal internal coil of the small intestine morphology
type: Class
subclass of: abnormal internal coil of the small intestine
subclass of: abnormal multi-tissue structure morphology
definition: Any unspecified morphological anomaly of the internal coil of the small intestine, such as, for example, abnormal shape or colour.
has_exact_synonym: abnormal morphology of internal coil of the small intestine

abnormal subintestinal vein morphology
type: Class
subclass of: abnormal subintestinal vein
subclass of: abnormal vein morphology
definition: Any unspecified morphological anomaly of the subintestinal vein, such as, for example, abnormal shape or colour.
has_exact_synonym: abnormal morphology of subintestinal vein

abnormal pyloric sphincter morphology
type: Class
subclass of: abnormal pyloric sphincter
subclass of: abnormal multi-tissue structure morphology
definition: Any unspecified morphological anomaly of the pyloric sphincter, such as, for example, abnormal shape or colour.
has_exact_synonym: abnormal morphology of pyloric sphincter

abnormal m. rectus anterior morphology
type: Class
subclass of: abnormal m. rectus anterior
subclass of: abnormal eye muscle morphology
definition: Any unspecified morphological anomaly of the m. rectus anterior, such as, for example, abnormal shape or colour.
has_exact_synonym: abnormal morphology of m. rectus anterior

abnormal olfactory nerve morphology
type: Class
subclass of: abnormal olfactory nerve
subclass of: abnormal cranial nerve morphology
definition: Any unspecified morphological anomaly of the olfactory nerve, such as, for example, abnormal shape or colour.
has_exact_synonym: abnormal morphology of olfactory nerve

abnormal sclerotome of trunk somite 5 morphology
type: Class
subclass of: abnormal sclerotome of trunk somite 5
subclass of: abnormal sclerotome morphology
definition: Any unspecified morphological anomaly of the sclerotome of trunk somite 5, such as, for example, abnormal shape or colour.
has_exact_synonym: abnormal morphology of sclerotome of trunk somite 5

abnormal external gill morphology
type: Class
subclass of: abnormal external gill
subclass of: abnormal surface structure morphology
definition: Any unspecified morphological anomaly of the external gill, such as, for example, abnormal shape or colour.
has_exact_synonym: abnormal morphology of external gill

abnormal fenestra basicranialis morphology
type: Class
subclass of: abnormal fenestra basicranialis
subclass of: abnormal anatomical space morphology
definition: Any unspecified morphological anomaly of the fenestra basicranialis, such as, for example, abnormal shape or colour.
has_exact_synonym: abnormal morphology of fenestra basicranialis

abnormal commisura quadratocranialis anterior morphology
type: Class
subclass of: abnormal commisura quadratocranialis anterior
subclass of: abnormal cartilage element morphology
definition: Any unspecified morphological anomaly of the commisura quadratocranialis anterior, such as, for example, abnormal shape or colour.
has_exact_synonym: abnormal morphology of commisura quadratocranialis anterior

abnormal dorsal pallium morphology
type: Class
subclass of: abnormal dorsal pallium
subclass of: abnormal multi-tissue structure morphology
definition: Any unspecified morphological anomaly of the dorsal pallium, such as, for example, abnormal shape or colour.
has_exact_synonym: abnormal morphology of dorsal pallium

abnormal lampbrush chromosome morphology
type: Class
subclass of: abnormal lampbrush chromosome
subclass of: abnormal cell part morphology
definition: Any unspecified morphological anomaly of the lampbrush chromosome, such as, for example, abnormal shape or colour.
has_exact_synonym: abnormal morphology of lampbrush chromosome

abnormal pulmonary vein morphology
type: Class
subclass of: abnormal pulmonary vein
subclass of: abnormal vein morphology
definition: Any unspecified morphological anomaly of the pulmonary vein, such as, for example, abnormal shape or colour.
has_exact_synonym: abnormal morphology of pulmonary vein

abnormal dorsal column nucleus morphology
type: Class
subclass of: abnormal dorsal column nucleus
subclass of: abnormal neural nucleus morphology
definition: Any unspecified morphological anomaly of the dorsal column nucleus, such as, for example, abnormal shape or colour.
has_exact_synonym: abnormal morphology of dorsal column nucleus

abnormal pronephric sinus morphology
type: Class
subclass of: abnormal pronephric sinus
subclass of: abnormal anatomical space morphology
definition: Any unspecified morphological anomaly of the pronephric sinus, such as, for example, abnormal shape or colour.
has_exact_synonym: abnormal morphology of pronephric sinus

abnormal m. levator mandibulae longus internus morphology
type: Class
subclass of: abnormal m. levator mandibulae longus internus
subclass of: abnormal mandibular head muscle morphology
definition: Any unspecified morphological anomaly of the m. levator mandibulae longus internus, such as, for example, abnormal shape or colour.
has_exact_synonym: abnormal morphology of m. levator mandibulae longus internus

abnormal inner limiting membrane morphology
type: Class
subclass of: abnormal inner limiting membrane
subclass of: abnormal tissue morphology
definition: Any unspecified morphological anomaly of the inner limiting membrane, such as, for example, abnormal shape or colour.
has_exact_synonym: abnormal morphology of inner limiting membrane

abnormal dental epithelium morphology
type: Class
subclass of: abnormal dental epithelium
subclass of: abnormal epithelium morphology
definition: Any unspecified morphological anomaly of the dental epithelium, such as, for example, abnormal shape or colour.
has_exact_synonym: abnormal morphology of dental epithelium

abnormal peripheral retina morphology
type: Class
subclass of: abnormal peripheral retina
subclass of: XPO_0141316
definition: Any unspecified morphological anomaly of the peripheral retina, such as, for example, abnormal shape or colour.
has_exact_synonym: abnormal morphology of peripheral retina

abnormal trochlear motornucleus morphology
type: Class
subclass of: abnormal trochlear motornucleus
subclass of: abnormal tissue morphology
definition: Any unspecified morphological anomaly of the trochlear motornucleus, such as, for example, abnormal shape or colour.
has_exact_synonym: abnormal morphology of trochlear motornucleus

abnormal post-anal gut morphology
type: Class
subclass of: abnormal post-anal gut
subclass of: abnormal tissue morphology
definition: Any unspecified morphological anomaly of the post-anal gut, such as, for example, abnormal shape or colour.
has_exact_synonym: abnormal morphology of post-anal gut

abnormal Jacobson's vein morphology
type: Class
subclass of: abnormal Jacobson's vein
subclass of: abnormal vein morphology
definition: Any unspecified morphological anomaly of the Jacobson's vein, such as, for example, abnormal shape or colour.
has_exact_synonym: abnormal morphology of Jacobson's vein

abnormal abdominal myoblast morphology
type: Class
subclass of: abnormal abdominal myoblast
subclass of: abnormal myoblast morphology
definition: Any unspecified morphological anomaly of the abdominal myoblast, such as, for example, abnormal shape or colour.
has_exact_synonym: abnormal morphology of abdominal myoblast

abnormal claw of hindlimb digit 5 morphology
type: Class
subclass of: abnormal claw of hindlimb digit 5
subclass of: abnormal claw morphology
definition: Any unspecified morphological anomaly of the claw of hindlimb digit 5, such as, for example, abnormal shape or colour.
has_exact_synonym: abnormal morphology of claw of hindlimb digit 5

abnormal compound organ component morphology
type: Class
subclass of: abnormal compound organ component
subclass of: abnormal multi-tissue structure morphology
definition: Any unspecified morphological anomaly of the compound organ component, such as, for example, abnormal shape or colour.
has_exact_synonym: abnormal morphology of compound organ component

abnormal adrenal cortex morphology
type: Class
subclass of: abnormal adrenal cortex
subclass of: abnormal tissue morphology
definition: Any unspecified morphological anomaly of the adrenal cortex, such as, for example, abnormal shape or colour.
has_exact_synonym: abnormal morphology of adrenal cortex

abnormal appendicular ossicle morphology
type: Class
subclass of: abnormal appendicular ossicle
subclass of: abnormal ossicle morphology
definition: Any unspecified morphological anomaly of the appendicular ossicle, such as, for example, abnormal shape or colour.
has_exact_synonym: abnormal morphology of appendicular ossicle

abnormal epicardium morphology
type: Class
subclass of: abnormal epicardium
subclass of: abnormal tissue morphology
definition: Any unspecified morphological anomaly of the epicardium, such as, for example, abnormal shape or colour.
has_exact_synonym: abnormal morphology of epicardium

abnormal anterior thalamic nucleus morphology
type: Class
subclass of: abnormal anterior thalamic nucleus
subclass of: abnormal neural nucleus morphology
definition: Any unspecified morphological anomaly of the anterior thalamic nucleus, such as, for example, abnormal shape or colour.
has_exact_synonym: abnormal morphology of anterior thalamic nucleus

abnormal mesonephric early distal tubule morphology
type: Class
subclass of: abnormal mesonephric early distal tubule
subclass of: abnormal mesonephric tubule morphology
definition: Any unspecified morphological anomaly of the mesonephric early distal tubule, such as, for example, abnormal shape or colour.
has_exact_synonym: abnormal morphology of mesonephric early distal tubule

abnormal posterior lateral line morphology
type: Class
subclass of: abnormal posterior lateral line
subclass of: abnormal lateral line morphology
definition: Any unspecified morphological anomaly of the posterior lateral line, such as, for example, abnormal shape or colour.
has_exact_synonym: abnormal morphology of posterior lateral line

abnormal tongue morphology
type: Class
subclass of: abnormal tongue
subclass of: abnormal multi-tissue structure morphology
definition: Any unspecified morphological anomaly of the tongue, such as, for example, abnormal shape or colour.
has_exact_synonym: abnormal morphology of tongue

abnormal prosomere 5 morphology
type: Class
subclass of: abnormal prosomere 5
subclass of: abnormal prosomere morphology
definition: Any unspecified morphological anomaly of the prosomere 5, such as, for example, abnormal shape or colour.
has_exact_synonym: abnormal morphology of prosomere 5

abnormal activin-induced ectoderm morphology
type: Class
subclass of: abnormal activin-induced ectoderm
subclass of: abnormal anatomical entity in vitro morphology
definition: Any unspecified morphological anomaly of the activin-induced ectoderm, such as, for example, abnormal shape or colour.
has_exact_synonym: abnormal morphology of activin-induced ectoderm

abnormal forelimb region morphology
type: Class
subclass of: abnormal forelimb region
subclass of: XPO_0141316
definition: Any unspecified morphological anomaly of the forelimb region, such as, for example, abnormal shape or colour.
has_exact_synonym: abnormal morphology of forelimb region

abnormal non-cililated epidermal cell morphology
type: Class
subclass of: abnormal non-cililated epidermal cell
subclass of: abnormal epidermal cell morphology
definition: Any unspecified morphological anomaly of the non-cililated epidermal cell, such as, for example, abnormal shape or colour.
has_exact_synonym: abnormal morphology of non-cililated epidermal cell

abnormal ceratohyal morphology
type: Class
subclass of: abnormal ceratohyal
subclass of: abnormal cartilage element morphology
definition: Any unspecified morphological anomaly of the ceratohyal, such as, for example, abnormal shape or colour.
has_exact_synonym: abnormal morphology of ceratohyal

abnormal peripheral vegetal yolk mass morphology
type: Class
subclass of: abnormal peripheral vegetal yolk mass
subclass of: abnormal embryonic structure morphology
definition: Any unspecified morphological anomaly of the peripheral vegetal yolk mass, such as, for example, abnormal shape or colour.
has_exact_synonym: abnormal morphology of peripheral vegetal yolk mass

abnormal oligodendrocyte morphology
type: Class
subclass of: abnormal oligodendrocyte
subclass of: abnormal glial cell morphology
definition: Any unspecified morphological anomaly of the oligodendrocyte, such as, for example, abnormal shape or colour.
has_exact_synonym: abnormal morphology of oligodendrocyte

abnormal vitelline membrane morphology
type: Class
subclass of: abnormal vitelline membrane
subclass of: abnormal extraembryonic structure morphology
definition: Any unspecified morphological anomaly of the vitelline membrane, such as, for example, abnormal shape or colour.
has_exact_synonym: abnormal morphology of vitelline membrane

abnormal blastomere V1.2.2 morphology
type: Class
subclass of: abnormal blastomere V1.2.2
subclass of: abnormal ventral animal hemisphere blastomere morphology
definition: Any unspecified morphological anomaly of the blastomere V1.2.2, such as, for example, abnormal shape or colour.
has_exact_synonym: abnormal morphology of blastomere V1.2.2

abnormal notochordal epithelium morphology
type: Class
subclass of: abnormal notochordal epithelium
subclass of: abnormal epithelium morphology
definition: Any unspecified morphological anomaly of the notochordal epithelium, such as, for example, abnormal shape or colour.
has_exact_synonym: abnormal morphology of notochordal epithelium

abnormal pupil morphology
type: Class
subclass of: abnormal pupil
subclass of: abnormal anatomical space morphology
definition: Any unspecified morphological anomaly of the pupil, such as, for example, abnormal shape or colour.
has_exact_synonym: abnormal morphology of pupil

abnormal urethra morphology
type: Class
subclass of: abnormal urethra
subclass of: abnormal multi-tissue structure morphology
definition: Any unspecified morphological anomaly of the urethra, such as, for example, abnormal shape or colour.
has_exact_synonym: abnormal morphology of urethra

abnormal cutaneous magnus morphology
type: Class
subclass of: abnormal cutaneous magnus
subclass of: abnormal vein morphology
definition: Any unspecified morphological anomaly of the cutaneous magnus, such as, for example, abnormal shape or colour.
has_exact_synonym: abnormal morphology of cutaneous magnus

abnormal mm. constrictores branchiales III morphology
type: Class
subclass of: abnormal mm. constrictores branchiales III
subclass of: abnormal branchial head muscle morphology
definition: Any unspecified morphological anomaly of the mm. constrictores branchiales III, such as, for example, abnormal shape or colour.
has_exact_synonym: abnormal morphology of mm. constrictores branchiales III

abnormal early proximal tubule morphology
type: Class
subclass of: abnormal early proximal tubule
subclass of: abnormal tissue morphology
definition: Any unspecified morphological anomaly of the early proximal tubule, such as, for example, abnormal shape or colour.
has_exact_synonym: abnormal morphology of early proximal tubule

abnormal truncus arteriosus morphology
type: Class
subclass of: abnormal truncus arteriosus
subclass of: abnormal blood vessel morphology
definition: Any unspecified morphological anomaly of the truncus arteriosus, such as, for example, abnormal shape or colour.
has_exact_synonym: abnormal morphology of truncus arteriosus

abnormal early distal tubule morphology
type: Class
subclass of: abnormal early distal tubule
subclass of: abnormal tissue morphology
definition: Any unspecified morphological anomaly of the early distal tubule, such as, for example, abnormal shape or colour.
has_exact_synonym: abnormal morphology of early distal tubule

abnormal dorsal longitudinal anastomosing vessel - right branch morphology
type: Class
subclass of: abnormal dorsal longitudinal anastomosing vessel - right branch
subclass of: abnormal dorsal longitudinal anastomosing vessel morphology
definition: Any unspecified morphological anomaly of the dorsal longitudinal anastomosing vessel - right branch, such as, for example, abnormal shape or colour.
has_exact_synonym: abnormal morphology of dorsal longitudinal anastomosing vessel - right branch

abnormal joint morphology
type: Class
subclass of: abnormal joint
subclass of: abnormal anatomical cluster morphology
definition: Any unspecified morphological anomaly of the joint, such as, for example, abnormal shape or colour.
has_exact_synonym: abnormal morphology of joint

abnormal hemangioblast morphology
type: Class
subclass of: abnormal hemangioblast
subclass of: abnormal cell morphology
definition: Any unspecified morphological anomaly of the hemangioblast, such as, for example, abnormal shape or colour.
has_exact_synonym: abnormal morphology of hemangioblast

abnormal central nucleus of the thalamus morphology
type: Class
subclass of: abnormal central nucleus of the thalamus
subclass of: abnormal neural nucleus morphology
definition: Any unspecified morphological anomaly of the central nucleus of the thalamus, such as, for example, abnormal shape or colour.
has_exact_synonym: abnormal morphology of central nucleus of the thalamus

abnormal blastocoel roof morphology
type: Class
subclass of: abnormal blastocoel roof
subclass of: abnormal tissue morphology
definition: Any unspecified morphological anomaly of the blastocoel roof, such as, for example, abnormal shape or colour.
has_exact_synonym: abnormal morphology of blastocoel roof

abnormal intersomitic epithelium morphology
type: Class
subclass of: abnormal intersomitic epithelium
subclass of: abnormal epithelium morphology
definition: Any unspecified morphological anomaly of the intersomitic epithelium, such as, for example, abnormal shape or colour.
has_exact_synonym: abnormal morphology of intersomitic epithelium

abnormal xanthophore morphology
type: Class
subclass of: abnormal xanthophore
subclass of: abnormal pigment cell morphology
definition: Any unspecified morphological anomaly of the xanthophore, such as, for example, abnormal shape or colour.
has_exact_synonym: abnormal morphology of xanthophore

abnormal ventral hyoid arch skeleton morphology
type: Class
subclass of: abnormal ventral hyoid arch skeleton
subclass of: abnormal tissue morphology
definition: Any unspecified morphological anomaly of the ventral hyoid arch skeleton, such as, for example, abnormal shape or colour.
has_exact_synonym: abnormal morphology of ventral hyoid arch skeleton

abnormal sclerotome of trunk somite 1 morphology
type: Class
subclass of: abnormal sclerotome of trunk somite 1
subclass of: abnormal sclerotome morphology
definition: Any unspecified morphological anomaly of the sclerotome of trunk somite 1, such as, for example, abnormal shape or colour.
has_exact_synonym: abnormal morphology of sclerotome of trunk somite 1

abnormal retinal outer plexiform layer morphology
type: Class
subclass of: abnormal retinal outer plexiform layer
subclass of: abnormal tissue morphology
definition: Any unspecified morphological anomaly of the retinal outer plexiform layer, such as, for example, abnormal shape or colour.
has_exact_synonym: abnormal morphology of retinal outer plexiform layer

abnormal prosomere 4 morphology
type: Class
subclass of: abnormal prosomere 4
subclass of: abnormal prosomere morphology
definition: Any unspecified morphological anomaly of the prosomere 4, such as, for example, abnormal shape or colour.
has_exact_synonym: abnormal morphology of prosomere 4

abnormal accessory nerve morphology
type: Class
subclass of: abnormal accessory nerve
subclass of: abnormal cranial nerve morphology
definition: Any unspecified morphological anomaly of the accessory nerve, such as, for example, abnormal shape or colour.
has_exact_synonym: abnormal morphology of accessory nerve

abnormal myotome of tail somite 17 morphology
type: Class
subclass of: abnormal myotome of tail somite 17
subclass of: abnormal myotome morphology
definition: Any unspecified morphological anomaly of the myotome of tail somite 17, such as, for example, abnormal shape or colour.
has_exact_synonym: abnormal morphology of myotome of tail somite 17

abnormal left ventricle morphology
type: Class
subclass of: abnormal left ventricle
subclass of: abnormal lateral ventricle morphology
definition: Any unspecified morphological anomaly of the left ventricle, such as, for example, abnormal shape or colour.
has_exact_synonym: abnormal morphology of left ventricle

abnormal raphe nucleus morphology
type: Class
subclass of: abnormal raphe nucleus
subclass of: abnormal multi-tissue structure morphology
definition: Any unspecified morphological anomaly of the raphe nucleus, such as, for example, abnormal shape or colour.
has_exact_synonym: abnormal morphology of raphe nucleus

abnormal Schwann cell morphology
type: Class
subclass of: abnormal Schwann cell
subclass of: abnormal glial cell morphology
definition: Any unspecified morphological anomaly of the Schwann cell, such as, for example, abnormal shape or colour.
has_exact_synonym: abnormal morphology of Schwann cell

abnormal proctodeum morphology
type: Class
subclass of: abnormal proctodeum
subclass of: abnormal surface structure morphology
definition: Any unspecified morphological anomaly of the proctodeum, such as, for example, abnormal shape or colour.
has_exact_synonym: abnormal morphology of proctodeum

abnormal intersomitic tendon morphology
type: Class
subclass of: abnormal intersomitic tendon
subclass of: abnormal tendon morphology
definition: Any unspecified morphological anomaly of the intersomitic tendon, such as, for example, abnormal shape or colour.
has_exact_synonym: abnormal morphology of intersomitic tendon

absent pronephric tubule
type: Class
subclass of: abnormal pronephric tubule
subclass of: absent tissue
definition: Absence of pronephric tubule.
has_exact_synonym: missing pronephric tubule

absent ceratohyal
type: Class
subclass of: abnormal ceratohyal
subclass of: absent cartilage element
definition: Absence of ceratohyal.
has_exact_synonym: missing ceratohyal

absent primordial germ cell
type: Class
subclass of: abnormal primordial germ cell
subclass of: absent germ cell
definition: Absence of primordial germ cell.
has_exact_synonym: missing primordial germ cell

absent anterior neural tube
type: Class
subclass of: abnormal anterior neural tube
subclass of: absent embryonic structure
definition: Absence of anterior neural tube.
has_exact_synonym: missing anterior neural tube

absent astral microtubule
type: Class
subclass of: absent spindle microtubule
subclass of: XPO_0131687
definition: Absence of astral microtubule.
has_exact_synonym: missing astral microtubule

absent spindle microtubule
type: Class
subclass of: XPO_0126214
subclass of: XPO_0131675
definition: Absence of spindle microtubule.
has_exact_synonym: missing spindle microtubule

absent apical ectodermal ridge
type: Class
subclass of: abnormal apical ectodermal ridge
subclass of: XPO_0125459
definition: Absence of apical ectodermal ridge.
has_exact_synonym: missing apical ectodermal ridge

absent autopod
type: Class
subclass of: abnormal autopod
subclass of: absent limb segment
definition: Absence of autopod.
has_exact_synonym: missing autopod

absent barbel
type: Class
subclass of: abnormal barbel
subclass of: absent surface structure
definition: Absence of barbel.
has_exact_synonym: missing barbel

absent blastopore
type: Class
subclass of: abnormal blastopore
subclass of: absent embryonic structure
definition: Absence of blastopore.
has_exact_synonym: missing blastopore

absent brain
type: Class
subclass of: abnormal brain
subclass of: absent cavitated compound organ
definition: Absence of brain.
has_exact_synonym: missing brain

absent cartilage element
type: Class
subclass of: abnormal cartilage element
subclass of: absent skeletal element
definition: Absence of cartilage element.
has_exact_synonym: missing cartilage element

absent cartilaginous condensation
type: Class
subclass of: abnormal cartilaginous condensation
subclass of: absent cell condensation
definition: Absence of cartilaginous condensation.
has_exact_synonym: missing cartilaginous condensation

absent cement gland
type: Class
subclass of: abnormal cement gland
subclass of: absent surface structure
definition: Absence of cement gland.
has_exact_synonym: missing cement gland

absent central nervous system
type: Class
subclass of: abnormal central nervous system
subclass of: absent nervous system
definition: Absence of central nervous system.
has_exact_synonym: missing central nervous system

absent eye
type: Class
subclass of: abnormal eye
subclass of: absent cavitated compound organ
definition: Absence of eye.
has_exact_synonym: missing eye

absent femur
type: Class
subclass of: abnormal femur
subclass of: absent endochondral bone
definition: Absence of femur.
has_exact_synonym: missing femur

absent forelimb
type: Class
subclass of: abnormal forelimb
subclass of: absent limb
definition: Absence of forelimb.
has_exact_synonym: missing forelimb

absent forelimb bud
type: Class
subclass of: abnormal forelimb bud
subclass of: absent limb bud
definition: Absence of forelimb bud.
has_exact_synonym: missing forelimb bud

absent forelimb digit 2
type: Class
subclass of: abnormal number of forelimb digit 2
subclass of: absent forelimb digit
definition: Absence of forelimb digit 2.
has_exact_synonym: missing forelimb digit 2

absent forelimb digit 3
type: Class
subclass of: abnormal number of forelimb digit 3
subclass of: absent forelimb digit
definition: Absence of forelimb digit 3.
has_exact_synonym: missing forelimb digit 3

absent forelimb digit 4
type: Class
subclass of: abnormal number of forelimb digit 4
subclass of: absent forelimb digit
definition: Absence of forelimb digit 4.
has_exact_synonym: missing forelimb digit 4

absent forelimb digit 5
type: Class
subclass of: abnormal number of forelimb digit 5
subclass of: absent forelimb digit
definition: Absence of forelimb digit 5.
has_exact_synonym: missing forelimb digit 5

absent forelimb skeleton
type: Class
subclass of: abnormal forelimb skeleton
subclass of: absent skeletal subdivision
definition: Absence of forelimb skeleton.
has_exact_synonym: missing forelimb skeleton

absent gall bladder
type: Class
subclass of: abnormal gall bladder
subclass of: absent compound organ
subclass of: absent viscus
definition: Absence of gall bladder.
has_exact_synonym: missing gall bladder

absent hand
type: Class
subclass of: abnormal hand
subclass of: absent autopod
definition: Absence of hand.
has_exact_synonym: missing hand

absent head
type: Class
subclass of: abnormal head
subclass of: absent organism subdivision
definition: Absence of head.
has_exact_synonym: missing head

absent hindlimb
type: Class
subclass of: abnormal hindlimb
subclass of: absent limb
definition: Absence of hindlimb.
has_exact_synonym: missing hindlimb

absent hindlimb bud
type: Class
subclass of: abnormal hindlimb bud
subclass of: absent limb bud
definition: Absence of hindlimb bud.
has_exact_synonym: missing hindlimb bud

absent hindlimb digit
type: Class
subclass of: abnormal number of hindlimb digits
subclass of: absent digit
definition: Absence of hindlimb digit.
has_exact_synonym: missing hindlimb digit

absent hindlimb digit 2
type: Class
subclass of: absent hindlimb digit
subclass of: abnormal number of hindlimb digit 2
definition: Absence of hindlimb digit 2.
has_exact_synonym: missing hindlimb digit 2

absent hindlimb digit 3
type: Class
subclass of: absent hindlimb digit
subclass of: abnormal number of hindlimb digit 3
definition: Absence of hindlimb digit 3.
has_exact_synonym: missing hindlimb digit 3

absent hindlimb digit 4
type: Class
subclass of: absent hindlimb digit
subclass of: abnormal number of hindlimb digit 4
definition: Absence of hindlimb digit 4.
has_exact_synonym: missing hindlimb digit 4

absent hindlimb digit 5
type: Class
subclass of: absent hindlimb digit
subclass of: abnormal number of hindlimb digit 5
definition: Absence of hindlimb digit 5.
has_exact_synonym: missing hindlimb digit 5

absent hindlimb stylopod
type: Class
subclass of: abnormal hindlimb stylopod
subclass of: absent stylopod
definition: Absence of hindlimb stylopod.
has_exact_synonym: missing hindlimb stylopod

absent hindlimb zeugopod
type: Class
subclass of: abnormal hindlimb zeugopod
subclass of: absent zeugopod
definition: Absence of hindlimb zeugopod.
has_exact_synonym: missing hindlimb zeugopod

absent hypaxial muscle
type: Class
subclass of: abnormal hypaxial muscle
subclass of: absent skeletal muscle
definition: Absence of hypaxial muscle.
has_exact_synonym: missing hypaxial muscle

absent inner ear
type: Class
subclass of: abnormal inner ear
subclass of: absent anatomical cluster
definition: Absence of inner ear.
has_exact_synonym: missing inner ear

absent liver primordium
type: Class
subclass of: abnormal liver primordium
subclass of: absent primordium
definition: Absence of liver primordium.
has_exact_synonym: missing liver primordium

absent lung primordium
type: Class
subclass of: abnormal lung primordium
subclass of: absent multi-tissue structure
definition: Absence of lung primordium.
has_exact_synonym: missing lung primordium

absent melanophore
type: Class
subclass of: abnormal melanophore
subclass of: XPO_0125452
definition: Absence of melanophore.
has_exact_synonym: missing melanophore

absent Meckel's cartilage
type: Class
subclass of: abnormal Meckel's cartilage
subclass of: absent cartilage element
definition: Absence of Meckel's cartilage.
has_exact_synonym: missing Meckel's cartilage

absent neural tube
type: Class
subclass of: abnormal neural tube
subclass of: absent embryonic structure
definition: Absence of neural tube.
has_exact_synonym: missing neural tube

absent notochord
type: Class
subclass of: abnormal notochord
subclass of: absent tissue
definition: Absence of notochord.
has_exact_synonym: missing notochord

absent olfactory pit
type: Class
subclass of: abnormal olfactory pit
subclass of: absent anatomical space
definition: Absence of olfactory pit.
has_exact_synonym: missing olfactory pit

absent optic stalk
type: Class
subclass of: abnormal optic stalk
subclass of: absent tissue
definition: Absence of optic stalk.
has_exact_synonym: missing optic stalk

absent otic vesicle
type: Class
subclass of: abnormal otic vesicle
subclass of: absent tissue
definition: Absence of otic vesicle.
has_exact_synonym: missing otic vesicle

absent outflow tract
type: Class
subclass of: abnormal outflow tract
subclass of: absent multi-tissue structure
definition: Absence of outflow tract.
has_exact_synonym: missing outflow tract

absent planum trabeculare anticum
type: Class
subclass of: abnormal planum trabeculare anticum
subclass of: absent cartilage element
definition: Absence of planum trabeculare anticum.
has_exact_synonym: missing planum trabeculare anticum

absent regenerating forelimb
type: Class
subclass of: abnormal regenerating forelimb
subclass of: absent regenerating limb
definition: Absence of regenerating forelimb.
has_exact_synonym: missing regenerating forelimb

absent regenerating hindlimb
type: Class
subclass of: abnormal regenerating hindlimb
subclass of: absent regenerating limb
definition: Absence of regenerating hindlimb.
has_exact_synonym: missing regenerating hindlimb

absent regenerating tail
type: Class
subclass of: abnormal regenerating tail
subclass of: absent regenerating tissue
definition: Absence of regenerating tail.
has_exact_synonym: missing regenerating tail

absent scapula
type: Class
subclass of: abnormal scapula
subclass of: absent endochondral bone
definition: Absence of scapula.
has_exact_synonym: missing scapula

absent somite
type: Class
subclass of: abnormal somite
subclass of: absent tissue
definition: Absence of somite.
has_exact_synonym: missing somite

absent suprarostral plate
type: Class
subclass of: abnormal suprarostral plate
subclass of: absent cartilage element
definition: Absence of suprarostral plate.
has_exact_synonym: missing suprarostral plate

absent tail
type: Class
subclass of: abnormal tail
subclass of: absent organism subdivision
definition: Absence of tail.
has_exact_synonym: missing tail

absent tail bud
type: Class
subclass of: abnormal tail bud
subclass of: absent multi-tissue structure
definition: Absence of tail bud.
has_exact_synonym: missing tail bud

absent tibia-fibula
type: Class
subclass of: abnormal tibia-fibula
subclass of: absent endochondral bone
definition: Absence of tibia-fibula.
has_exact_synonym: missing tibia-fibula

absent trabecula cranii
type: Class
subclass of: abnormal trabecula cranii
subclass of: absent cartilage element
definition: Absence of trabecula cranii.
has_exact_synonym: missing trabecula cranii

absent upper blastopore lip
type: Class
subclass of: abnormal upper blastopore lip
subclass of: absent embryonic structure
definition: Absence of upper blastopore lip.
has_exact_synonym: missing upper blastopore lip

absent ventral pancreatic bud
type: Class
subclass of: abnormal ventral pancreatic bud
subclass of: absent multi-tissue structure
definition: Absence of ventral pancreatic bud.
has_exact_synonym: missing ventral pancreatic bud

decreased size of the alimentary system
type: Class
subclass of: abnormal alimentary system morphology
subclass of: XPO_0128015
definition: An abnormal reduction in the size of the alimentary system.
has_exact_synonym: abnormally small alimentary system

decreased size of the archenteron
type: Class
subclass of: abnormal archenteron morphology
subclass of: XPO_0128037
definition: An abnormal reduction in the size of the archenteron.
has_exact_synonym: abnormally small archenteron

decreased size of the brain
type: Class
subclass of: abnormal brain morphology
subclass of: XPO_0128043
definition: An abnormal reduction in the size of the brain.
has_exact_synonym: abnormally small brain

decreased size of the branchial arch
type: Class
subclass of: abnormal branchial arch morphology
subclass of: decreased size of the pharyngeal arch
definition: An abnormal reduction in the size of the branchial arch.
has_exact_synonym: abnormally small branchial arch

decreased size of the branchial arch skeleton
type: Class
subclass of: abnormal branchial arch skeleton morphology
subclass of: XPO_0128158
definition: An abnormal reduction in the size of the branchial arch skeleton.
has_exact_synonym: abnormally small branchial arch skeleton

decreased size of the cement gland
type: Class
subclass of: abnormal cement gland morphology
subclass of: XPO_0128049
definition: An abnormal reduction in the size of the cement gland.
has_exact_synonym: abnormally small cement gland

decreased size of the ceratobranchial I
type: Class
subclass of: abnormal ceratobranchial I morphology
subclass of: XPO_0128019
definition: An abnormal reduction in the size of the ceratobranchial I.
has_exact_synonym: abnormally small ceratobranchial I

decreased size of the ceratobranchial II
type: Class
subclass of: abnormal ceratobranchial II morphology
subclass of: XPO_0128019
definition: An abnormal reduction in the size of the ceratobranchial II.
has_exact_synonym: abnormally small ceratobranchial II

decreased size of the ceratobranchial III
type: Class
subclass of: abnormal ceratobranchial III morphology
subclass of: XPO_0128019
definition: An abnormal reduction in the size of the ceratobranchial III.
has_exact_synonym: abnormally small ceratobranchial III

decreased size of the ceratobranchial IV
type: Class
subclass of: abnormal ceratobranchial IV morphology
subclass of: XPO_0128019
definition: An abnormal reduction in the size of the ceratobranchial IV.
has_exact_synonym: abnormally small ceratobranchial IV

decreased size of the ceratohyal
type: Class
subclass of: abnormal ceratohyal morphology
subclass of: XPO_0128019
definition: An abnormal reduction in the size of the ceratohyal.
has_exact_synonym: abnormally small ceratohyal

decreased size of the chondrocranium
type: Class
subclass of: abnormal chondrocranium morphology
subclass of: XPO_0128034
definition: An abnormal reduction in the size of the chondrocranium.
has_exact_synonym: abnormally small chondrocranium

decreased size of the dorsal marginal zone
type: Class
subclass of: abnormal dorsal marginal zone morphology
subclass of: XPO_0128455
definition: An abnormal reduction in the size of the dorsal marginal zone.
has_exact_synonym: abnormally small dorsal marginal zone

decreased size of the duodenum
type: Class
subclass of: abnormal duodenum morphology
subclass of: XPO_0128008
definition: An abnormal reduction in the size of the duodenum.
has_exact_synonym: abnormally small duodenum

decreased size of the epaxial muscle
type: Class
subclass of: abnormal epaxial muscle morphology
subclass of: XPO_0128270
definition: An abnormal reduction in the size of the epaxial muscle.
has_exact_synonym: abnormally small epaxial muscle

decreased size of the eye
type: Class
subclass of: abnormal eye morphology
subclass of: XPO_0128043
definition: An abnormal reduction in the size of the eye.
has_exact_synonym: abnormally small eye

decreased size of the eye primordium
type: Class
subclass of: abnormal eye primordium morphology
subclass of: XPO_0128079
definition: An abnormal reduction in the size of the eye primordium.
has_exact_synonym: abnormally small eye primordium

decreased size of the fin
type: Class
subclass of: abnormal fin morphology
subclass of: XPO_0128049
definition: An abnormal reduction in the size of the fin.
has_exact_synonym: abnormally small fin

decreased size of the foregut
type: Class
subclass of: abnormal foregut morphology
subclass of: XPO_0128011
definition: An abnormal reduction in the size of the foregut.
has_exact_synonym: abnormally small foregut

decreased size of the forelimb
type: Class
subclass of: abnormal forelimb morphology
subclass of: XPO_0128297
definition: An abnormal reduction in the size of the forelimb.
has_exact_synonym: abnormally small forelimb

decreased size of the forebrain
type: Class
subclass of: abnormal forebrain morphology
subclass of: XPO_0128008
definition: An abnormal reduction in the size of the forebrain.
has_exact_synonym: abnormally small forebrain

decreased size of the head
type: Class
subclass of: abnormal head morphology
subclass of: XPO_0128026
definition: An abnormal reduction in the size of the head.
has_exact_synonym: abnormally small head

decreased size of the heart
type: Class
subclass of: abnormal heart morphology
subclass of: XPO_0128043
subclass of: XPO_0128113
definition: An abnormal reduction in the size of the heart.
has_exact_synonym: abnormally small heart

decreased size of the hindbrain
type: Class
subclass of: abnormal hindbrain morphology
subclass of: XPO_0128008
definition: An abnormal reduction in the size of the hindbrain.
has_exact_synonym: abnormally small hindbrain

decreased size of the hindlimb
type: Class
subclass of: abnormal hindlimb morphology
subclass of: XPO_0128297
definition: An abnormal reduction in the size of the hindlimb.
has_exact_synonym: abnormally small hindlimb

decreased size of the hindlimb bud
type: Class
subclass of: abnormal hindlimb bud morphology
subclass of: XPO_0128048
definition: An abnormal reduction in the size of the hindlimb bud.
has_exact_synonym: abnormally small hindlimb bud

decreased size of the hyoid arch skeleton
type: Class
subclass of: abnormal hyoid arch skeleton morphology
subclass of: XPO_0128158
definition: An abnormal reduction in the size of the hyoid arch skeleton.
has_exact_synonym: abnormally small hyoid arch skeleton

decreased size of the jaw muscle
type: Class
subclass of: abnormal jaw muscle morphology
subclass of: XPO_0128064
definition: An abnormal reduction in the size of the jaw muscle.
has_exact_synonym: abnormally small jaw muscle

decreased size of the mandibular arch
type: Class
subclass of: abnormal mandibular arch morphology
subclass of: decreased size of the pharyngeal arch
definition: An abnormal reduction in the size of the mandibular arch.
has_exact_synonym: abnormally small mandibular arch

decreased size of the Meckel's cartilage
type: Class
subclass of: abnormal Meckel's cartilage morphology
subclass of: XPO_0128019
definition: An abnormal reduction in the size of the Meckel's cartilage.
has_exact_synonym: abnormally small Meckel's cartilage

decreased size of the midbrain
type: Class
subclass of: abnormal midbrain morphology
subclass of: XPO_0128008
definition: An abnormal reduction in the size of the midbrain.
has_exact_synonym: abnormally small midbrain

decreased size of the mouth
type: Class
subclass of: abnormal mouth morphology
subclass of: XPO_0128037
definition: An abnormal reduction in the size of the mouth.
has_exact_synonym: abnormally small mouth

decreased size of the muscle
type: Class
subclass of: abnormal muscle morphology
subclass of: XPO_0128003
definition: An abnormal reduction in the size of the muscle.
has_exact_synonym: abnormally small muscle

decreased size of the myotome
type: Class
subclass of: abnormal myotome morphology
subclass of: XPO_0128003
definition: An abnormal reduction in the size of the myotome.
has_exact_synonym: abnormally small myotome

decreased size of the notochord
type: Class
subclass of: abnormal notochord morphology
subclass of: XPO_0128003
definition: An abnormal reduction in the size of the notochord.
has_exact_synonym: abnormally small notochord

decreased size of the pancreas
type: Class
subclass of: abnormal pancreas morphology
subclass of: XPO_0128113
subclass of: XPO_0128114
definition: An abnormal reduction in the size of the pancreas.
has_exact_synonym: abnormally small pancreas

decreased size of the pharyngeal arch
type: Class
subclass of: abnormal pharyngeal arch morphology
subclass of: XPO_0128008
definition: An abnormal reduction in the size of the pharyngeal arch.
has_exact_synonym: abnormally small pharyngeal arch

decreased size of the pharyngeal region
type: Class
subclass of: abnormal pharyngeal region morphology
subclass of: XPO_0128091
definition: An abnormal reduction in the size of the pharyngeal region.
has_exact_synonym: abnormally small pharyngeal region

decreased size of the proximal tubule
type: Class
subclass of: abnormal proximal tubule morphology
subclass of: XPO_0128003
definition: An abnormal reduction in the size of the proximal tubule.
has_exact_synonym: abnormally small proximal tubule

decreased size of the pseudoblastema
type: Class
subclass of: abnormal pseudoblastema morphology
subclass of: XPO_0128142
definition: An abnormal reduction in the size of the pseudoblastema.
has_exact_synonym: abnormally small pseudoblastema

decreased size of the regenerating forelimb
type: Class
subclass of: abnormal regenerating forelimb morphology
subclass of: XPO_0128578
definition: An abnormal reduction in the size of the regenerating forelimb.
has_exact_synonym: abnormally small regenerating forelimb

decreased size of the regenerating hindlimb
type: Class
subclass of: abnormal regenerating hindlimb morphology
subclass of: XPO_0128578
definition: An abnormal reduction in the size of the regenerating hindlimb.
has_exact_synonym: abnormally small regenerating hindlimb

decreased size of the spinal cord
type: Class
subclass of: abnormal spinal cord morphology
subclass of: XPO_0128043
definition: An abnormal reduction in the size of the spinal cord.
has_exact_synonym: abnormally small spinal cord

decreased size of the stomach
type: Class
subclass of: abnormal stomach morphology
subclass of: XPO_0128043
subclass of: XPO_0128113
definition: An abnormal reduction in the size of the stomach.
has_exact_synonym: abnormally small stomach

decreased size of the tail
type: Class
subclass of: abnormal tail morphology
subclass of: XPO_0128026
definition: An abnormal reduction in the size of the tail.
has_exact_synonym: abnormally small tail

obsolete decreased size of the tail region
type: Class
IAO_0000125: decreased size of the tail
deprecated: true

decreased size of the tibia-fibula
type: Class
subclass of: abnormal tibia-fibula morphology
subclass of: XPO_0128017
definition: An abnormal reduction in the size of the tibia-fibula.
has_exact_synonym: abnormally small tibia-fibula

decreased size of the trunk
type: Class
subclass of: abnormal trunk morphology
subclass of: XPO_0128026
definition: An abnormal reduction in the size of the trunk.
has_exact_synonym: abnormally small trunk

obsolete decreased size of the trunk region
type: Class
IAO_0000125: decreased size of the trunk
deprecated: true

decreased size of the trunk somite
type: Class
subclass of: abnormal trunk somite morphology
subclass of: decreased size of the somite
definition: An abnormal reduction in the size of the trunk somite.
has_exact_synonym: abnormally small trunk somite

decreased size of the whole organism
type: Class
subclass of: abnormal whole organism morphology
subclass of: XPO_0128007
definition: An abnormal reduction in the size of the whole organism.
has_exact_synonym: abnormally small whole organism

increased size of the barbel
type: Class
subclass of: abnormal barbel morphology
subclass of: XPO_0129529
definition: An increase in the size of the barbel.
has_exact_synonym: enlarged barbel

increased size of the cardiac ventricle
type: Class
subclass of: abnormal cardiac ventricle morphology
subclass of: XPO_0129523
definition: An increase in the size of the cardiac ventricle.
has_exact_synonym: enlarged cardiac ventricle

increased size of the cement gland
type: Class
subclass of: abnormal cement gland morphology
subclass of: XPO_0129529
definition: An increase in the size of the cement gland.
has_exact_synonym: enlarged cement gland

increased size of the central endoderm
type: Class
subclass of: abnormal central endoderm morphology
subclass of: XPO_0129483
definition: An increase in the size of the central endoderm.
has_exact_synonym: enlarged central endoderm

increased size of the eye
type: Class
subclass of: abnormal eye morphology
subclass of: XPO_0129523
definition: An increase in the size of the eye.
has_exact_synonym: enlarged eye

increased size of the forelimb
type: Class
subclass of: abnormal forelimb morphology
subclass of: XPO_0129777
definition: An increase in the size of the forelimb.
has_exact_synonym: enlarged forelimb

increased size of the forelimb bud
type: Class
subclass of: abnormal forelimb bud morphology
subclass of: XPO_0129528
definition: An increase in the size of the forelimb bud.
has_exact_synonym: enlarged forelimb bud

increased size of the heart primordium
type: Class
subclass of: abnormal heart primordium morphology
subclass of: XPO_0129559
definition: An increase in the size of the heart primordium.
has_exact_synonym: enlarged heart primordium

increased size of the goblet cell
type: Class
subclass of: abnormal goblet cell morphology
subclass of: XPO_0129797
definition: An increase in the size of the goblet cell.
has_exact_synonym: enlarged goblet cell

increased size of the head
type: Class
subclass of: abnormal head morphology
subclass of: XPO_0129506
definition: An increase in the size of the head.
has_exact_synonym: enlarged head

increased size of the heart
type: Class
subclass of: abnormal heart morphology
subclass of: XPO_0129523
subclass of: XPO_0129593
definition: An increase in the size of the heart.
has_exact_synonym: enlarged heart

increased size of the hindlimb
type: Class
subclass of: abnormal hindlimb morphology
subclass of: XPO_0129777
definition: An increase in the size of the hindlimb.
has_exact_synonym: enlarged hindlimb

increased size of the hindlimb bud
type: Class
subclass of: abnormal hindlimb bud morphology
subclass of: XPO_0129528
definition: An increase in the size of the hindlimb bud.
has_exact_synonym: enlarged hindlimb bud

increased size of the left atrium
type: Class
subclass of: abnormal left atrium morphology
subclass of: XPO_0129523
definition: An increase in the size of the left atrium.
has_exact_synonym: enlarged left atrium

increased size of the myotome
type: Class
subclass of: abnormal myotome morphology
subclass of: XPO_0129483
definition: An increase in the size of the myotome.
has_exact_synonym: enlarged myotome

increased size of the neural tube
type: Class
subclass of: abnormal neural tube morphology
subclass of: XPO_0129491
definition: An increase in the size of the neural tube.
has_exact_synonym: enlarged neural tube

increased size of the pancreas
type: Class
subclass of: abnormal pancreas morphology
subclass of: XPO_0129593
subclass of: XPO_0129594
definition: An increase in the size of the pancreas.
has_exact_synonym: enlarged pancreas

increased size of the primary heart field
type: Class
subclass of: abnormal primary heart field morphology
subclass of: XPO_0129483
definition: An increase in the size of the primary heart field.
has_exact_synonym: enlarged primary heart field

increased size of the pronephric tubule
type: Class
subclass of: abnormal pronephric tubule morphology
subclass of: XPO_0129483
definition: An increase in the size of the pronephric tubule.
has_exact_synonym: enlarged pronephric tubule

increased size of the right atrium
type: Class
subclass of: abnormal right atrium morphology
subclass of: XPO_0129523
definition: An increase in the size of the right atrium.
has_exact_synonym: enlarged right atrium

increased size of the somite
type: Class
subclass of: abnormal somite morphology
subclass of: XPO_0129483
definition: An increase in the size of the somite.
has_exact_synonym: enlarged somite

increased size of the tail somite
type: Class
subclass of: abnormal tail somite morphology
subclass of: increased size of the somite
definition: An increase in the size of the tail somite.
has_exact_synonym: enlarged tail somite

increased size of the trunk somite
type: Class
subclass of: abnormal trunk somite morphology
subclass of: increased size of the somite
definition: An increase in the size of the trunk somite.
has_exact_synonym: enlarged trunk somite

increased size of the ventricular outflow tract
type: Class
subclass of: abnormal ventricular outflow tract morphology
subclass of: XPO_0129488
definition: An increase in the size of the ventricular outflow tract.
has_exact_synonym: enlarged ventricular outflow tract

abnormally increased number of filamentous actin in the blastocoel roof
type: Class
subclass of: abnormal blastocoel roof
definition: The presence of an increased number of filamentous actin in the blastocoel roof.
has_exact_synonym: Extra filamentous actin in the blastocoel roof

abnormally increased number of bone element in the forelimb
type: Class
subclass of: abnormal bone element
subclass of: abnormal forelimb
definition: The presence of an increased number of bone element in the forelimb.
has_exact_synonym: Extra bone element in the forelimb

abnormally increased number of dense core granule in the goblet cell
type: Class
subclass of: abnormal goblet cell
definition: The presence of an increased number of dense core granule in the goblet cell.
has_exact_synonym: Extra dense core granule in the goblet cell

abnormally increased number of iridophore in the hindlimb bud
type: Class
subclass of: abnormal hindlimb bud
subclass of: XPO_0131084
definition: The presence of an increased number of iridophore in the hindlimb bud.
has_exact_synonym: Extra iridophore in the hindlimb bud

abnormally increased number of bone element in the hindlimb
type: Class
subclass of: abnormal bone element
subclass of: abnormal hindlimb
definition: The presence of an increased number of bone element in the hindlimb.
has_exact_synonym: Extra bone element in the hindlimb

abnormally increased number of cartilage element in the hindlimb
type: Class
subclass of: abnormal cartilage element
subclass of: abnormal hindlimb
definition: The presence of an increased number of cartilage element in the hindlimb.
has_exact_synonym: Extra cartilage element in the hindlimb

abnormally increased number of cartilage element in the forelimb
type: Class
subclass of: abnormal cartilage element
subclass of: abnormal forelimb
definition: The presence of an increased number of cartilage element in the forelimb.
has_exact_synonym: Extra cartilage element in the forelimb

obsolete increased number of multiciliated cell in the epidermis inner layer
type: Class
deprecated: true

abnormally increased number of neural progenitor cell in the optic tectum
type: Class
subclass of: abnormal optic tectum
subclass of: XPO_0130976
definition: The presence of an increased number of neural progenitor cell in the optic tectum.
has_exact_synonym: Extra neural progenitor cell in the optic tectum

abnormally increased number of neuron in the optic tectum
type: Class
subclass of: abnormal optic tectum
subclass of: XPO_0130970
definition: The presence of an increased number of neuron in the optic tectum.
has_exact_synonym: Extra neuron in the optic tectum

abnormally increased number of cartilage element in the regenerating hindlimb
type: Class
subclass of: abnormal cartilage element
subclass of: abnormal regenerating hindlimb
definition: The presence of an increased number of cartilage element in the regenerating hindlimb.
has_exact_synonym: Extra cartilage element in the regenerating hindlimb

abnormally increased number of cartilage element in the regenerating forelimb
type: Class
subclass of: abnormal cartilage element
subclass of: abnormal regenerating forelimb
definition: The presence of an increased number of cartilage element in the regenerating forelimb.
has_exact_synonym: Extra cartilage element in the regenerating forelimb

abnormally increased number of claw of hindlimb digit 1 in the regenerating hindlimb
type: Class
subclass of: abnormal regenerating hindlimb
subclass of: abnormal claw of hindlimb digit 1
definition: The presence of an increased number of claw of hindlimb digit 1 in the regenerating hindlimb.
has_exact_synonym: Extra claw of hindlimb digit 1 in the regenerating hindlimb

abnormally increased number of claw of hindlimb digit 2 in the regenerating hindlimb
type: Class
subclass of: abnormal claw of hindlimb digit 2
subclass of: abnormal regenerating hindlimb
definition: The presence of an increased number of claw of hindlimb digit 2 in the regenerating hindlimb.
has_exact_synonym: Extra claw of hindlimb digit 2 in the regenerating hindlimb

abnormally increased number of claw of hindlimb digit 3 in the regenerating hindlimb
type: Class
subclass of: abnormal claw of hindlimb digit 3
subclass of: abnormal regenerating hindlimb
definition: The presence of an increased number of claw of hindlimb digit 3 in the regenerating hindlimb.
has_exact_synonym: Extra claw of hindlimb digit 3 in the regenerating hindlimb

abnormally increased number of claw of hindlimb digit 4 in the regenerating hindlimb
type: Class
subclass of: abnormal regenerating hindlimb
subclass of: abnormal claw of hindlimb digit 4
definition: The presence of an increased number of claw of hindlimb digit 4 in the regenerating hindlimb.
has_exact_synonym: Extra claw of hindlimb digit 4 in the regenerating hindlimb

abnormally increased number of claw of hindlimb digit 5 in the regenerating hindlimb
type: Class
subclass of: abnormal regenerating hindlimb
subclass of: abnormal claw of hindlimb digit 5
definition: The presence of an increased number of claw of hindlimb digit 5 in the regenerating hindlimb.
has_exact_synonym: Extra claw of hindlimb digit 5 in the regenerating hindlimb

abnormally increased number of hindlimb digit in the regenerating hindlimb
type: Class
subclass of: abnormal regenerating hindlimb
subclass of: abnormally increased number of hindlimb digit
definition: The presence of an increased number of hindlimb digit in the regenerating hindlimb.
has_exact_synonym: Extra hindlimb digit in the regenerating hindlimb

abnormally increased number of vacuole in the spermatozoon
type: Class
subclass of: abnormal spermatozoon
definition: The presence of an increased number of vacuole in the spermatozoon.
has_exact_synonym: Extra vacuole in the spermatozoon

decreased size of the barbel
type: Class
subclass of: abnormal barbel morphology
subclass of: XPO_0128049
definition: An abnormal reduction in the size of the barbel.
has_exact_synonym: abnormally small barbel

decreased size of the cardiac ventricle
type: Class
subclass of: abnormal cardiac ventricle morphology
subclass of: XPO_0128043
definition: An abnormal reduction in the size of the cardiac ventricle.
has_exact_synonym: abnormally small cardiac ventricle

decreased size of the central endoderm
type: Class
subclass of: abnormal central endoderm morphology
subclass of: XPO_0128003
definition: An abnormal reduction in the size of the central endoderm.
has_exact_synonym: abnormally small central endoderm

decreased size of the forelimb bud
type: Class
subclass of: abnormal forelimb bud morphology
subclass of: XPO_0128048
definition: An abnormal reduction in the size of the forelimb bud.
has_exact_synonym: abnormally small forelimb bud

decreased size of the heart primordium
type: Class
subclass of: abnormal heart primordium morphology
subclass of: XPO_0128079
definition: An abnormal reduction in the size of the heart primordium.
has_exact_synonym: abnormally small heart primordium

decreased size of the goblet cell
type: Class
subclass of: abnormal goblet cell morphology
subclass of: XPO_0128317
definition: An abnormal reduction in the size of the goblet cell.
has_exact_synonym: abnormally small goblet cell

decreased size of the left atrium
type: Class
subclass of: abnormal left atrium morphology
subclass of: XPO_0128043
definition: An abnormal reduction in the size of the left atrium.
has_exact_synonym: abnormally small left atrium

decreased size of the neural tube
type: Class
subclass of: abnormal neural tube morphology
subclass of: XPO_0128011
definition: An abnormal reduction in the size of the neural tube.
has_exact_synonym: abnormally small neural tube

decreased size of the primary heart field
type: Class
subclass of: abnormal primary heart field morphology
subclass of: XPO_0128003
definition: An abnormal reduction in the size of the primary heart field.
has_exact_synonym: abnormally small primary heart field

decreased size of the pronephric tubule
type: Class
subclass of: abnormal pronephric tubule morphology
subclass of: XPO_0128003
definition: An abnormal reduction in the size of the pronephric tubule.
has_exact_synonym: abnormally small pronephric tubule

decreased size of the right atrium
type: Class
subclass of: abnormal right atrium morphology
subclass of: XPO_0128043
definition: An abnormal reduction in the size of the right atrium.
has_exact_synonym: abnormally small right atrium

decreased size of the somite
type: Class
subclass of: abnormal somite morphology
subclass of: XPO_0128003
definition: An abnormal reduction in the size of the somite.
has_exact_synonym: abnormally small somite

decreased size of the tail somite
type: Class
subclass of: abnormal tail somite morphology
subclass of: decreased size of the somite
definition: An abnormal reduction in the size of the tail somite.
has_exact_synonym: abnormally small tail somite

decreased size of the ventricular outflow tract
type: Class
subclass of: abnormal ventricular outflow tract morphology
subclass of: XPO_0128008
definition: An abnormal reduction in the size of the ventricular outflow tract.
has_exact_synonym: abnormally small ventricular outflow tract

decreased size of the anterior-posterior axis
type: Class
subclass of: abnormal anterior-posterior axis morphology
subclass of: XPO_0128502
definition: An abnormal reduction in the size of the anterior-posterior axis.
has_exact_synonym: abnormally small anterior-posterior axis

decreased size of the apical junction complex
type: Class
subclass of: abnormal apical junction complex morphology
subclass of: XPO_0128071
definition: An abnormal reduction in the size of the apical junction complex.
has_exact_synonym: abnormally small apical junction complex

decreased size of the foot
type: Class
subclass of: abnormal foot morphology
subclass of: XPO_0128055
definition: An abnormal reduction in the size of the foot.
has_exact_synonym: abnormally small foot

decreased size of the forelimb digit
type: Class
subclass of: abnormal forelimb digit morphology
subclass of: XPO_0128213
definition: An abnormal reduction in the size of the forelimb digit.
has_exact_synonym: abnormally small forelimb digit

decreased size of the germ cell
type: Class
subclass of: abnormal germ cell morphology
subclass of: XPO_0128006
definition: An abnormal reduction in the size of the germ cell.
has_exact_synonym: abnormally small germ cell

decreased size of the hand
type: Class
subclass of: abnormal hand morphology
subclass of: XPO_0128055
definition: An abnormal reduction in the size of the hand.
has_exact_synonym: abnormally small hand

decreased size of the head mesenchyme
type: Class
subclass of: abnormal head mesenchyme morphology
subclass of: XPO_0128343
definition: An abnormal reduction in the size of the head mesenchyme.
has_exact_synonym: abnormally small head mesenchyme

decreased size of the hindlimb digit
type: Class
subclass of: abnormal hindlimb digit morphology
subclass of: XPO_0128213
definition: An abnormal reduction in the size of the hindlimb digit.
has_exact_synonym: abnormally small hindlimb digit

obsolete decreased size of the left part of branchial arch skeleton
type: Class
deprecated: true

decreased size of the proximal-distal axis
type: Class
subclass of: abnormal proximal-distal axis morphology
subclass of: XPO_0128502
definition: An abnormal reduction in the size of the proximal-distal axis.
has_exact_synonym: abnormally small proximal-distal axis

obsolete decreased size of the right part of branchial arch skeleton
type: Class
deprecated: true

increased height of the dorsal-ventral axis
type: Class
subclass of: abnormal dorsal-ventral axis morphology
subclass of: XPO_0129982
definition: An increase in the height of the dorsal-ventral axis.
has_exact_synonym: higher dorsal-ventral axis

increased cell population proliferation in myotome
type: Class
subclass of: increased cell population proliferation
definition: Increased cell population proliferation in myotome.

increased oviduct development in female organism
type: Class
subclass of: XPO_0133403
definition: Increased oviduct development in female organism.

abnormal dorsal/ventral axis specification
type: Class
subclass of: abnormal axis specification
definition: Abnormal dorsal/ventral axis specification.

abnormal gastrulation
type: Class
subclass of: XPO_0133403
definition: Abnormal gastrulation.

abnormal left/right axis specification
type: Class
subclass of: abnormal axis specification
definition: Abnormal left/right axis specification.

abnormal proximal/distal axis specification
type: Class
subclass of: abnormal axis specification
definition: Abnormal proximal/distal axis specification.

abnormal anterior/posterior axis specification
type: Class
subclass of: abnormal axis specification
definition: Abnormal anterior/posterior axis specification.

abnormal incomplete closing of the anterior neural fold
type: Class
subclass of: abnormal anterior neural fold morphology
definition: Abnormally incompletely closed anterior neural fold.
has_exact_synonym: abnormally incompletely closed anterior neural fold

obsolete abnormal incomplete closing of the anterior neural tube
type: Class
IAO_0000125: XPO_0131750
deprecated: true

abnormal incomplete closing of the blastopore
type: Class
subclass of: abnormal blastopore morphology
definition: Abnormally incompletely closed blastopore.
has_exact_synonym: abnormally incompletely closed blastopore

abnormal incomplete closing of the choroid fissure
type: Class
subclass of: abnormal choroid fissure morphology
definition: Abnormally incompletely closed choroid fissure.
has_exact_synonym: abnormally incompletely closed choroid fissure

abnormal incomplete closing of the neural fold
type: Class
subclass of: abnormal neural fold morphology
definition: Abnormally incompletely closed neural fold.
has_exact_synonym: abnormally incompletely closed neural fold

abnormal incomplete closing of the neural tube
type: Class
subclass of: abnormally open neural tube
definition: Abnormally incompletely closed neural tube.
has_exact_synonym: abnormally incompletely closed neural tube

obsolete bifurcated left hindlimb
type: Class
deprecated: true

obsolete bifurcated right hindlimb
type: Class
deprecated: true

obsolete bifurcated left forelimb
type: Class
deprecated: true

obsolete bifurcated right forelimb
type: Class
deprecated: true

bifurcated forelimb
type: Class
subclass of: abnormal forelimb morphology
definition: Bifurcation of the forelimb.
has_exact_synonym: forelimb bifurcation

bifurcated hindlimb
type: Class
subclass of: abnormal hindlimb morphology
definition: Bifurcation of the hindlimb.
has_exact_synonym: hindlimb bifurcation

bifurcated hindlimb digit 1
type: Class
subclass of: abnormal hindlimb digit 1 morphology
definition: Bifurcation of the hindlimb digit 1.
has_exact_synonym: hindlimb digit 1 bifurcation

bifurcated hindlimb digit 2
type: Class
subclass of: abnormal hindlimb digit 2 morphology
definition: Bifurcation of the hindlimb digit 2.
has_exact_synonym: hindlimb digit 2 bifurcation

bifurcated hindlimb digit 3
type: Class
subclass of: abnormal hindlimb digit 3 morphology
definition: Bifurcation of the hindlimb digit 3.
has_exact_synonym: hindlimb digit 3 bifurcation

bifurcated hindlimb digit 4
type: Class
subclass of: abnormal hindlimb digit 4 morphology
definition: Bifurcation of the hindlimb digit 4.
has_exact_synonym: hindlimb digit 4 bifurcation

bifurcated hindlimb digit 5
type: Class
subclass of: abnormal hindlimb digit 5 morphology
definition: Bifurcation of the hindlimb digit 5.
has_exact_synonym: hindlimb digit 5 bifurcation

bifurcated forelimb digit 2
type: Class
subclass of: abnormal forelimb digit 2 morphology
definition: Bifurcation of the forelimb digit 2.
has_exact_synonym: forelimb digit 2 bifurcation

bifurcated forelimb digit 3
type: Class
subclass of: abnormal forelimb digit 3 morphology
definition: Bifurcation of the forelimb digit 3.
has_exact_synonym: forelimb digit 3 bifurcation

bifurcated forelimb digit 4
type: Class
subclass of: abnormal forelimb digit 4 morphology
definition: Bifurcation of the forelimb digit 4.
has_exact_synonym: forelimb digit 4 bifurcation

bifurcated forelimb digit 5
type: Class
subclass of: abnormal forelimb digit 5 morphology
definition: Bifurcation of the forelimb digit 5.
has_exact_synonym: forelimb digit 5 bifurcation

obsolete bifurcated anterior-posterior axis
type: Class
IAO_0000125: duplicated anterior-posterior axis
deprecated: true

abnormal closing of the posterior neural tube
type: Class
subclass of: abnormal posterior neural tube morphology
definition: Abnormally closed posterior neural tube.
has_exact_synonym: abnormally closed posterior neural tube

decreased length of anterior neural fold
type: Class
subclass of: XPO_0128414
definition: Decreased length or shortening of the anterior neural fold.
has_exact_synonym: short anterior neural fold

decreased length of anterior-posterior axis
type: Class
subclass of: decreased size of the anterior-posterior axis
definition: Decreased length or shortening of the anterior-posterior axis.
has_exact_synonym: short anterior-posterior axis

decreased length of archenteron
type: Class
subclass of: decreased size of the archenteron
definition: Decreased length or shortening of the archenteron.
has_exact_synonym: short archenteron

decreased length of glossopharyngeal nerve
type: Class
subclass of: XPO_0128696
definition: Decreased length or shortening of the glossopharyngeal nerve.
has_exact_synonym: short glossopharyngeal nerve

decreased length of facial nerve
type: Class
subclass of: XPO_0128759
definition: Decreased length or shortening of the facial nerve.
has_exact_synonym: short facial nerve

decreased length of vagus nerve
type: Class
subclass of: XPO_0129142
definition: Decreased length or shortening of the vagus nerve.
has_exact_synonym: short vagus nerve

decreased length of femur
type: Class
subclass of: XPO_0128252
definition: Decreased length or shortening of the femur.
has_exact_synonym: short femur

decreased length of forelimb
type: Class
subclass of: decreased size of the forelimb
definition: Decreased length or shortening of the forelimb.
has_exact_synonym: short forelimb

decreased length of forelimb stylopod
type: Class
subclass of: XPO_0128714
definition: Decreased length or shortening of the forelimb stylopod.
has_exact_synonym: short forelimb stylopod

decreased length of forelimb zeugopod
type: Class
subclass of: XPO_0128873
definition: Decreased length or shortening of the forelimb zeugopod.
has_exact_synonym: short forelimb zeugopod

decreased length of hindlimb
type: Class
subclass of: decreased size of the hindlimb
definition: Decreased length or shortening of the hindlimb.
has_exact_synonym: short hindlimb

decreased length of hindlimb digit
type: Class
subclass of: decreased size of the hindlimb digit
definition: Decreased length or shortening of the hindlimb digit.
has_exact_synonym: short hindlimb digit

decreased length of tibia-fibula
type: Class
subclass of: decreased size of the tibia-fibula
definition: Decreased length or shortening of the tibia-fibula.
has_exact_synonym: short tibia-fibula

decreased length of humerus
type: Class
subclass of: XPO_0128016
definition: Decreased length or shortening of the humerus.
has_exact_synonym: short humerus

decreased length of notochord
type: Class
subclass of: decreased size of the notochord
definition: Decreased length or shortening of the notochord.
has_exact_synonym: short notochord

decreased length of regenerating tail
type: Class
subclass of: XPO_0128676
definition: Decreased length or shortening of the regenerating tail.
has_exact_synonym: short regenerating tail

decreased length of spinal nerve
type: Class
subclass of: XPO_0129135
definition: Decreased length or shortening of the spinal nerve.
has_exact_synonym: short spinal nerve

decreased length of tail
type: Class
subclass of: decreased size of the tail
definition: Decreased length or shortening of the tail.
has_exact_synonym: short tail

decreased length of tarsus
type: Class
subclass of: XPO_0129337
definition: Decreased length or shortening of the tarsus.
has_exact_synonym: short tarsus

decreased length of trunk
type: Class
subclass of: decreased size of the trunk
definition: Decreased length or shortening of the trunk.
has_exact_synonym: short trunk

decreased length of whole organism
type: Class
subclass of: decreased size of the whole organism
definition: Decreased length or shortening of the whole organism.
has_exact_synonym: short whole organism

obsolete decreased length of posterior region
type: Class
deprecated: true

decreased length of dorsal-ventral axis
type: Class
subclass of: abnormal dorsal-ventral axis morphology
subclass of: XPO_0128502
definition: Decreased length or shortening of the dorsal-ventral axis.
has_exact_synonym: short dorsal-ventral axis

decreased length of trigeminal nerve
type: Class
subclass of: XPO_0129192
definition: Decreased length or shortening of the trigeminal nerve.
has_exact_synonym: short trigeminal nerve

abnormally decreased number of forelimb digit
type: Class
subclass of: abnormal number of forelimb digits
definition: The presence of a reduced number of forelimb digit.
has_exact_synonym: Reduced number of forelimb digit

obsolete decreased number of forelimb digit 2
type: Class
deprecated: true

obsolete decreased number of forelimb digit 3
type: Class
deprecated: true

obsolete decreased number of forelimb digit 4
type: Class
deprecated: true

obsolete decreased number of forelimb digit 5
type: Class
deprecated: true

abnormally decreased number of hindlimb digit
type: Class
subclass of: abnormal number of hindlimb digits
definition: The presence of a reduced number of hindlimb digit.
has_exact_synonym: Reduced number of hindlimb digit

obsolete decreased number of hindlimb digit 1
type: Class
deprecated: true

obsolete decreased number of hindlimb digit 2
type: Class
deprecated: true

obsolete decreased number of hindlimb digit 3
type: Class
deprecated: true

obsolete decreased number of hindlimb digit 4
type: Class
deprecated: true

obsolete decreased number of hindlimb digit 5
type: Class
deprecated: true

abnormally decreased number of foot
type: Class
subclass of: abnormal foot
definition: The presence of a reduced number of foot.
has_exact_synonym: Reduced number of foot

abnormally decreased number of tibia-fibula
type: Class
subclass of: abnormal tibia-fibula
definition: The presence of a reduced number of tibia-fibula.
has_exact_synonym: Reduced number of tibia-fibula

abnormally decreased number of melanophore
type: Class
subclass of: abnormal melanophore
subclass of: XPO_0131199
definition: The presence of a reduced number of melanophore.
has_exact_synonym: Reduced number of melanophore

abnormally decreased number of proximal tubule
type: Class
subclass of: abnormal proximal tubule
definition: The presence of a reduced number of proximal tubule.
has_exact_synonym: Reduced number of proximal tubule

tail abnormally curved dorsally
type: Class
subclass of: abnormal tail morphology
definition: Any abnormal tail that is curved dorsally.
has_exact_synonym: curved dorsal tail

trunk abnormally curved dorsally
type: Class
subclass of: abnormal trunk morphology
definition: Any abnormal trunk that is curved dorsally.
has_exact_synonym: curved dorsal trunk

whole organism abnormally curved dorsally
type: Class
subclass of: abnormal whole organism morphology
definition: Any abnormal whole organism that is curved dorsally.
has_exact_synonym: curved dorsal whole organism

abnormal anterior-posterior axis, curved dorsal
type: Class
subclass of: abnormal anterior-posterior axis morphology
definition: Any abnormal anterior-posterior axis that is curved dorsally.
has_exact_synonym: curved dorsal anterior-posterior axis

obsolete increased size of the mesoderm in trunk region
type: Class
IAO_0000125: XPO_0130962
deprecated: true

obsolete increased size of the neuroectoderm in head region
type: Class
IAO_0000125: XPO_0130963
deprecated: true

increased size of the iridophore in epidermis
type: Class
subclass of: abnormal epidermis
subclass of: XPO_0130200
definition: An increase in the size of the iridophore in the epidermis.
has_exact_synonym: enlarged iridophore in epidermis

obsolete increased size of the autopod in regenerating hindlimb
type: Class
IAO_0000125: XPO_0141319
deprecated: true

increased size of the spike in regenerating hindlimb
type: Class
subclass of: abnormal regenerating hindlimb
subclass of: XPO_0130524
definition: An increase in the size of the spike in the regenerating hindlimb.
has_exact_synonym: enlarged spike in regenerating hindlimb

increased size of the cell in cranial neural crest
type: Class
subclass of: abnormal cranial neural crest
subclass of: XPO_0129486
definition: An increase in the size of the cell in the cranial neural crest.
has_exact_synonym: enlarged cell in cranial neural crest

abnormally increased number of forelimb digit in the regenerating forelimb
type: Class
subclass of: abnormal regenerating forelimb
subclass of: abnormally increased number of forelimb digit
definition: The presence of an increased number of forelimb digit in the regenerating forelimb.
has_exact_synonym: Extra forelimb digit in the regenerating forelimb

obsolete increased number of hindlimb digit in the regenerating hindlimb
type: Class
IAO_0000125: abnormally increased number of hindlimb digit in the regenerating hindlimb
deprecated: true

abnormal number of forelimb digits
type: Class
subclass of: abnormal forelimb digit
definition: Any structural anomaly that causes there to be an abnormal number forelimb digit.
has_exact_synonym: abnormal number of forelimb digits
has_exact_synonym: altered number of forelimb digits

abnormal number of metacarpal bones
type: Class
subclass of: abnormal metacarpus
definition: Any structural anomaly that causes there to be an abnormal number metacarpus.
has_exact_synonym: abnormal number of metacarpuss
has_exact_synonym: altered number of metacarpuss

abnormal number of hindlimb digits
type: Class
subclass of: abnormal hindlimb digit
definition: Any structural anomaly that causes there to be an abnormal number hindlimb digit.
has_exact_synonym: abnormal number of hindlimb digits
has_exact_synonym: altered number of hindlimb digits

abnormal number of hindlimb digit 1
type: Class
subclass of: abnormal hindlimb digit 1
subclass of: abnormal number of hindlimb digits
definition: Any structural anomaly that causes there to be an abnormal number hindlimb digit 1.
has_exact_synonym: abnormal number of hindlimb digit 1s
has_exact_synonym: altered number of hindlimb digit 1s

abnormal number of hindlimb digit 2
type: Class
subclass of: abnormal hindlimb digit 2
subclass of: abnormal number of hindlimb digits
definition: Any structural anomaly that causes there to be an abnormal number hindlimb digit 2.
has_exact_synonym: abnormal number of hindlimb digit 2s
has_exact_synonym: altered number of hindlimb digit 2s

abnormal number of hindlimb digit 3
type: Class
subclass of: abnormal hindlimb digit 3
subclass of: abnormal number of hindlimb digits
definition: Any structural anomaly that causes there to be an abnormal number hindlimb digit 3.
has_exact_synonym: abnormal number of hindlimb digit 3s
has_exact_synonym: altered number of hindlimb digit 3s

abnormal number of hindlimb digit 4
type: Class
subclass of: abnormal hindlimb digit 4
subclass of: abnormal number of hindlimb digits
definition: Any structural anomaly that causes there to be an abnormal number hindlimb digit 4.
has_exact_synonym: abnormal number of hindlimb digit 4s
has_exact_synonym: altered number of hindlimb digit 4s

abnormal number of hindlimb digit 5
type: Class
subclass of: abnormal hindlimb digit 5
subclass of: abnormal number of hindlimb digits
definition: Any structural anomaly that causes there to be an abnormal number hindlimb digit 5.
has_exact_synonym: abnormal number of hindlimb digit 5s
has_exact_synonym: altered number of hindlimb digit 5s

abnormal number of forelimb digit 2
type: Class
subclass of: abnormal forelimb digit 2
subclass of: abnormal number of forelimb digits
definition: Any structural anomaly that causes there to be an abnormal number forelimb digit 2.
has_exact_synonym: abnormal number of forelimb digit 2s
has_exact_synonym: altered number of forelimb digit 2s

abnormal number of forelimb digit 3
type: Class
subclass of: abnormal forelimb digit 3
subclass of: abnormal number of forelimb digits
definition: Any structural anomaly that causes there to be an abnormal number forelimb digit 3.
has_exact_synonym: abnormal number of forelimb digit 3s
has_exact_synonym: altered number of forelimb digit 3s

abnormal number of forelimb digit 4
type: Class
subclass of: abnormal forelimb digit 4
subclass of: abnormal number of forelimb digits
definition: Any structural anomaly that causes there to be an abnormal number forelimb digit 4.
has_exact_synonym: abnormal number of forelimb digit 4s
has_exact_synonym: altered number of forelimb digit 4s

abnormal number of forelimb digit 5
type: Class
subclass of: abnormal forelimb digit 5
subclass of: abnormal number of forelimb digits
definition: Any structural anomaly that causes there to be an abnormal number forelimb digit 5.
has_exact_synonym: abnormal number of forelimb digit 5s
has_exact_synonym: altered number of forelimb digit 5s

absent axon regeneration in optic nerve
type: Class
subclass of: absent biological process
definition: Absent or undetectable axon regeneration in optic nerve.

absent anterior/posterior pattern specification in midgut
type: Class
subclass of: absent biological process
definition: Absent or undetectable anterior/posterior pattern specification in midgut.

absent mitotic cytokinesis in primary spermatogonium
type: Class
subclass of: absent biological process
definition: Absent or undetectable mitotic cytokinesis in primary spermatogonium.

abnormally increased number of hindlimb
type: Class
subclass of: abnormal hindlimb
definition: The presence of an increased number of hindlimb.
has_exact_synonym: Extra hindlimb

abnormally increased number of hindlimb digit
type: Class
subclass of: abnormal number of hindlimb digits
subclass of: abnormally increased number of digit
definition: The presence of an increased number of hindlimb digit.
has_exact_synonym: Extra hindlimb digit

abnormally increased number of foot
type: Class
subclass of: abnormal foot
definition: The presence of an increased number of foot.
has_exact_synonym: Extra foot

abnormally increased number of hindlimb zeugopod
type: Class
subclass of: abnormal hindlimb zeugopod
definition: The presence of an increased number of hindlimb zeugopod.
has_exact_synonym: Extra hindlimb zeugopod

abnormally increased number of proximal tubule
type: Class
subclass of: abnormal proximal tubule
definition: The presence of an increased number of proximal tubule.
has_exact_synonym: Extra proximal tubule

abnormally increased number of apoptotic cell
type: Class
subclass of: abnormal apoptotic cell
subclass of: XPO_0130964
definition: The presence of an increased number of apoptotic cell.
has_exact_synonym: Extra apoptotic cell

abnormally increased number of digit
type: Class
subclass of: abnormal digit
definition: The presence of an increased number of digit.
has_exact_synonym: Extra digit

abnormally increased number of ciliated epidermal cell
type: Class
subclass of: abnormal ciliated epidermal cell
subclass of: XPO_0130989
subclass of: XPO_0131041
definition: The presence of an increased number of ciliated epidermal cell.
has_exact_synonym: Extra ciliated epidermal cell

abnormally increased number of forelimb digit
type: Class
subclass of: abnormal number of forelimb digits
subclass of: abnormally increased number of digit
definition: The presence of an increased number of forelimb digit.
has_exact_synonym: Extra forelimb digit

obsolete increased number of hindlimb digit
type: Class
IAO_0000125: abnormally increased number of hindlimb digit
deprecated: true

abnormally increased number of melanoblast
type: Class
subclass of: abnormal melanoblast
subclass of: XPO_0130964
definition: The presence of an increased number of melanoblast.
has_exact_synonym: Extra melanoblast

abnormally increased number of melanophore
type: Class
subclass of: abnormal melanophore
subclass of: XPO_0130983
definition: The presence of an increased number of melanophore.
has_exact_synonym: Extra melanophore

abnormally increased number of non-ciliated epithelial cell
type: Class
subclass of: abnormal non-ciliated epithelial cell
subclass of: XPO_0130978
definition: The presence of an increased number of non-ciliated epithelial cell.
has_exact_synonym: Extra non-ciliated epithelial cell

increased thickness of the epidermis in hindlimb bud
type: Class
subclass of: abnormal hindlimb bud
subclass of: increased thickness of the epidermis
definition: An increase in the thickness of the epidermis in the hindlimb bud.
has_exact_synonym: thickened epidermis in hindlimb bud

increased thickness of the epidermis in forelimb bud
type: Class
subclass of: abnormal forelimb bud
subclass of: increased thickness of the epidermis
definition: An increase in the thickness of the epidermis in the forelimb bud.
has_exact_synonym: thickened epidermis in forelimb bud

increased cell population proliferation
type: Class
subclass of: abnormal biological process
definition: Increased cell population proliferation.

abnormally decreased number of cilium in the ciliated epidermal cell
type: Class
subclass of: abnormal ciliated epidermal cell
subclass of: XPO_0133471
definition: The presence of a reduced number of cilium in the ciliated epidermal cell.
has_exact_synonym: Reduced number of cilium in the ciliated epidermal cell

abnormally decreased number of cilium in the multiciliated cell
type: Class
subclass of: abnormal multiciliated cell
subclass of: XPO_0133471
definition: The presence of a reduced number of cilium in the multiciliated cell.
has_exact_synonym: Reduced number of cilium in the multiciliated cell

abnormally decreased number of filopodium in the dermatome
type: Class
subclass of: abnormal dermatome
subclass of: abnormal filopodium
definition: The presence of a reduced number of filopodium in the dermatome.
has_exact_synonym: Reduced number of filopodium in the dermatome

abnormally decreased number of filamentous actin in the blastocoel roof
type: Class
subclass of: abnormal blastocoel roof
definition: The presence of a reduced number of filamentous actin in the blastocoel roof.
has_exact_synonym: Reduced number of filamentous actin in the blastocoel roof

abnormally decreased number of trabecula in the heart
type: Class
subclass of: abnormal heart
subclass of: abnormal trabecula
definition: The presence of a reduced number of trabecula in the heart.
has_exact_synonym: Reduced number of trabecula in the heart

obsolete decreased number of melanophore in the tail region
type: Class
IAO_0000125: XPO_0130956
deprecated: true

abnormally decreased number of melanophore in the trunk region
type: Class
subclass of: abnormal trunk region
subclass of: abnormally decreased number of melanophore
definition: The presence of a reduced number of melanophore in the trunk region.
has_exact_synonym: Reduced number of melanophore in the trunk region

obsolete decreased number of migratory neural crest cell in the trunk
type: Class
IAO_0000125: XPO_0130958
deprecated: true

obsolete decreased number of multiciliated cell in the epidermis outer layer
type: Class
deprecated: true

abnormally decreased number of neural progenitor cell in the optic tectum
type: Class
subclass of: abnormal optic tectum
subclass of: XPO_0131192
definition: The presence of a reduced number of neural progenitor cell in the optic tectum.
has_exact_synonym: Reduced number of neural progenitor cell in the optic tectum

abnormally decreased number of neuron in the optic tectum
type: Class
subclass of: abnormal optic tectum
subclass of: XPO_0131186
definition: The presence of a reduced number of neuron in the optic tectum.
has_exact_synonym: Reduced number of neuron in the optic tectum

abnormally decreased number of cell in the proximal tubule
type: Class
subclass of: abnormal proximal tubule
subclass of: XPO_0131180
definition: The presence of a reduced number of cell in the proximal tubule.
has_exact_synonym: Reduced number of cell in the proximal tubule

obsolete decreased number of somite in the ventro-lateral region
type: Class
IAO_0000125: XPO_0130957
deprecated: true

obsolete malformed left part of branchial arch skeleton
type: Class
deprecated: true

obsolete malformed right part of branchial arch skeleton
type: Class
deprecated: true

obsolete malformed left eye
type: Class
deprecated: true

obsolete malformed right eye
type: Class
deprecated: true

obsolete malformed left inner ear
type: Class
deprecated: true

obsolete malformed right inner ear
type: Class
deprecated: true

obsolete malformed left olfactory pit
type: Class
deprecated: true

obsolete malformed right olfactory pit
type: Class
deprecated: true

obsolete malformed left optic vesicle
type: Class
deprecated: true

obsolete malformed right optic vesicle
type: Class
deprecated: true

obsolete malformed posterior region
type: Class
deprecated: true

obsolete malformed ventral trunk
type: Class
deprecated: true

obsolete malformed ventral region
type: Class
deprecated: true

obsolete malformed left part of brain
type: Class
deprecated: true

obsolete malformed right part of brain
type: Class
deprecated: true

obsolete malformed dorsal region
type: Class
deprecated: true

obsolete increased width of hindbrain
type: Class
IAO_0000125: increased size of the hindbrain
deprecated: true

increased width of hindlimb bud
type: Class
subclass of: increased size of the hindlimb bud
definition: Increased width of hindlimb bud.
has_exact_synonym: wider hindlimb bud

increased width of neural plate
type: Class
subclass of: XPO_0129598
definition: Increased width of neural plate.
has_exact_synonym: wider neural plate

increased width of pre-chordal neural plate
type: Class
subclass of: XPO_0129913
definition: Increased width of pre-chordal neural plate.
has_exact_synonym: wider pre-chordal neural plate

increased width of pronephric tubule
type: Class
subclass of: increased size of the pronephric tubule
definition: Increased width of pronephric tubule.
has_exact_synonym: wider pronephric tubule

obsolete malformed cartilage element in head
type: Class
deprecated: true

obsolete malformed Meckel's cartilage in left side
type: Class
deprecated: true

obsolete malformed tarsus in regenerating hindlimb
type: Class
deprecated: true

absent blood in the heart
type: Class
subclass of: abnormal heart
subclass of: absent blood
definition: Absence of the blood in the heart.
has_exact_synonym: Missing blood in the heart

absent cardinal vein in the tail
type: Class
subclass of: abnormal tail
subclass of: absent cardinal vein
definition: Absence of the cardinal vein in the tail.
has_exact_synonym: Missing cardinal vein in the tail

absent cartilage element in the branchial arch
type: Class
subclass of: abnormal branchial arch
subclass of: absent cartilage element
definition: Absence of the cartilage element in the branchial arch.
has_exact_synonym: Missing cartilage element in the branchial arch

absent digit-joint region in the hindlimb digit 1
type: Class
subclass of: abnormal hindlimb digit 1
subclass of: XPO_0125443
definition: Absence of the digit-joint region in the hindlimb digit 1.
has_exact_synonym: Missing digit-joint region in the hindlimb digit 1

absent digit-joint region in the hindlimb digit 2
type: Class
subclass of: abnormal hindlimb digit 2
subclass of: XPO_0125443
definition: Absence of the digit-joint region in the hindlimb digit 2.
has_exact_synonym: Missing digit-joint region in the hindlimb digit 2

absent digit-joint region in the hindlimb digit 3
type: Class
subclass of: abnormal hindlimb digit 3
subclass of: XPO_0125443
definition: Absence of the digit-joint region in the hindlimb digit 3.
has_exact_synonym: Missing digit-joint region in the hindlimb digit 3

absent digit-joint region in the hindlimb digit 4
type: Class
subclass of: abnormal hindlimb digit 4
subclass of: XPO_0125443
definition: Absence of the digit-joint region in the hindlimb digit 4.
has_exact_synonym: Missing digit-joint region in the hindlimb digit 4

absent digit-joint region in the hindlimb digit 5
type: Class
subclass of: abnormal hindlimb digit 5
subclass of: XPO_0125443
definition: Absence of the digit-joint region in the hindlimb digit 5.
has_exact_synonym: Missing digit-joint region in the hindlimb digit 5

absent digit-joint region in the forelimb digit 2
type: Class
subclass of: abnormal forelimb digit 2
subclass of: XPO_0125443
definition: Absence of the digit-joint region in the forelimb digit 2.
has_exact_synonym: Missing digit-joint region in the forelimb digit 2

absent digit-joint region in the forelimb digit 3
type: Class
subclass of: abnormal forelimb digit 3
subclass of: XPO_0125443
definition: Absence of the digit-joint region in the forelimb digit 3.
has_exact_synonym: Missing digit-joint region in the forelimb digit 3

absent digit-joint region in the forelimb digit 4
type: Class
subclass of: abnormal forelimb digit 4
subclass of: XPO_0125443
definition: Absence of the digit-joint region in the forelimb digit 4.
has_exact_synonym: Missing digit-joint region in the forelimb digit 4

absent digit-joint region in the forelimb digit 5
type: Class
subclass of: abnormal forelimb digit 5
subclass of: XPO_0125443
definition: Absence of the digit-joint region in the forelimb digit 5.
has_exact_synonym: Missing digit-joint region in the forelimb digit 5

obsolete absent melanophore in the tail region
type: Class
IAO_0000125: XPO_0130960
deprecated: true

obsolete absent melanophore in the trunk region
type: Class
IAO_0000125: XPO_0130961
deprecated: true

obsolete absent autopod in the regenerating forelimb
type: Class
IAO_0000125: XPO_0141525
deprecated: true

absent perichondrium in the regenerating forelimb
type: Class
subclass of: abnormal regenerating forelimb
subclass of: absent perichondrium
definition: Absence of the perichondrium in the regenerating forelimb.
has_exact_synonym: Missing perichondrium in the regenerating forelimb

obsolete absent autopod in the regenerating hindlimb
type: Class
IAO_0000125: XPO_0141526
deprecated: true

obsolete absent zeugopod in the regenerating hindlimb
type: Class
IAO_0000125: XPO_0141532
deprecated: true

decreased width of the cartilage element in head
type: Class
subclass of: abnormal head
subclass of: XPO_0128019
definition: skinny or decreased width of the cartilage element in head.
has_exact_synonym: skinny cartilage element in head

abnormal bending of anterior-posterior axis
type: Class
subclass of: abnormal anterior-posterior axis morphology
definition: Any abnormal bending of the anterior-posterior axis.
has_exact_synonym: abnormally bending anterior-posterior axis

abnormal bending of humerus
type: Class
subclass of: abnormal humerus morphology
definition: Any abnormal bending of the humerus.
has_exact_synonym: abnormally bending humerus

abnormal bending of anterior neural tube
type: Class
subclass of: abnormal anterior neural tube morphology
definition: Any abnormal bending of the anterior neural tube.
has_exact_synonym: abnormally bending anterior neural tube

abnormal bending of tail
type: Class
subclass of: abnormal tail morphology
definition: Any abnormal bending of the tail.
has_exact_synonym: abnormally bending tail

obsolete abnormal bending of dorsal tail
type: Class
deprecated: true

abnormal bending of dorsal trunk
type: Class
subclass of: abnormal dorsal trunk morphology
definition: Any abnormal bending of the dorsal trunk.
has_exact_synonym: abnormally bending dorsal trunk

abnormal bending of left-right axis
type: Class
subclass of: abnormal left-right axis morphology
definition: Any abnormal bending of the left-right axis.
has_exact_synonym: abnormally bending left-right axis

increased pigmentation in the optic nerve
type: Class
subclass of: abnormal optic nerve morphology
definition: Increased or increasing of pigmentation of optic nerve.
has_exact_synonym: increasing of pigment in the optic nerve
has_exact_synonym: optic nerve hyperpigmentation

increased pigmentation in the head
type: Class
subclass of: abnormal head morphology
definition: Increased or increasing of pigmentation of head.
has_exact_synonym: head hyperpigmentation
has_exact_synonym: increasing of pigment in the head

increased pigmentation in the optic stalk
type: Class
subclass of: abnormally pigmented optic stalk
definition: Increased or increasing of pigmentation of optic stalk.
has_exact_synonym: increasing of pigment in the optic stalk
has_exact_synonym: optic stalk hyperpigmentation

increased pigmentation in the trunk
type: Class
subclass of: abnormal trunk morphology
definition: Increased or increasing of pigmentation of trunk.
has_exact_synonym: increasing of pigment in the trunk
has_exact_synonym: trunk hyperpigmentation

obsolete increased pigmentation in the antero-ventral region
type: Class
deprecated: true

increased size of the alimentary system
type: Class
subclass of: abnormal alimentary system morphology
subclass of: XPO_0129495
definition: An increase in the size of the alimentary system.
has_exact_synonym: enlarged alimentary system

increased size of the archenteron
type: Class
subclass of: abnormal archenteron morphology
subclass of: XPO_0129517
definition: An increase in the size of the archenteron.
has_exact_synonym: enlarged archenteron

increased size of the brain
type: Class
subclass of: abnormal brain morphology
subclass of: XPO_0129523
definition: An increase in the size of the brain.
has_exact_synonym: enlarged brain

increased size of the branchial arch
type: Class
subclass of: abnormal branchial arch morphology
subclass of: increased size of the pharyngeal arch
definition: An increase in the size of the branchial arch.
has_exact_synonym: enlarged branchial arch

increased size of the branchial arch skeleton
type: Class
subclass of: abnormal branchial arch skeleton morphology
subclass of: XPO_0129638
definition: An increase in the size of the branchial arch skeleton.
has_exact_synonym: enlarged branchial arch skeleton

increased size of the ceratobranchial I
type: Class
subclass of: abnormal ceratobranchial I morphology
subclass of: XPO_0129499
definition: An increase in the size of the ceratobranchial I.
has_exact_synonym: enlarged ceratobranchial I

increased size of the ceratobranchial II
type: Class
subclass of: abnormal ceratobranchial II morphology
subclass of: XPO_0129499
definition: An increase in the size of the ceratobranchial II.
has_exact_synonym: enlarged ceratobranchial II

increased size of the ceratobranchial III
type: Class
subclass of: abnormal ceratobranchial III morphology
subclass of: XPO_0129499
definition: An increase in the size of the ceratobranchial III.
has_exact_synonym: enlarged ceratobranchial III

increased size of the ceratobranchial IV
type: Class
subclass of: abnormal ceratobranchial IV morphology
subclass of: XPO_0129499
definition: An increase in the size of the ceratobranchial IV.
has_exact_synonym: enlarged ceratobranchial IV

increased size of the ceratohyal
type: Class
subclass of: abnormal ceratohyal morphology
subclass of: XPO_0129499
definition: An increase in the size of the ceratohyal.
has_exact_synonym: enlarged ceratohyal

increased size of the chondrocranium
type: Class
subclass of: abnormal chondrocranium morphology
subclass of: XPO_0129514
definition: An increase in the size of the chondrocranium.
has_exact_synonym: enlarged chondrocranium

increased size of the dorsal marginal zone
type: Class
subclass of: abnormal dorsal marginal zone morphology
subclass of: XPO_0129935
definition: An increase in the size of the dorsal marginal zone.
has_exact_synonym: enlarged dorsal marginal zone

increased size of the duodenum
type: Class
subclass of: abnormal duodenum morphology
subclass of: XPO_0129488
definition: An increase in the size of the duodenum.
has_exact_synonym: enlarged duodenum

increased size of the epaxial muscle
type: Class
subclass of: abnormal epaxial muscle morphology
subclass of: XPO_0129750
definition: An increase in the size of the epaxial muscle.
has_exact_synonym: enlarged epaxial muscle

increased size of the eye primordium
type: Class
subclass of: abnormal eye primordium morphology
subclass of: XPO_0129559
definition: An increase in the size of the eye primordium.
has_exact_synonym: enlarged eye primordium

increased size of the fin
type: Class
subclass of: abnormal fin morphology
subclass of: XPO_0129529
definition: An increase in the size of the fin.
has_exact_synonym: enlarged fin

increased size of the foregut
type: Class
subclass of: abnormal foregut morphology
subclass of: XPO_0129491
definition: An increase in the size of the foregut.
has_exact_synonym: enlarged foregut

increased size of the forebrain
type: Class
subclass of: abnormal forebrain morphology
subclass of: XPO_0129488
definition: An increase in the size of the forebrain.
has_exact_synonym: enlarged forebrain

increased size of the hindbrain
type: Class
subclass of: abnormal hindbrain morphology
subclass of: XPO_0129488
definition: An increase in the size of the hindbrain.
has_exact_synonym: enlarged hindbrain

increased size of the hyoid arch skeleton
type: Class
subclass of: abnormal hyoid arch skeleton morphology
subclass of: XPO_0129638
definition: An increase in the size of the hyoid arch skeleton.
has_exact_synonym: enlarged hyoid arch skeleton

increased size of the jaw muscle
type: Class
subclass of: abnormal jaw muscle morphology
subclass of: XPO_0129544
definition: An increase in the size of the jaw muscle.
has_exact_synonym: enlarged jaw muscle

increased size of the mandibular arch
type: Class
subclass of: abnormal mandibular arch morphology
subclass of: increased size of the pharyngeal arch
definition: An increase in the size of the mandibular arch.
has_exact_synonym: enlarged mandibular arch

increased size of the Meckel's cartilage
type: Class
subclass of: abnormal Meckel's cartilage morphology
subclass of: XPO_0129499
definition: An increase in the size of the Meckel's cartilage.
has_exact_synonym: enlarged Meckel's cartilage

increased size of the midbrain
type: Class
subclass of: abnormal midbrain morphology
subclass of: XPO_0129488
definition: An increase in the size of the midbrain.
has_exact_synonym: enlarged midbrain

increased size of the mouth
type: Class
subclass of: abnormal mouth morphology
subclass of: XPO_0129517
definition: An increase in the size of the mouth.
has_exact_synonym: enlarged mouth

increased size of the muscle
type: Class
subclass of: abnormal muscle morphology
subclass of: XPO_0129483
definition: An increase in the size of the muscle.
has_exact_synonym: enlarged muscle

increased size of the notochord
type: Class
subclass of: abnormal notochord morphology
subclass of: XPO_0129483
definition: An increase in the size of the notochord.
has_exact_synonym: enlarged notochord

increased size of the pharyngeal arch
type: Class
subclass of: abnormal pharyngeal arch morphology
subclass of: XPO_0129488
definition: An increase in the size of the pharyngeal arch.
has_exact_synonym: enlarged pharyngeal arch

increased size of the pharyngeal region
type: Class
subclass of: abnormal pharyngeal region morphology
subclass of: XPO_0129571
definition: An increase in the size of the pharyngeal region.
has_exact_synonym: enlarged pharyngeal region

increased size of the proximal tubule
type: Class
subclass of: abnormal proximal tubule morphology
subclass of: XPO_0129483
definition: An increase in the size of the proximal tubule.
has_exact_synonym: enlarged proximal tubule

increased size of the pseudoblastema
type: Class
subclass of: abnormal pseudoblastema morphology
subclass of: XPO_0129622
definition: An increase in the size of the pseudoblastema.
has_exact_synonym: enlarged pseudoblastema

increased size of the regenerating forelimb
type: Class
subclass of: abnormal regenerating forelimb morphology
subclass of: XPO_0130058
definition: An increase in the size of the regenerating forelimb.
has_exact_synonym: enlarged regenerating forelimb

increased size of the regenerating hindlimb
type: Class
subclass of: abnormal regenerating hindlimb morphology
subclass of: XPO_0130058
definition: An increase in the size of the regenerating hindlimb.
has_exact_synonym: enlarged regenerating hindlimb

increased size of the spinal cord
type: Class
subclass of: abnormal spinal cord morphology
subclass of: XPO_0129523
definition: An increase in the size of the spinal cord.
has_exact_synonym: enlarged spinal cord

increased size of the stomach
type: Class
subclass of: abnormal stomach morphology
subclass of: XPO_0129523
subclass of: XPO_0129593
definition: An increase in the size of the stomach.
has_exact_synonym: enlarged stomach

increased size of the tail
type: Class
subclass of: abnormal tail morphology
subclass of: XPO_0129506
definition: An increase in the size of the tail.
has_exact_synonym: enlarged tail

obsolete increased size of the tail region
type: Class
IAO_0000125: increased size of the tail
deprecated: true

increased size of the tibia-fibula
type: Class
subclass of: abnormal tibia-fibula morphology
subclass of: XPO_0129497
definition: An increase in the size of the tibia-fibula.
has_exact_synonym: enlarged tibia-fibula

increased size of the trunk
type: Class
subclass of: abnormal trunk morphology
subclass of: XPO_0129506
definition: An increase in the size of the trunk.
has_exact_synonym: enlarged trunk

obsolete increased size of the trunk region
type: Class
IAO_0000125: increased size of the trunk
deprecated: true

increased size of the whole organism
type: Class
subclass of: abnormal whole organism morphology
subclass of: XPO_0129487
definition: An increase in the size of the whole organism.
has_exact_synonym: enlarged whole organism

increased size of the anterior-posterior axis
type: Class
subclass of: abnormal anterior-posterior axis morphology
subclass of: XPO_0129982
definition: An increase in the size of the anterior-posterior axis.
has_exact_synonym: enlarged anterior-posterior axis

increased size of the apical junction complex
type: Class
subclass of: abnormal apical junction complex morphology
subclass of: XPO_0129551
definition: An increase in the size of the apical junction complex.
has_exact_synonym: enlarged apical junction complex

increased size of the foot
type: Class
subclass of: abnormal foot morphology
subclass of: XPO_0129535
definition: An increase in the size of the foot.
has_exact_synonym: enlarged foot

increased size of the forelimb digit
type: Class
subclass of: abnormal forelimb digit morphology
subclass of: XPO_0129693
definition: An increase in the size of the forelimb digit.
has_exact_synonym: enlarged forelimb digit

increased size of the germ cell
type: Class
subclass of: abnormal germ cell morphology
subclass of: XPO_0129486
definition: An increase in the size of the germ cell.
has_exact_synonym: enlarged germ cell

increased size of the hand
type: Class
subclass of: abnormal hand morphology
subclass of: XPO_0129535
definition: An increase in the size of the hand.
has_exact_synonym: enlarged hand

increased size of the head mesenchyme
type: Class
subclass of: abnormal head mesenchyme morphology
subclass of: XPO_0129823
definition: An increase in the size of the head mesenchyme.
has_exact_synonym: enlarged head mesenchyme

increased size of the hindlimb digit
type: Class
subclass of: abnormal hindlimb digit morphology
subclass of: XPO_0129693
definition: An increase in the size of the hindlimb digit.
has_exact_synonym: enlarged hindlimb digit

obsolete increased size of the left part of branchial arch skeleton
type: Class
deprecated: true

increased size of the proximal-distal axis
type: Class
subclass of: abnormal proximal-distal axis morphology
subclass of: XPO_0129982
definition: An increase in the size of the proximal-distal axis.
has_exact_synonym: enlarged proximal-distal axis

obsolete increased size of the right part of branchial arch skeleton
type: Class
deprecated: true

obsolete increased size of the anterior region
type: Class
deprecated: true

obsolete increased size of the antero-ventral region
type: Class
deprecated: true

obsolete increased size of the dorsal region
type: Class
deprecated: true

increased size of the hypaxial muscle
type: Class
subclass of: abnormal hypaxial muscle morphology
subclass of: XPO_0129750
definition: An increase in the size of the hypaxial muscle.
has_exact_synonym: enlarged hypaxial muscle

obsolete increased size of the left eye
type: Class
deprecated: true

obsolete increased size of the postero-ventral region
type: Class
deprecated: true

obsolete increased size of the right eye
type: Class
deprecated: true

increased size of the ventral trunk
type: Class
subclass of: abnormal ventral trunk morphology
subclass of: XPO_0129506
definition: An increase in the size of the ventral trunk.
has_exact_synonym: enlarged ventral trunk

arrested axis elongation
type: Class
subclass of: arrested developmental process
subclass of: XPO_0131745
definition: Arrested axis elongation.
has_exact_synonym: axis elongation arrest
has_exact_synonym: failed axis elongation
has_exact_synonym: failure to complete axis elongation
has_exact_synonym: incomplete axis elongation

arrested developmental process
type: Class
subclass of: XPO_0133403
definition: Arrested developmental process.
has_exact_synonym: developmental process arrest
has_exact_synonym: failed developmental process
has_exact_synonym: failure to complete developmental process
has_exact_synonym: incomplete developmental process

decreased size of the bone element in the forelimb
type: Class
subclass of: abnormal forelimb
subclass of: XPO_0128325
definition: An abnormal reduction in the size of the bone element in the forelimb.
has_exact_synonym: abnormally small bone element in forelimb

decreased size of the muscle in the forelimb
type: Class
subclass of: abnormal forelimb
subclass of: decreased size of the muscle
definition: An abnormal reduction in the size of the muscle in the forelimb.
has_exact_synonym: abnormally small muscle in forelimb

decreased size of the bone element in the hindlimb
type: Class
subclass of: abnormal hindlimb
subclass of: XPO_0128325
definition: An abnormal reduction in the size of the bone element in the hindlimb.
has_exact_synonym: abnormally small bone element in hindlimb

decreased size of the muscle in the hindlimb
type: Class
subclass of: decreased size of the muscle
subclass of: XPO_0141574
definition: An abnormal reduction in the size of the muscle in the hindlimb.
has_exact_synonym: abnormally small muscle in hindlimb

decreased size of the claw in the regenerating hindlimb
type: Class
subclass of: XPO_0128166
subclass of: XPO_0141558
definition: An abnormal reduction in the size of the claw in the regenerating hindlimb.
has_exact_synonym: abnormally small claw in regenerating hindlimb

decreased size of the hindlimb digit in the regenerating hindlimb
type: Class
subclass of: decreased size of the hindlimb digit
subclass of: XPO_0141547
definition: An abnormal reduction in the size of the hindlimb digit in the regenerating hindlimb.
has_exact_synonym: abnormally small hindlimb digit in regenerating hindlimb

decreased size of the forelimb digit in the regenerating forelimb
type: Class
subclass of: decreased size of the forelimb digit
subclass of: XPO_0141556
definition: An abnormal reduction in the size of the forelimb digit in the regenerating forelimb.
has_exact_synonym: abnormally small forelimb digit in regenerating forelimb

decreased size of the bipolar neuron in the retinal inner plexiform layer
type: Class
subclass of: abnormal retinal inner plexiform layer
subclass of: XPO_0129083
definition: An abnormal reduction in the size of the bipolar neuron in the retinal inner plexiform layer.
has_exact_synonym: abnormally small bipolar neuron in retinal inner plexiform layer

obsolete decreased size of the neuroectoderm in the head region
type: Class
IAO_0000125: XPO_0130959
deprecated: true

obsolete abnormally blistered epidermis in trunk
type: Class
deprecated: true

absent hatching behavior
type: Class
subclass of: XPO_0128000
definition: Absence of hatching behavior.

obsolete absent swimming
type: Class
IAO_0000125: XPO_0131471
deprecated: true

increased length of the somite
type: Class
subclass of: increased size of the somite
definition: longer, increased length of, somite
has_exact_synonym: longer somite

increased length of the anterior-posterior axis
type: Class
subclass of: increased size of the anterior-posterior axis
definition: longer, increased length of, anterior-posterior axis
has_exact_synonym: longer anterior-posterior axis

obsolete abnormally blistered anterior dorsal fin
type: Class
deprecated: true

obsolete abnormally blistered ventral trunk
type: Class
deprecated: true

decreased length of axon in retinal ganglion cell
type: Class
subclass of: abnormal retinal ganglion cell
subclass of: XPO_0128968
definition: Decreased length or shortening of the axon in the retinal ganglion cell.
has_exact_synonym: short axon in retinal ganglion cell

decreased length of cilium in gastrocoel roof plate
type: Class
subclass of: abnormal gastrocoel roof plate
subclass of: XPO_0128799
definition: Decreased length or shortening of the cilium in the gastrocoel roof plate.
has_exact_synonym: short cilium in gastrocoel roof plate

decreased length of hindlimb digit 1 in regenerating hindlimb
type: Class
subclass of: decreased size of the hindlimb digit in the regenerating hindlimb
subclass of: abnormally decreased length of hindlimb digit 1 in regenerating tissue
definition: Decreased length or shortening of the hindlimb digit 1 in the regenerating hindlimb.
has_exact_synonym: short hindlimb digit 1 in regenerating hindlimb

decreased length of hindlimb digit 2 in regenerating hindlimb
type: Class
subclass of: decreased size of the hindlimb digit in the regenerating hindlimb
subclass of: abnormally decreased length of hindlimb digit 2 in regenerating tissue
definition: Decreased length or shortening of the hindlimb digit 2 in the regenerating hindlimb.
has_exact_synonym: short hindlimb digit 2 in regenerating hindlimb

decreased length of hindlimb digit 3 in regenerating hindlimb
type: Class
subclass of: decreased size of the hindlimb digit in the regenerating hindlimb
subclass of: abnormally decreased length of hindlimb digit 3 in regenerating tissue
definition: Decreased length or shortening of the hindlimb digit 3 in the regenerating hindlimb.
has_exact_synonym: short hindlimb digit 3 in regenerating hindlimb

decreased length of hindlimb digit 4 in regenerating hindlimb
type: Class
subclass of: decreased size of the hindlimb digit in the regenerating hindlimb
subclass of: abnormally decreased length of hindlimb digit 4 in regenerating tissue
definition: Decreased length or shortening of the hindlimb digit 4 in the regenerating hindlimb.
has_exact_synonym: short hindlimb digit 4 in regenerating hindlimb

decreased length of hindlimb digit 5 in regenerating hindlimb
type: Class
subclass of: decreased size of the hindlimb digit in the regenerating hindlimb
subclass of: abnormally decreased length of hindlimb digit 5 in regenerating tissue
definition: Decreased length or shortening of the hindlimb digit 5 in the regenerating hindlimb.
has_exact_synonym: short hindlimb digit 5 in regenerating hindlimb

decreased length of forelimb digit 2 in regenerating forelimb
type: Class
subclass of: decreased size of the forelimb digit in the regenerating forelimb
subclass of: XPO_0129188
definition: Decreased length or shortening of the forelimb digit 2 in the regenerating forelimb.
has_exact_synonym: short forelimb digit 2 in regenerating forelimb

decreased length of forelimb digit 3 in regenerating forelimb
type: Class
subclass of: decreased size of the forelimb digit in the regenerating forelimb
subclass of: XPO_0128172
definition: Decreased length or shortening of the forelimb digit 3 in the regenerating forelimb.
has_exact_synonym: short forelimb digit 3 in regenerating forelimb

decreased length of forelimb digit 4 in regenerating forelimb
type: Class
subclass of: decreased size of the forelimb digit in the regenerating forelimb
subclass of: XPO_0129148
definition: Decreased length or shortening of the forelimb digit 4 in the regenerating forelimb.
has_exact_synonym: short forelimb digit 4 in regenerating forelimb

decreased length of forelimb digit 5 in regenerating forelimb
type: Class
subclass of: decreased size of the forelimb digit in the regenerating forelimb
subclass of: XPO_0129161
definition: Decreased length or shortening of the forelimb digit 5 in the regenerating forelimb.
has_exact_synonym: short forelimb digit 5 in regenerating forelimb

decreased width of the cement gland
type: Class
subclass of: decreased size of the cement gland
definition: skinny or decreased width of the cement gland.
has_exact_synonym: skinny cement gland

decreased width of the craniofacial region
type: Class
subclass of: XPO_0128841
definition: skinny or decreased width of the craniofacial region.
has_exact_synonym: skinny craniofacial region

decreased width of the head
type: Class
subclass of: decreased size of the head
definition: skinny or decreased width of the head.
has_exact_synonym: skinny head

decreased width of the mouth
type: Class
subclass of: decreased size of the mouth
definition: skinny or decreased width of the mouth.
has_exact_synonym: skinny mouth

decreased width of the neural plate
type: Class
subclass of: XPO_0128118
definition: skinny or decreased width of the neural plate.
has_exact_synonym: skinny neural plate

decreased width of the pre-chordal neural plate
type: Class
subclass of: XPO_0128433
definition: skinny or decreased width of the pre-chordal neural plate.
has_exact_synonym: skinny pre-chordal neural plate

abnormally decreased number of bone element in the forelimb digit
type: Class
subclass of: abnormal forelimb digit
subclass of: XPO_0141538
definition: The presence of a reduced number of bone element in the forelimb digit.
has_exact_synonym: Reduced number of bone element in the forelimb digit

abnormally decreased number of forelimb digit in the regenerating forelimb
type: Class
subclass of: abnormal regenerating forelimb
subclass of: abnormally decreased number of forelimb digit
definition: The presence of a reduced number of forelimb digit in the regenerating forelimb.
has_exact_synonym: Reduced number of forelimb digit in the regenerating forelimb

abnormally decreased number of digit-joint region in the regenerating forelimb
type: Class
subclass of: abnormal regenerating forelimb
subclass of: abnormal digit-joint region
definition: The presence of a reduced number of digit-joint region in the regenerating forelimb.
has_exact_synonym: Reduced number of digit-joint region in the regenerating forelimb

abnormally decreased number of metacarpus in the regenerating forelimb
type: Class
subclass of: abnormal number of metacarpal bones
subclass of: abnormally decreased number of skeletal element in the regenerating forelimb
subclass of: XPO_0141538
definition: The presence of a reduced number of metacarpus in the regenerating forelimb.
has_exact_synonym: Reduced number of metacarpus in the regenerating forelimb

obsolete decreased number of autopod in the regenerating forelimb
type: Class
deprecated: true

abnormally decreased number of skeletal element in the regenerating forelimb
type: Class
subclass of: abnormal regenerating forelimb
subclass of: XPO_0141506
definition: The presence of a reduced number of skeletal element in the regenerating forelimb.
has_exact_synonym: Reduced number of skeletal element in the regenerating forelimb

abnormally decreased number of bone element in the hindlimb digit
type: Class
subclass of: abnormal hindlimb digit
subclass of: XPO_0141539
definition: The presence of a reduced number of bone element in the hindlimb digit.
has_exact_synonym: Reduced number of bone element in the hindlimb digit

abnormally decreased number of hindlimb digit in the regenerating hindlimb
type: Class
subclass of: abnormal regenerating hindlimb
subclass of: abnormally decreased number of hindlimb digit
definition: The presence of a reduced number of hindlimb digit in the regenerating hindlimb.
has_exact_synonym: Reduced number of hindlimb digit in the regenerating hindlimb

abnormally decreased number of digit-joint region in the regenerating hindlimb
type: Class
subclass of: abnormal regenerating hindlimb
subclass of: abnormal digit-joint region
definition: The presence of a reduced number of digit-joint region in the regenerating hindlimb.
has_exact_synonym: Reduced number of digit-joint region in the regenerating hindlimb

obsolete decreased number of autopod in the regenerating hindlimb
type: Class
deprecated: true

abnormally decreased number of skeletal element in the regenerating hindlimb
type: Class
subclass of: abnormal regenerating hindlimb
subclass of: XPO_0141506
definition: The presence of a reduced number of skeletal element in the regenerating hindlimb.
has_exact_synonym: Reduced number of skeletal element in the regenerating hindlimb

abnormally localised cement gland
type: Class
subclass of: abnormal cement gland
subclass of: XPO_0126451
definition: An abnormally localised cement gland.
has_exact_synonym: abnormal position of cement gland

abnormally localised head
type: Class
subclass of: abnormal head
subclass of: XPO_0126361
definition: An abnormally localised head.
has_exact_synonym: abnormal position of head

abnormally localised neural tube
type: Class
subclass of: abnormal neural tube
subclass of: XPO_0126378
definition: An abnormally localised neural tube.
has_exact_synonym: abnormal position of neural tube

abnormally localised tail
type: Class
subclass of: abnormal tail
subclass of: XPO_0126361
definition: An abnormally localised tail.
has_exact_synonym: abnormal position of tail

abnormally localised utricle
type: Class
subclass of: abnormal utricle
subclass of: XPO_0126642
definition: An abnormally localised utricle.
has_exact_synonym: abnormal position of utricle

decreased muscle cell differentiation
type: Class
subclass of: XPO_0133403
definition: Decreased qualitatively muscle cell differentiation.

abnormally decreased number of ceratohyal
type: Class
subclass of: abnormal ceratohyal
definition: The presence of a reduced number of ceratohyal.
has_exact_synonym: Reduced number of ceratohyal

abnormally decreased number of ciliated epidermal cell
type: Class
subclass of: abnormal ciliated epidermal cell
subclass of: XPO_0131205
subclass of: XPO_0131257
definition: The presence of a reduced number of ciliated epidermal cell.
has_exact_synonym: Reduced number of ciliated epidermal cell

obsolete decreased number of hindlimb digit
type: Class
IAO_0000125: abnormally decreased number of hindlimb digit
deprecated: true

abnormally decreased number of claw
type: Class
subclass of: abnormal claw
definition: The presence of a reduced number of claw.
has_exact_synonym: Reduced number of claw

abnormally decreased number of metatarsus
type: Class
subclass of: abnormal metatarsus
subclass of: XPO_0141539
definition: The presence of a reduced number of metatarsus.
has_exact_synonym: Reduced number of metatarsus

obsolete decreased number of melanophore
type: Class
IAO_0000125: abnormally decreased number of melanophore
deprecated: true

abnormally decreased number of retinal ganglion cell
type: Class
subclass of: abnormal retinal ganglion cell
subclass of: XPO_0131186
definition: The presence of a reduced number of retinal ganglion cell.
has_exact_synonym: Reduced number of retinal ganglion cell

abnormally decreased number of sarcomere
type: Class
subclass of: XPO_0131660
definition: The presence of a reduced number of sarcomere.
has_exact_synonym: Reduced number of sarcomere

abnormally decreased number of somite
type: Class
subclass of: abnormal somite
definition: The presence of a reduced number of somite.
has_exact_synonym: Reduced number of somite

abnormally decreased number of spindle microtubule
type: Class
subclass of: XPO_0131675
definition: The presence of a reduced number of spindle microtubule.
has_exact_synonym: Reduced number of spindle microtubule

abnormally decreased number of trunk somite
type: Class
subclass of: abnormal trunk somite
subclass of: XPO_0130957
definition: The presence of a reduced number of trunk somite.
has_exact_synonym: Reduced number of trunk somite

absent foot
type: Class
subclass of: abnormal foot
subclass of: absent autopod
definition: Absence of foot.
has_exact_synonym: missing foot

obsolete absent left eye
type: Class
deprecated: true

obsolete absent left inner ear
type: Class
deprecated: true

obsolete absent left olfactory pit
type: Class
deprecated: true

obsolete absent right eye
type: Class
deprecated: true

obsolete absent right inner ear
type: Class
deprecated: true

obsolete absent right olfactory pit
type: Class
deprecated: true

absent wound epidermis
type: Class
subclass of: abnormal wound epidermis
subclass of: absent regenerating tissue
definition: Absence of wound epidermis.
has_exact_synonym: missing wound epidermis

absent hindlimb digit 1
type: Class
subclass of: absent hindlimb digit
subclass of: abnormal number of hindlimb digit 1
definition: Absence of hindlimb digit 1.
has_exact_synonym: missing hindlimb digit 1

increased thickness of the blastocoel roof
type: Class
subclass of: XPO_0130597
definition: An increase in the thickness of the blastocoel roof.
has_exact_synonym: thickened blastocoel roof

increased thickness of the optic nerve
type: Class
subclass of: XPO_0130169
definition: An increase in the thickness of the optic nerve.
has_exact_synonym: thickened optic nerve

increased thickness of the ectoderm
type: Class
subclass of: XPO_0129539
definition: An increase in the thickness of the ectoderm.
has_exact_synonym: thickened ectoderm

increased thickness of the epidermis
type: Class
subclass of: XPO_0129995
definition: An increase in the thickness of the epidermis.
has_exact_synonym: thickened epidermis

increased thickness of the humerus
type: Class
subclass of: XPO_0129496
definition: An increase in the thickness of the humerus.
has_exact_synonym: thickened humerus

increased thickness of the neural plate
type: Class
subclass of: XPO_0129598
definition: An increase in the thickness of the neural plate.
has_exact_synonym: thickened neural plate

increased thickness of the neuroectoderm
type: Class
subclass of: XPO_0129614
definition: An increase in the thickness of the neuroectoderm.
has_exact_synonym: thickened neuroectoderm

increased thickness of the non-neural ectoderm
type: Class
subclass of: XPO_0129704
definition: An increase in the thickness of the non-neural ectoderm.
has_exact_synonym: thickened non-neural ectoderm

increased thickness of the optic stalk
type: Class
subclass of: XPO_0130194
definition: An increase in the thickness of the optic stalk.
has_exact_synonym: thickened optic stalk

decreased cell migration in cranial neural crest
type: Class
subclass of: XPO_0133396
definition: Decreased qualitatively cell migration in cranial neural crest.

obsolete decreased cell proliferation in marginal zone
type: Class
IAO_0000125: XPO_0138221
deprecated: true

obsolete decreased cell proliferation in foregut primordium
type: Class
IAO_0000125: XPO_0139320
deprecated: true

decreased mitotic nuclear division in proximal tubule
type: Class
subclass of: abnormal biological process
definition: Decreased qualitatively mitotic nuclear division in proximal tubule.

obsolete decreased neural precursor cell proliferation in optic tectum
type: Class
deprecated: true

decreased neuron differentiation in optic tectum
type: Class
subclass of: XPO_0133403
definition: Decreased qualitatively neuron differentiation in optic tectum.

decreased pigmentation in the retinal pigmented epithelium
type: Class
subclass of: abnormal retinal pigmented epithelium morphology
definition: Decreased or loss of pigmentation of retinal pigmented epithelium.
has_exact_synonym: loss of pigment in the retinal pigmented epithelium
has_exact_synonym: retinal pigmented epithelium hypopigmentation

decreased pigmentation in the whole organism
type: Class
subclass of: abnormal whole organism morphology
definition: Decreased or loss of pigmentation of whole organism.
has_exact_synonym: loss of pigment in the whole organism
has_exact_synonym: whole organism hypopigmentation

decreased size of the globe
type: Class
subclass of: abnormal globe morphology
subclass of: XPO_0128008
definition: An abnormal reduction in the size of the globe.
has_exact_synonym: abnormally small globe

abnormal enteric nervous system
type: Class
subclass of: abnormal nervous system
definition: Abnormality of enteric nervous system.
has_exact_synonym: abnormality of enteric nervous system

abnormal neutrophil
type: Class
subclass of: abnormal immune system
subclass of: abnormal blood
subclass of: abnormal circulating cell
definition: Abnormality of neutrophil.
has_exact_synonym: abnormality of neutrophil

abnormal lateral preplacodal ectoderm
type: Class
subclass of: abnormal preplacodal ectoderm
definition: Abnormality of lateral preplacodal ectoderm.
has_exact_synonym: abnormality of lateral preplacodal ectoderm

abnormal cardiac atrium
type: Class
subclass of: abnormal heart
definition: Abnormality of cardiac atrium.
has_exact_synonym: abnormality of cardiac atrium

abnormal peripheral ganglion
type: Class
subclass of: abnormal ganglion
definition: Abnormality of peripheral ganglion.
has_exact_synonym: abnormality of peripheral ganglion

abnormal anatomical axis
type: Class
subclass of: abnormal anatomical line
definition: Abnormality of anatomical axis.
has_exact_synonym: abnormality of anatomical axis

abnormal animal-vegetal axis
type: Class
subclass of: abnormal anatomical axis
definition: Abnormality of animal-vegetal axis.
has_exact_synonym: abnormality of animal-vegetal axis

abnormal anterior-posterior axis
type: Class
subclass of: abnormal anatomical axis
definition: Abnormality of anterior-posterior axis.
has_exact_synonym: abnormality of anterior-posterior axis

abnormal dorsal-ventral axis
type: Class
subclass of: abnormal anatomical axis
definition: Abnormality of dorsal-ventral axis.
has_exact_synonym: abnormality of dorsal-ventral axis

abnormal left-right axis
type: Class
subclass of: abnormal anatomical axis
definition: Abnormality of left-right axis.
has_exact_synonym: abnormality of left-right axis

abnormal anatomical side
type: Class
subclass of: XPO_0141315
definition: Abnormality of anatomical side.
has_exact_synonym: abnormality of anatomical side

abnormal anterior side
type: Class
subclass of: abnormal anatomical side
definition: Abnormality of anterior side.
has_exact_synonym: abnormality of anterior side

abnormal posterior side
type: Class
subclass of: abnormal anatomical side
definition: Abnormality of posterior side.
has_exact_synonym: abnormality of posterior side

abnormal dorsal side
type: Class
subclass of: abnormal anatomical side
definition: Abnormality of dorsal side.
has_exact_synonym: abnormality of dorsal side

abnormal ventral side
type: Class
subclass of: abnormal anatomical side
definition: Abnormality of ventral side.
has_exact_synonym: abnormality of ventral side

abnormal left side
type: Class
subclass of: abnormal anatomical side
definition: Abnormality of left side.
has_exact_synonym: abnormality of left side

abnormal right side
type: Class
subclass of: abnormal anatomical side
definition: Abnormality of right side.
has_exact_synonym: abnormality of right side

abnormal proximal-distal axis
type: Class
subclass of: abnormal anatomical axis
definition: Abnormality of proximal-distal axis.
has_exact_synonym: abnormality of proximal-distal axis

abnormal apical region
type: Class
subclass of: XPO_0141315
definition: Abnormality of apical region.
has_exact_synonym: abnormality of apical region

abnormal axial region
type: Class
subclass of: XPO_0141315
definition: Abnormality of axial region.
has_exact_synonym: abnormality of axial region

abnormal basal region
type: Class
subclass of: XPO_0141315
definition: Abnormality of basal region.
has_exact_synonym: abnormality of basal region

obsolete abnormal anterior region
type: Class
deprecated: true

obsolete abnormal posterior region
type: Class
deprecated: true

abnormal dorsal region
type: Class
subclass of: XPO_0141315
definition: Abnormality of dorsal region.
has_exact_synonym: abnormality of dorsal region

obsolete abnormal ventral region
type: Class
deprecated: true

abnormal medial region
type: Class
subclass of: XPO_0141315
definition: Abnormality of medial region.
has_exact_synonym: abnormality of medial region

obsolete abnormal antero-dorsal region
type: Class
deprecated: true

obsolete abnormal antero-ventral region
type: Class
deprecated: true

obsolete abnormal postero-dorsal region
type: Class
deprecated: true

obsolete abnormal postero-ventral region
type: Class
deprecated: true

abnormal otic capsule
type: Class
subclass of: abnormal endochondral element
subclass of: abnormal braincase and otic capsule skeleton
subclass of: abnormal inner ear
subclass of: abnormal otic region
definition: Abnormality of otic capsule.
has_exact_synonym: abnormality of otic capsule

abnormal migrating myoblast
type: Class
subclass of: abnormal myoblast
definition: Abnormality of migrating myoblast.
has_exact_synonym: abnormality of migrating myoblast

abnormal flexural organ
type: Class
subclass of: abnormal notochord
definition: Abnormality of flexural organ.
has_exact_synonym: abnormality of flexural organ

abnormal efferent neuron
type: Class
subclass of: abnormal neuron
subclass of: abnormal enteric nervous system
definition: Abnormality of efferent neuron.
has_exact_synonym: abnormality of efferent neuron

abnormal afferent neuron
type: Class
subclass of: abnormal neuron
subclass of: abnormal enteric nervous system
definition: Abnormality of afferent neuron.
has_exact_synonym: abnormality of afferent neuron

abnormal larval alimentary system
type: Class
subclass of: abnormal alimentary system
definition: Abnormality of larval alimentary system.
has_exact_synonym: abnormality of larval alimentary system

abnormal cloacal sphincter
type: Class
subclass of: abnormal cloaca
definition: Abnormality of cloacal sphincter.
has_exact_synonym: abnormality of cloacal sphincter

abnormal ionocyte, alpha subtype
type: Class
subclass of: abnormal ionocyte
definition: Abnormality of ionocyte, alpha subtype.
has_exact_synonym: abnormality of ionocyte, alpha subtype

abnormal ionocyte, beta subtype
type: Class
subclass of: abnormal ionocyte
definition: Abnormality of ionocyte, beta subtype.
has_exact_synonym: abnormality of ionocyte, beta subtype

abnormal small secretory cell
type: Class
subclass of: abnormal cell
subclass of: abnormal epidermis
definition: Abnormality of small secretory cell.
has_exact_synonym: abnormality of small secretory cell

abnormal dorsal telencephalon
type: Class
subclass of: abnormal telencephalon
definition: Abnormality of dorsal telencephalon.
has_exact_synonym: abnormality of dorsal telencephalon

abnormal intestinal stem cell
type: Class
subclass of: abnormal stem cell
subclass of: abnormal small intestine
definition: Abnormality of intestinal stem cell.
has_exact_synonym: abnormality of intestinal stem cell

obsolete abnormal rostral notochord
type: Class
IAO_0000125: XPO_0141714
deprecated: true

obsolete abnormal caudal notochord
type: Class
IAO_0000125: XPO_0141718
deprecated: true

abnormal regenerating lens
type: Class
subclass of: abnormal regenerating eye
definition: Abnormality of regenerating lens.
has_exact_synonym: abnormality of regenerating lens

abnormal superficial layer of neurectoderm
type: Class
subclass of: abnormal neuroectoderm
definition: Abnormality of superficial layer of neurectoderm.
has_exact_synonym: abnormality of superficial layer of neurectoderm

abnormal posterior neural fold
type: Class
subclass of: abnormal neural fold
subclass of: abnormal chordal neural plate
definition: Abnormality of posterior neural fold.
has_exact_synonym: abnormality of posterior neural fold

abnormal embryonic kidney
type: Class
subclass of: abnormal kidney
definition: Abnormality of embryonic kidney.
has_exact_synonym: abnormality of embryonic kidney

abnormal adult kidney
type: Class
subclass of: abnormal kidney
definition: Abnormality of adult kidney.
has_exact_synonym: abnormality of adult kidney

abnormal neurenteric canal
type: Class
subclass of: abnormal tissue
subclass of: abnormal neural tube
subclass of: abnormal tail bud
definition: Abnormality of neurenteric canal.
has_exact_synonym: abnormality of neurenteric canal

abnormal migratory trunk neural crest cell
type: Class
subclass of: abnormal trunk neural crest
subclass of: abnormal migratory neural crest cell
definition: Abnormality of migratory trunk neural crest cell.
has_exact_synonym: abnormality of migratory trunk neural crest cell

abnormal hindgut endoderm
type: Class
subclass of: abnormal tissue
subclass of: abnormal hindgut
definition: Abnormality of hindgut endoderm.
has_exact_synonym: abnormality of hindgut endoderm

abnormal dorsal posterior hindgut endoderm
type: Class
subclass of: abnormal posterior hindgut endoderm
definition: Abnormality of dorsal posterior hindgut endoderm.
has_exact_synonym: abnormality of dorsal posterior hindgut endoderm

abnormal ventral posterior hindgut endoderm
type: Class
subclass of: abnormal posterior hindgut endoderm
definition: Abnormality of ventral posterior hindgut endoderm.
has_exact_synonym: abnormality of ventral posterior hindgut endoderm

abnormal posterior hindgut endoderm
type: Class
subclass of: abnormal hindgut endoderm
definition: Abnormality of posterior hindgut endoderm.
has_exact_synonym: abnormality of posterior hindgut endoderm

abnormal anterior hindgut endoderm
type: Class
subclass of: abnormal hindgut endoderm
definition: Abnormality of anterior hindgut endoderm.
has_exact_synonym: abnormality of anterior hindgut endoderm

abnormal apical junction complex
type: Class
subclass of: abnormal cell part
subclass of: abnormal epithelial cell
definition: Abnormality of apical junction complex.
has_exact_synonym: abnormality of apical junction complex

abnormal filopodium
type: Class
subclass of: abnormal cell part
definition: Abnormality of filopodium.
has_exact_synonym: abnormality of filopodium

abnormal ventral trunk
type: Class
subclass of: abnormal trunk
definition: Abnormality of ventral trunk.
has_exact_synonym: abnormality of ventral trunk

abnormal posterior tail
type: Class
subclass of: abnormal tissue
subclass of: abnormal tail
definition: Abnormality of posterior tail.
has_exact_synonym: abnormality of posterior tail

abnormal anterior dorsal fin
type: Class
subclass of: abnormal dorsal fin
definition: Abnormality of anterior dorsal fin.
has_exact_synonym: abnormality of anterior dorsal fin

abnormal anterior neuroectoderm
type: Class
subclass of: abnormal neuroectoderm
definition: Abnormality of anterior neuroectoderm.
has_exact_synonym: abnormality of anterior neuroectoderm

abnormal dorsal tail
type: Class
subclass of: abnormal tail
definition: Abnormality of dorsal tail.
has_exact_synonym: abnormality of dorsal tail

abnormal dorsal trunk
type: Class
subclass of: abnormal trunk
definition: Abnormality of dorsal trunk.
has_exact_synonym: abnormality of dorsal trunk

abnormal thrombocyte
type: Class
subclass of: abnormal cell
subclass of: abnormal circulatory system
subclass of: abnormal blood
definition: Abnormality of thrombocyte.
has_exact_synonym: abnormality of thrombocyte

abnormal embryonic thrombocyte
type: Class
subclass of: abnormal thrombocyte
definition: Abnormality of embryonic thrombocyte.
has_exact_synonym: abnormality of embryonic thrombocyte

abnormal adult thrombocyte
type: Class
subclass of: abnormal thrombocyte
definition: Abnormality of adult thrombocyte.
has_exact_synonym: abnormality of adult thrombocyte

abnormal regenerating pelvic girdle
type: Class
subclass of: abnormal blastema
definition: Abnormality of regenerating pelvic girdle.
has_exact_synonym: abnormality of regenerating pelvic girdle

obsolete abnormal left optic vesicle
type: Class
deprecated: true

obsolete abnormal right optic vesicle
type: Class
deprecated: true

obsolete abnormal ventro-lateral region
type: Class
deprecated: true

obsolete abnormal dorso-lateral region
type: Class
deprecated: true

abnormal yolk platelet
type: Class
subclass of: abnormal oocyte
subclass of: abnormal cell part
definition: Abnormality of yolk platelet.
has_exact_synonym: abnormality of yolk platelet

abnormal enteric nervous system morphology
type: Class
subclass of: abnormal nervous system morphology
subclass of: abnormal enteric nervous system
definition: Any unspecified morphological anomaly of the enteric nervous system, such as, for example, abnormal shape or colour.
has_exact_synonym: abnormal morphology of enteric nervous system

abnormal neutrophil morphology
type: Class
subclass of: abnormal circulating cell morphology
subclass of: abnormal neutrophil
definition: Any unspecified morphological anomaly of the neutrophil, such as, for example, abnormal shape or colour.
has_exact_synonym: abnormal morphology of neutrophil

abnormal lateral preplacodal ectoderm morphology
type: Class
subclass of: abnormal tissue morphology
subclass of: abnormal lateral preplacodal ectoderm
definition: Any unspecified morphological anomaly of the lateral preplacodal ectoderm, such as, for example, abnormal shape or colour.
has_exact_synonym: abnormal morphology of lateral preplacodal ectoderm

abnormal cardiac atrium morphology
type: Class
subclass of: abnormal cavitated compound organ morphology
subclass of: abnormal cardiac atrium
definition: Any unspecified morphological anomaly of the cardiac atrium, such as, for example, abnormal shape or colour.
has_exact_synonym: abnormal morphology of cardiac atrium

abnormal peripheral ganglion morphology
type: Class
subclass of: abnormal ganglion morphology
subclass of: abnormal peripheral ganglion
definition: Any unspecified morphological anomaly of the peripheral ganglion, such as, for example, abnormal shape or colour.
has_exact_synonym: abnormal morphology of peripheral ganglion

abnormal anatomical axis morphology
type: Class
subclass of: abnormal anatomical line morphology
subclass of: abnormal anatomical axis
definition: Any unspecified morphological anomaly of the anatomical axis, such as, for example, abnormal shape or colour.
has_exact_synonym: abnormal morphology of anatomical axis

abnormal animal-vegetal axis morphology
type: Class
subclass of: abnormal animal-vegetal axis
subclass of: abnormal anatomical axis morphology
definition: Any unspecified morphological anomaly of the animal-vegetal axis, such as, for example, abnormal shape or colour.
has_exact_synonym: abnormal morphology of animal-vegetal axis

abnormal anterior-posterior axis morphology
type: Class
subclass of: abnormal anterior-posterior axis
subclass of: abnormal anatomical axis morphology
definition: Any unspecified morphological anomaly of the anterior-posterior axis, such as, for example, abnormal shape or colour.
has_exact_synonym: abnormal morphology of anterior-posterior axis

abnormal dorsal-ventral axis morphology
type: Class
subclass of: abnormal dorsal-ventral axis
subclass of: abnormal anatomical axis morphology
definition: Any unspecified morphological anomaly of the dorsal-ventral axis, such as, for example, abnormal shape or colour.
has_exact_synonym: abnormal morphology of dorsal-ventral axis

abnormal left-right axis morphology
type: Class
subclass of: abnormal left-right axis
subclass of: abnormal anatomical axis morphology
definition: Any unspecified morphological anomaly of the left-right axis, such as, for example, abnormal shape or colour.
has_exact_synonym: abnormal morphology of left-right axis

abnormal anatomical side morphology
type: Class
subclass of: abnormal anatomical side
subclass of: XPO_0141316
definition: Any unspecified morphological anomaly of the anatomical side, such as, for example, abnormal shape or colour.
has_exact_synonym: abnormal morphology of anatomical side

abnormal anterior side morphology
type: Class
subclass of: abnormal anterior side
subclass of: abnormal anatomical side morphology
definition: Any unspecified morphological anomaly of the anterior side, such as, for example, abnormal shape or colour.
has_exact_synonym: abnormal morphology of anterior side

abnormal posterior side morphology
type: Class
subclass of: abnormal posterior side
subclass of: abnormal anatomical side morphology
definition: Any unspecified morphological anomaly of the posterior side, such as, for example, abnormal shape or colour.
has_exact_synonym: abnormal morphology of posterior side

abnormal dorsal side morphology
type: Class
subclass of: abnormal dorsal side
subclass of: abnormal anatomical side morphology
definition: Any unspecified morphological anomaly of the dorsal side, such as, for example, abnormal shape or colour.
has_exact_synonym: abnormal morphology of dorsal side

abnormal ventral side morphology
type: Class
subclass of: abnormal ventral side
subclass of: abnormal anatomical side morphology
definition: Any unspecified morphological anomaly of the ventral side, such as, for example, abnormal shape or colour.
has_exact_synonym: abnormal morphology of ventral side

abnormal left side morphology
type: Class
subclass of: abnormal left side
subclass of: abnormal anatomical side morphology
definition: Any unspecified morphological anomaly of the left side, such as, for example, abnormal shape or colour.
has_exact_synonym: abnormal morphology of left side

abnormal right side morphology
type: Class
subclass of: abnormal right side
subclass of: abnormal anatomical side morphology
definition: Any unspecified morphological anomaly of the right side, such as, for example, abnormal shape or colour.
has_exact_synonym: abnormal morphology of right side

abnormal proximal-distal axis morphology
type: Class
subclass of: abnormal proximal-distal axis
subclass of: abnormal anatomical axis morphology
definition: Any unspecified morphological anomaly of the proximal-distal axis, such as, for example, abnormal shape or colour.
has_exact_synonym: abnormal morphology of proximal-distal axis

obsolete abnormal morphology of apical region
type: Class
deprecated: true

abnormal axial region morphology
type: Class
subclass of: abnormal axial region
subclass of: XPO_0141316
definition: Any unspecified morphological anomaly of the axial region, such as, for example, abnormal shape or colour.
has_exact_synonym: abnormal morphology of axial region

obsolete abnormal morphology of basal region
type: Class
deprecated: true

obsolete abnormal morphology of anterior region
type: Class
deprecated: true

obsolete abnormal morphology of posterior region
type: Class
deprecated: true

obsolete abnormal morphology of dorsal region
type: Class
deprecated: true

obsolete abnormal morphology of ventral region
type: Class
deprecated: true

obsolete abnormal morphology of medial region
type: Class
deprecated: true

obsolete abnormal morphology of antero-dorsal region
type: Class
deprecated: true

obsolete abnormal morphology of antero-ventral region
type: Class
deprecated: true

obsolete abnormal morphology of postero-dorsal region
type: Class
deprecated: true

obsolete abnormal morphology of postero-ventral region
type: Class
deprecated: true

abnormal otic capsule morphology
type: Class
subclass of: abnormal endochondral element morphology
subclass of: abnormal otic capsule
definition: Any unspecified morphological anomaly of the otic capsule, such as, for example, abnormal shape or colour.
has_exact_synonym: abnormal morphology of otic capsule

abnormal migrating myoblast morphology
type: Class
subclass of: abnormal myoblast morphology
subclass of: abnormal migrating myoblast
definition: Any unspecified morphological anomaly of the migrating myoblast, such as, for example, abnormal shape or colour.
has_exact_synonym: abnormal morphology of migrating myoblast

abnormal flexural organ morphology
type: Class
subclass of: abnormal tissue morphology
subclass of: abnormal flexural organ
definition: Any unspecified morphological anomaly of the flexural organ, such as, for example, abnormal shape or colour.
has_exact_synonym: abnormal morphology of flexural organ

abnormal efferent neuron morphology
type: Class
subclass of: abnormal neuron morphology
subclass of: abnormal efferent neuron
definition: Any unspecified morphological anomaly of the efferent neuron, such as, for example, abnormal shape or colour.
has_exact_synonym: abnormal morphology of efferent neuron

abnormal afferent neuron morphology
type: Class
subclass of: abnormal neuron morphology
subclass of: abnormal afferent neuron
definition: Any unspecified morphological anomaly of the afferent neuron, such as, for example, abnormal shape or colour.
has_exact_synonym: abnormal morphology of afferent neuron

abnormal larval alimentary system morphology
type: Class
subclass of: abnormal alimentary system morphology
subclass of: abnormal larval alimentary system
definition: Any unspecified morphological anomaly of the larval alimentary system, such as, for example, abnormal shape or colour.
has_exact_synonym: abnormal morphology of larval alimentary system

abnormal cloacal sphincter morphology
type: Class
subclass of: abnormal multi-tissue structure morphology
subclass of: abnormal cloacal sphincter
definition: Any unspecified morphological anomaly of the cloacal sphincter, such as, for example, abnormal shape or colour.
has_exact_synonym: abnormal morphology of cloacal sphincter

abnormal ionocyte, alpha subtype morphology
type: Class
subclass of: abnormal ionocyte morphology
subclass of: abnormal ionocyte, alpha subtype
definition: Any unspecified morphological anomaly of the ionocyte, alpha subtype, such as, for example, abnormal shape or colour.
has_exact_synonym: abnormal morphology of ionocyte, alpha subtype

abnormal ionocyte, beta subtype morphology
type: Class
subclass of: abnormal ionocyte morphology
subclass of: abnormal ionocyte, beta subtype
definition: Any unspecified morphological anomaly of the ionocyte, beta subtype, such as, for example, abnormal shape or colour.
has_exact_synonym: abnormal morphology of ionocyte, beta subtype

abnormal small secretory cell morphology
type: Class
subclass of: abnormal cell morphology
subclass of: abnormal small secretory cell
definition: Any unspecified morphological anomaly of the small secretory cell, such as, for example, abnormal shape or colour.
has_exact_synonym: abnormal morphology of small secretory cell

abnormal dorsal telencephalon morphology
type: Class
subclass of: abnormal multi-tissue structure morphology
subclass of: abnormal dorsal telencephalon
definition: Any unspecified morphological anomaly of the dorsal telencephalon, such as, for example, abnormal shape or colour.
has_exact_synonym: abnormal morphology of dorsal telencephalon

abnormal intestinal stem cell morphology
type: Class
subclass of: abnormal stem cell morphology
subclass of: abnormal intestinal stem cell
definition: Any unspecified morphological anomaly of the intestinal stem cell, such as, for example, abnormal shape or colour.
has_exact_synonym: abnormal morphology of intestinal stem cell

obsolete abnormal rostral notochord morphology
type: Class
IAO_0000125: XPO_0141719
deprecated: true

obsolete abnormal caudal notochord morphology
type: Class
IAO_0000125: XPO_0141723
deprecated: true

abnormal regenerating lens morphology
type: Class
subclass of: abnormal regenerating tissue morphology
subclass of: abnormal regenerating lens
definition: Any unspecified morphological anomaly of the regenerating lens, such as, for example, abnormal shape or colour.
has_exact_synonym: abnormal morphology of regenerating lens

abnormal superficial layer of neurectoderm morphology
type: Class
subclass of: abnormal tissue morphology
subclass of: abnormal superficial layer of neurectoderm
definition: Any unspecified morphological anomaly of the superficial layer of neurectoderm, such as, for example, abnormal shape or colour.
has_exact_synonym: abnormal morphology of superficial layer of neurectoderm

abnormal posterior neural fold morphology
type: Class
subclass of: abnormal tissue morphology
subclass of: abnormal posterior neural fold
definition: Any unspecified morphological anomaly of the posterior neural fold, such as, for example, abnormal shape or colour.
has_exact_synonym: abnormal morphology of posterior neural fold

abnormal embryonic kidney morphology
type: Class
subclass of: abnormal kidney morphology
subclass of: abnormal embryonic kidney
definition: Any unspecified morphological anomaly of the embryonic kidney, such as, for example, abnormal shape or colour.
has_exact_synonym: abnormal morphology of embryonic kidney

abnormal adult kidney morphology
type: Class
subclass of: abnormal kidney morphology
subclass of: abnormal adult kidney
definition: Any unspecified morphological anomaly of the adult kidney, such as, for example, abnormal shape or colour.
has_exact_synonym: abnormal morphology of adult kidney

abnormal neurenteric canal morphology
type: Class
subclass of: abnormal tissue morphology
subclass of: abnormal neurenteric canal
definition: Any unspecified morphological anomaly of the neurenteric canal, such as, for example, abnormal shape or colour.
has_exact_synonym: abnormal morphology of neurenteric canal

abnormal migratory trunk neural crest cell morphology
type: Class
subclass of: abnormal migratory neural crest cell morphology
subclass of: abnormal migratory trunk neural crest cell
definition: Any unspecified morphological anomaly of the migratory trunk neural crest cell, such as, for example, abnormal shape or colour.
has_exact_synonym: abnormal morphology of migratory trunk neural crest cell

abnormal hindgut endoderm morphology
type: Class
subclass of: abnormal tissue morphology
subclass of: abnormal hindgut endoderm
definition: Any unspecified morphological anomaly of the hindgut endoderm, such as, for example, abnormal shape or colour.
has_exact_synonym: abnormal morphology of hindgut endoderm

abnormal dorsal posterior hindgut endoderm morphology
type: Class
subclass of: abnormal tissue morphology
subclass of: abnormal dorsal posterior hindgut endoderm
definition: Any unspecified morphological anomaly of the dorsal posterior hindgut endoderm, such as, for example, abnormal shape or colour.
has_exact_synonym: abnormal morphology of dorsal posterior hindgut endoderm

abnormal ventral posterior hindgut endoderm morphology
type: Class
subclass of: abnormal tissue morphology
subclass of: abnormal ventral posterior hindgut endoderm
definition: Any unspecified morphological anomaly of the ventral posterior hindgut endoderm, such as, for example, abnormal shape or colour.
has_exact_synonym: abnormal morphology of ventral posterior hindgut endoderm

abnormal posterior hindgut endoderm morphology
type: Class
subclass of: abnormal tissue morphology
subclass of: abnormal posterior hindgut endoderm
definition: Any unspecified morphological anomaly of the posterior hindgut endoderm, such as, for example, abnormal shape or colour.
has_exact_synonym: abnormal morphology of posterior hindgut endoderm

abnormal anterior hindgut endoderm morphology
type: Class
subclass of: abnormal tissue morphology
subclass of: abnormal anterior hindgut endoderm
definition: Any unspecified morphological anomaly of the anterior hindgut endoderm, such as, for example, abnormal shape or colour.
has_exact_synonym: abnormal morphology of anterior hindgut endoderm

obsolete abnormal left olfactory pit morphology
type: Class
deprecated: true

obsolete abnormal right olfactory pit morphology
type: Class
deprecated: true

abnormal apical junction complex morphology
type: Class
subclass of: abnormal cell part morphology
subclass of: abnormal apical junction complex
definition: Any unspecified morphological anomaly of the apical junction complex, such as, for example, abnormal shape or colour.
has_exact_synonym: abnormal morphology of apical junction complex

abnormal filopodium morphology
type: Class
subclass of: abnormal cell part morphology
subclass of: abnormal filopodium
definition: Any unspecified morphological anomaly of the filopodium, such as, for example, abnormal shape or colour.
has_exact_synonym: abnormal morphology of filopodium

obsolete abnormal left eye morphology
type: Class
deprecated: true

obsolete abnormal right eye morphology
type: Class
deprecated: true

obsolete abnormal left inner ear morphology
type: Class
deprecated: true

obsolete abnormal right inner ear morphology
type: Class
deprecated: true

abnormal ventral trunk morphology
type: Class
subclass of: abnormal organism subdivision morphology
subclass of: abnormal ventral trunk
definition: Any unspecified morphological anomaly of the ventral trunk, such as, for example, abnormal shape or colour.
has_exact_synonym: abnormal morphology of ventral trunk

abnormal posterior tail morphology
type: Class
subclass of: abnormal tissue morphology
subclass of: abnormal posterior tail
definition: Any unspecified morphological anomaly of the posterior tail, such as, for example, abnormal shape or colour.
has_exact_synonym: abnormal morphology of posterior tail

abnormal anterior dorsal fin morphology
type: Class
subclass of: abnormal tissue morphology
subclass of: abnormal anterior dorsal fin
definition: Any unspecified morphological anomaly of the anterior dorsal fin, such as, for example, abnormal shape or colour.
has_exact_synonym: abnormal morphology of anterior dorsal fin

abnormal anterior neuroectoderm morphology
type: Class
subclass of: abnormal tissue morphology
subclass of: abnormal anterior neuroectoderm
definition: Any unspecified morphological anomaly of the anterior neuroectoderm, such as, for example, abnormal shape or colour.
has_exact_synonym: abnormal morphology of anterior neuroectoderm

abnormal dorsal tail morphology
type: Class
subclass of: abnormal organism subdivision morphology
subclass of: abnormal dorsal tail
definition: Any unspecified morphological anomaly of the dorsal tail, such as, for example, abnormal shape or colour.
has_exact_synonym: abnormal morphology of dorsal tail

abnormal dorsal trunk morphology
type: Class
subclass of: abnormal organism subdivision morphology
subclass of: abnormal dorsal trunk
definition: Any unspecified morphological anomaly of the dorsal trunk, such as, for example, abnormal shape or colour.
has_exact_synonym: abnormal morphology of dorsal trunk

abnormal thrombocyte morphology
type: Class
subclass of: abnormal cell morphology
subclass of: abnormal thrombocyte
definition: Any unspecified morphological anomaly of the thrombocyte, such as, for example, abnormal shape or colour.
has_exact_synonym: abnormal morphology of thrombocyte

abnormal embryonic thrombocyte morphology
type: Class
subclass of: abnormal embryonic thrombocyte
subclass of: abnormal thrombocyte morphology
definition: Any unspecified morphological anomaly of the embryonic thrombocyte, such as, for example, abnormal shape or colour.
has_exact_synonym: abnormal morphology of embryonic thrombocyte

abnormal adult thrombocyte morphology
type: Class
subclass of: abnormal adult thrombocyte
subclass of: abnormal thrombocyte morphology
definition: Any unspecified morphological anomaly of the adult thrombocyte, such as, for example, abnormal shape or colour.
has_exact_synonym: abnormal morphology of adult thrombocyte

abnormal regenerating pelvic girdle morphology
type: Class
subclass of: abnormal regenerating tissue morphology
subclass of: abnormal regenerating pelvic girdle
definition: Any unspecified morphological anomaly of the regenerating pelvic girdle, such as, for example, abnormal shape or colour.
has_exact_synonym: abnormal morphology of regenerating pelvic girdle

obsolete abnormal left part of branchial arch skeleton morphology
type: Class
deprecated: true

obsolete abnormal right part of branchial arch skeleton morphology
type: Class
deprecated: true

obsolete abnormal left forelimb morphology
type: Class
deprecated: true

obsolete abnormal right forelimb morphology
type: Class
deprecated: true

obsolete abnormal left hindlimb morphology
type: Class
deprecated: true

obsolete abnormal right hindlimb morphology
type: Class
deprecated: true

obsolete abnormal left optic vesicle morphology
type: Class
deprecated: true

obsolete abnormal right optic vesicle morphology
type: Class
deprecated: true

obsolete abnormal left part of brain morphology
type: Class
deprecated: true

obsolete abnormal right part of brain morphology
type: Class
deprecated: true

obsolete abnormal morphology of ventro-lateral region
type: Class
deprecated: true

obsolete abnormal morphology of dorso-lateral region
type: Class
deprecated: true

abnormal yolk platelet morphology
type: Class
subclass of: abnormal cell part morphology
subclass of: abnormal yolk platelet
definition: Any unspecified morphological anomaly of the yolk platelet, such as, for example, abnormal shape or colour.
has_exact_synonym: abnormal morphology of yolk platelet

obsolete abnormal(ly) duplicated of lens (T)
type: Class
IAO_0000125: duplicated lens
deprecated: true

abnormally increased volume of brain
type: Class
subclass of: increased size of the brain
definition: Abnormal(ly) increased volume of brain (Temporary definition).

obsolete abnormal(ly) open of brain (T)
type: Class
deprecated: true

abnormally incomplete structure of forebrain
type: Class
subclass of: abnormal forebrain morphology
definition: Abnormal(ly) incomplete structure of forebrain (Temporary definition).

abnormally undivided branchial crest
type: Class
subclass of: abnormal branchial crest morphology
definition: Abnormal(ly) undivided of branchial crest (Temporary definition).

abnormally neoplastic epidermis
type: Class
subclass of: abnormal epidermis morphology
definition: Abnormal(ly) neoplastic of epidermis (Temporary definition).

abnormally incomplete structure of epidermis
type: Class
subclass of: abnormal epidermis morphology
definition: Abnormal(ly) incomplete structure of epidermis (Temporary definition).

obsolete abnormal(ly) separated from of epidermis outer layer (T)
type: Class
deprecated: true

obsolete abnormal(ly) normal amount of ciliated epidermal cell (T)
type: Class
deprecated: true

obsolete abnormal(ly) duplicated of cement gland (T)
type: Class
IAO_0000125: duplicated cement gland
deprecated: true

obsolete abnormal(ly) absent of epidermis inner layer (T)
type: Class
IAO_0000125: absent epidermis inner layer
deprecated: true

obsolete abnormal(ly) transformed to of neuroectoderm (T)
type: Class
deprecated: true

obsolete abnormal(ly) lacks parts or has fewer parts of type of dorsal aorta (T)
type: Class
deprecated: true

obsolete abnormal(ly) decreased length of trunk region (T)
type: Class
IAO_0000125: decreased length of trunk
deprecated: true

obsolete abnormal(ly) hypoplastic of notochord (T)
type: Class
IAO_0000125: decreased size of the notochord
deprecated: true

abnormally irregular spatial pattern of somite
type: Class
subclass of: abnormal somite morphology
definition: Abnormal(ly) irregular spatial pattern of somite (Temporary definition).

obsolete abnormal(ly) fused with of somite (T)
type: Class
deprecated: true

obsolete abnormal(ly) disorganized of somite (T)
type: Class
IAO_0000125: abnormal somite morphology
deprecated: true

abnormally anteriorly mislocalised somite
type: Class
subclass of: XPO_0126360
definition: Abnormal(ly) mislocalised anteriorly of somite (Temporary definition).

obsolete abnormal(ly) obtuse of somite (T)
type: Class
IAO_0000125: abnormal somite morphology
deprecated: true

abnormally neoplastic somite
type: Class
subclass of: abnormal somite morphology
definition: Abnormal(ly) neoplastic of somite (Temporary definition).

abnormally increased volume of heart
type: Class
subclass of: increased size of the heart
definition: Abnormal(ly) increased volume of heart (Temporary definition).

abnormally decreased volume of heart
type: Class
subclass of: decreased size of the heart
definition: Abnormal(ly) decreased volume of heart (Temporary definition).

abnormally inverted heart
type: Class
subclass of: abnormal heart morphology
definition: Abnormal(ly) inverted of heart (Temporary definition).

obsolete abnormally edematous heart
type: Class
IAO_0000125: XPO_0141592
deprecated: true

obsolete abnormal(ly) duplicated of heart (T)
type: Class
IAO_0000125: duplicated heart
deprecated: true

obsolete abnormal(ly) deformed of heart (T)
type: Class
IAO_0000125: abnormal heart morphology
deprecated: true

abnormally oblique orientation of heart
type: Class
subclass of: abnormal heart
definition: Abnormal(ly) oblique orientation of heart (Temporary definition).

abnormally decreased thickness of myocardium
type: Class
subclass of: XPO_0128556
definition: Abnormal(ly) decreased thickness of myocardium (Temporary definition).

obsolete abnormal(ly) decreased area of dorsal marginal zone (T)
type: Class
deprecated: true

obsolete abnormal(ly) apoptotic of blastopore lip (T)
type: Class
deprecated: true

abnormally decreased adhesivity of prechordal plate
type: Class
subclass of: abnormal prechordal plate
definition: Abnormal(ly) decreased adhesivity of prechordal plate (Temporary definition).

obsolete abnormal(ly) decreased length of tail region (T)
type: Class
IAO_0000125: decreased length of tail
deprecated: true

obsolete abnormal(ly) undulate of tail region (T)
type: Class
IAO_0000125: abnormal bending of tail
deprecated: true

obsolete abnormal(ly) increased size of endoderm (T)
type: Class
IAO_0000125: XPO_0129522
deprecated: true

obsolete abnormal(ly) absent of archenteron (T)
type: Class
IAO_0000125: absent archenteron
deprecated: true

abnormally decreased volume of archenteron
type: Class
subclass of: decreased size of the archenteron
definition: Abnormal(ly) decreased volume of archenteron (Temporary definition).

obsolete abnormal(ly) disorganized of midgut (T)
type: Class
IAO_0000125: abnormal midgut morphology
deprecated: true

abnormally decreased length of hindgut
type: Class
subclass of: XPO_0128445
definition: Abnormal(ly) decreased length of hindgut (Temporary definition).

obsolete abnormal(ly) increased size of hindgut (T)
type: Class
IAO_0000125: XPO_0129925
deprecated: true

obsolete abnormal(ly) decreased size of hindgut (T)
type: Class
IAO_0000125: XPO_0128445
deprecated: true

obsolete abnormal(ly) truncated of tail bud (T)
type: Class
IAO_0000125: abnormal tail bud morphology
deprecated: true

obsolete abnormal(ly) decreased amount of germ cell (T)
type: Class
IAO_0000125: XPO_0131192
deprecated: true

obsolete abnormal(ly) dorso-ventrally flattened of embryo (T)
type: Class
IAO_0000125: decreased length of dorsal-ventral axis
deprecated: true

abnormally anterioralized embryo
type: Class
subclass of: abnormal embryo morphology
definition: Abnormal(ly) anterioralized of embryo (Temporary definition).

abnormally dorsalized embryo
type: Class
subclass of: abnormal embryo morphology
definition: Abnormal(ly) dorsalized of embryo (Temporary definition).

abnormally posterioralized embryo
type: Class
subclass of: abnormal embryo morphology
definition: Abnormal(ly) posterioralized of embryo (Temporary definition).

abnormally ventralized embryo
type: Class
subclass of: abnormal embryo morphology
definition: Abnormal(ly) ventralized of embryo (Temporary definition).

abnormal agenesis of trachea
type: Class
subclass of: XPO_0126017
definition: Abnormal(ly) agenesis of trachea (Temporary definition).

abnormally decreased length of alimentary system
type: Class
subclass of: decreased size of the alimentary system
definition: Abnormal(ly) decreased length of alimentary system (Temporary definition).

abnormally edematous alimentary system
type: Class
subclass of: abnormal alimentary system morphology
definition: Abnormal(ly) edematous of alimentary system (Temporary definition).

abnormally undifferentiated alimentary system
type: Class
subclass of: abnormal alimentary system
definition: Abnormal(ly) undifferentiated of alimentary system (Temporary definition).

abnormally incomplete structure of alimentary system
type: Class
subclass of: abnormal alimentary system morphology
definition: Abnormal(ly) incomplete structure of alimentary system (Temporary definition).

abnormally decreased volume of oral cavity
type: Class
subclass of: XPO_0129152
definition: Abnormal(ly) decreased volume of oral cavity (Temporary definition).

obsolete abnormal(ly) absent of stomach (T)
type: Class
IAO_0000125: XPO_0125518
deprecated: true

obsolete abnormal(ly) hypoplastic of stomach (T)
type: Class
IAO_0000125: decreased size of the stomach
deprecated: true

abnormally decreased length of intestine
type: Class
subclass of: XPO_0128410
definition: Abnormal(ly) decreased length of intestine (Temporary definition).

obsolete abnormal(ly) disorganized of intestine (T)
type: Class
IAO_0000125: abnormal intestine morphology
deprecated: true

obsolete abnormal(ly) uncoiled of small intestine (T)
type: Class
deprecated: true

obsolete abnormal(ly) decreased coiling of small intestine (T)
type: Class
IAO_0000125: XPO_0133350
deprecated: true

obsolete abnormal(ly) absent of liver (T)
type: Class
IAO_0000125: XPO_0125494
deprecated: true

obsolete abnormal(ly) increased size of liver (T)
type: Class
IAO_0000125: XPO_0130151
deprecated: true

obsolete abnormal(ly) absent of pancreas (T)
type: Class
IAO_0000125: absent pancreas
deprecated: true

obsolete abnormal(ly) mislocalised of pancreas (T)
type: Class
IAO_0000125: XPO_0126684
deprecated: true

multiple pancreases
type: Class
subclass of: abnormal pancreas
definition: Abnormal(ly) multiple of pancreas (Temporary definition).

obsolete abnormal(ly) lacks parts or has fewer parts of type of mesentery (T)
type: Class
deprecated: true

obsolete abnormal(ly) mislocalised of muscle (T)
type: Class
IAO_0000125: XPO_0126405
deprecated: true

abnormally anteriorly mislocalised skeletal muscle
type: Class
subclass of: XPO_0127002
definition: Abnormal(ly) mislocalised anteriorly of skeletal muscle (Temporary definition).

obsolete abnormal(ly) decreased distance of eye (T)
type: Class
deprecated: true

abnormally increased number of eye
type: Class
subclass of: abnormal eye
definition: Abnormal(ly) increased amount of eye (Temporary definition).

abnormally wholly ventralized eye
type: Class
subclass of: abnormal eye morphology
definition: Abnormal(ly) wholly ventralized of eye (Temporary definition).

obsolete abnormal(ly) decreased diameter of eye (T)
type: Class
IAO_0000125: decreased size of the eye
deprecated: true

abnormally anteriorly mislocalised eye
type: Class
subclass of: XPO_0126513
definition: Abnormal(ly) mislocalised anteriorly of eye (Temporary definition).

abnormally medially mislocalised eye
type: Class
subclass of: XPO_0126513
definition: Abnormal(ly) mislocalised medially of eye (Temporary definition).

obsolete abnormal(ly) deviation towards the medial side of eye (T)
type: Class
deprecated: true

obsolete abnormal(ly) decreased pigmentation of eye (T)
type: Class
IAO_0000125: XPO_0141343
deprecated: true

abnormally incomplete structure of eye
type: Class
subclass of: abnormal eye morphology
definition: Abnormal(ly) incomplete structure of eye (Temporary definition).

obsolete abnormal(ly) mislocalised of inner ear (T)
type: Class
IAO_0000125: XPO_0126883
deprecated: true

obsolete abnormal(ly) duplicated of utricle (T)
type: Class
IAO_0000125: duplicated utricle
deprecated: true

abnormally loose axial mesoderm
type: Class
subclass of: abnormal axial mesoderm morphology
definition: Abnormal(ly) loose of axial mesoderm (Temporary definition).

obsolete abnormal(ly) delayed of blastopore (T)
type: Class
IAO_0000125: XPO_0132199
deprecated: true

abnormally increased area of blastopore
type: Class
subclass of: XPO_0130416
definition: Abnormal(ly) increased area of blastopore (Temporary definition).

abnormally delayed closure of blastopore
type: Class
subclass of: abnormal blastopore
definition: Abnormal(ly) delayed closure of blastopore (Temporary definition).

obsolete abnormal(ly) disorganized of dermatome (T)
type: Class
IAO_0000125: abnormal dermatome morphology
deprecated: true

obsolete abnormal(ly) hypoplastic of foregut (T)
type: Class
IAO_0000125: decreased size of the foregut
deprecated: true

obsolete abnormal(ly) disorganized of foregut (T)
type: Class
IAO_0000125: abnormal foregut morphology
deprecated: true

abnormally edematous foregut
type: Class
subclass of: abnormal foregut morphology
definition: Abnormal(ly) edematous of foregut (Temporary definition).

abnormally decreased coiling of foregut
type: Class
subclass of: abnormal foregut morphology
definition: Abnormal(ly) decreased coiling of foregut (Temporary definition).

abnormally duplicated cardiac mesoderm
type: Class
subclass of: abnormal cardiac mesoderm
definition: Abnormal(ly) duplicated of cardiac mesoderm (Temporary definition).

abnormally abaxially mislocalized cardiac mesoderm
type: Class
subclass of: XPO_0126640
definition: Abnormal(ly) mislocalized abaxially of cardiac mesoderm (Temporary definition).

obsolete abnormal(ly) absent of posterior cardinal vein (T)
type: Class
IAO_0000125: XPO_0125812
deprecated: true

obsolete abnormal(ly) lacks parts or has fewer parts of type of posterior cardinal vein (T)
type: Class
deprecated: true

obsolete abnormal(ly) necrotic of neural plate (T)
type: Class
IAO_0000125: XPO_0139817
deprecated: true

abnormally increased volume of blastocoel
type: Class
subclass of: XPO_0129774
definition: Abnormal(ly) increased volume of blastocoel (Temporary definition).

abnormally protruding central endoderm
type: Class
subclass of: abnormal central endoderm
definition: Abnormal(ly) protruding out of of central endoderm (Temporary definition).

obsolete abnormal(ly) open of anterior neural tube (T)
type: Class
IAO_0000125: XPO_0131750
deprecated: true

abnormally decreased height of anterior neural fold
type: Class
subclass of: XPO_0128414
definition: Abnormal(ly) decreased height of anterior neural fold (Temporary definition).

abnormally wholly dorsalized trunk somite
type: Class
subclass of: abnormal trunk somite morphology
definition: Abnormal(ly) wholly dorsalized of trunk somite (Temporary definition).

abnormally disorganized myotome
type: Class
subclass of: abnormal myotome morphology
definition: Abnormal(ly) disorganized of myotome (Temporary definition).

obsolete abnormal(ly) decreased size of Mullerian duct (T)
type: Class
IAO_0000125: XPO_0128915
deprecated: true

abnormally delayed phase of Mullerian duct
type: Class
subclass of: abnormal Mullerian duct
definition: Abnormal(ly) delayed phase of Mullerian duct (Temporary definition).

abnormally decreased diameter of Mullerian duct
type: Class
subclass of: XPO_0128915
definition: Abnormal(ly) decreased diameter of Mullerian duct (Temporary definition).

obsolete abnormal(ly) lacks parts or has fewer parts of type of ventral aorta (T)
type: Class
deprecated: true

obsolete abnormal(ly) absent of dorsal pancreatic bud (T)
type: Class
IAO_0000125: absent dorsal pancreatic bud
deprecated: true

obsolete abnormal(ly) increased size of dorsal pancreatic bud (T)
type: Class
IAO_0000125: XPO_0129558
deprecated: true

abnormally pigmented optic stalk
type: Class
subclass of: abnormal optic stalk morphology
definition: Abnormal(ly) pigmented of optic stalk (Temporary definition).

abnormally irregular spatial pattern of cranial neural crest
type: Class
subclass of: abnormal cranial neural crest morphology
definition: Abnormal(ly) irregular spatial pattern of cranial neural crest (Temporary definition).

obsolete abnormal(ly) decreased mobility of cranial neural crest (T)
type: Class
IAO_0000125: decreased cell migration in cranial neural crest
deprecated: true

obsolete abnormal(ly) hypoplastic of lung primordium (T)
type: Class
IAO_0000125: XPO_0128149
deprecated: true

obsolete abnormal(ly) has fewer parts of type of melanophore (T)
type: Class
IAO_0000125: abnormally decreased number of melanophore
deprecated: true

abnormally increased distribution of connective tissue
type: Class
subclass of: abnormal connective tissue morphology
definition: Abnormal(ly) increased distribution of connective tissue (Temporary definition).

obsolete abnormal(ly) hypertrophic of proctodeum (T)
type: Class
IAO_0000125: XPO_0130287
deprecated: true

obsolete abnormal(ly) increased size of proctodeum (T)
type: Class
IAO_0000125: XPO_0130287
deprecated: true

abnormally incomplete closure of proctodeum
type: Class
subclass of: abnormal proctodeum morphology
definition: Abnormal(ly) closure incomplete of proctodeum (Temporary definition).

abnormally protruding proctodeum
type: Class
subclass of: abnormal proctodeum
definition: Abnormal(ly) protruding of proctodeum (Temporary definition).

obsolete abnormal(ly) increased size of ventral pancreatic bud (T)
type: Class
IAO_0000125: XPO_0129605
deprecated: true

obsolete abnormal(ly) wholly anterioralized of whole organism (T)
type: Class
deprecated: true

obsolete abnormal(ly) wholly dorsalized of whole organism (T)
type: Class
deprecated: true

obsolete abnormal(ly) wholly posterioralized of whole organism (T)
type: Class
deprecated: true

obsolete abnormal(ly) wholly ventralized of whole organism (T)
type: Class
deprecated: true

dead whole organism
type: Class
subclass of: abnormal whole organism
definition: Abnormal(ly) dead of whole organism (Temporary definition).

abnormally laterally curved whole organism
type: Class
subclass of: abnormal whole organism morphology
definition: Abnormal(ly) curved lateral of whole organism (Temporary definition).

abnormally peramorphic growth of whole organism
type: Class
subclass of: abnormal whole organism
definition: Abnormal(ly) peramorphic growth of whole organism (Temporary definition).

abnormally semi-viable whole organism
type: Class
subclass of: abnormal whole organism
definition: Abnormal(ly) semi-viable of whole organism (Temporary definition).

abnormal degeneration of whole organism
type: Class
subclass of: abnormal whole organism morphology
definition: Abnormal(ly) degeneration of whole organism (Temporary definition).

abnormally semi-erect whole organism
type: Class
subclass of: abnormal whole organism
definition: Abnormal(ly) semi erect of whole organism (Temporary definition).

obsolete abnormal(ly) phenotypic sex of male organism (T)
type: Class
IAO_0000125: XPO_0131732
deprecated: true

obsolete abnormal(ly) truncated of head (T)
type: Class
IAO_0000125: decreased size of the head
deprecated: true

abnormally edematous head
type: Class
subclass of: abnormal head morphology
definition: Abnormal(ly) edematous of head (Temporary definition).

obsolete abnormal(ly) duplicated of head (T)
type: Class
IAO_0000125: duplicated head
deprecated: true

obsolete abnormal(ly) condensed of head (T)
type: Class
deprecated: true

obsolete abnormal(ly) immature of head (T)
type: Class
IAO_0000125: XPO_0131781
deprecated: true

obsolete abnormal(ly) disrupted of head (T)
type: Class
IAO_0000125: abnormal head morphology
deprecated: true

abnormally incomplete structure of head
type: Class
subclass of: abnormal head morphology
definition: Abnormal(ly) incomplete structure of head (Temporary definition).

obsolete abnormal(ly) hypoplastic of trunk (T)
type: Class
IAO_0000125: decreased size of the trunk
deprecated: true

obsolete abnormal(ly) truncated of trunk (T)
type: Class
IAO_0000125: decreased size of the trunk
deprecated: true

obsolete abnormal(ly) duplicated of trunk (T)
type: Class
IAO_0000125: duplicated trunk
deprecated: true

abnormally nodular trunk
type: Class
subclass of: abnormal trunk morphology
definition: Abnormal(ly) nodular of trunk (Temporary definition).

obsolete abnormal(ly) curved of tail (T)
type: Class
IAO_0000125: abnormal bending of tail
deprecated: true

obsolete abnormal(ly) delayed of tail (T)
type: Class
IAO_0000125: abnormal tail morphology
deprecated: true

obsolete abnormal(ly) hypoplastic of tail (T)
type: Class
IAO_0000125: decreased size of the tail
deprecated: true

obsolete abnormal(ly) truncated of tail (T)
type: Class
IAO_0000125: abnormal tail morphology
IAO_0000125: decreased size of the tail
deprecated: true

obsolete abnormal(ly) undulate of tail (T)
type: Class
IAO_0000125: abnormal bending of tail
deprecated: true

abnormally ventrally curved tail
type: Class
subclass of: abnormal tail morphology
definition: Abnormal(ly) curved ventral of tail (Temporary definition).

obsolete abnormal(ly) duplicated of tail (T)
type: Class
IAO_0000125: duplicated tail
deprecated: true

obsolete abnormal(ly) immature of tail (T)
type: Class
IAO_0000125: abnormal tail morphology
deprecated: true

obsolete abnormal(ly) deformed of tail (T)
type: Class
IAO_0000125: abnormal tail morphology
deprecated: true

obsolete abnormal(ly) kinked of tail (T)
type: Class
IAO_0000125: abnormal bending of tail
deprecated: true

obsolete abnormal(ly) hemorrhagic of tail (T)
type: Class
IAO_0000125: abnormal tail vasculature
deprecated: true

abnormally incomplete structure of tail
type: Class
subclass of: abnormal tail morphology
definition: Abnormal(ly) incomplete structure of tail (Temporary definition).

obsolete abnormal(ly) circular of mouth (T)
type: Class
deprecated: true

obsolete abnormal(ly) triangular of mouth (T)
type: Class
deprecated: true

abnormally incomplete structure of mouth
type: Class
subclass of: abnormal mouth morphology
definition: Abnormal(ly) incomplete structure of mouth (Temporary definition).

obsolete abnormally paralysed forelimb
type: Class
IAO_0000125: XPO_0141662
deprecated: true

obsolete abnormal(ly) obtuse angle to of forelimb (T)
type: Class
deprecated: true

obsolete abnormal(ly) duplicated of forelimb (T)
type: Class
IAO_0000125: duplicated forelimb
deprecated: true

abnormal variability of size of forelimb
type: Class
subclass of: abnormal forelimb
definition: Abnormal(ly) variability of size of forelimb (Temporary definition).

obsolete abnormally paralysed hindlimb
type: Class
IAO_0000125: XPO_0141663
deprecated: true

obsolete abnormal(ly) obtuse angle to of hindlimb (T)
type: Class
deprecated: true

obsolete abnormal(ly) duplicated of hindlimb (T)
type: Class
IAO_0000125: duplicated hindlimb
deprecated: true

abnormal variability of size of hindlimb
type: Class
subclass of: abnormal hindlimb
definition: Abnormal(ly) variability of size of hindlimb (Temporary definition).

obsolete abnormal(ly) has extra parts of type of hindlimb (T)
type: Class
IAO_0000125: abnormally increased number of hindlimb
deprecated: true

obsolete abnormal(ly) fused with of hindlimb digit (T)
type: Class
deprecated: true

obsolete abnormal(ly) has normal numbers of parts of type of hindlimb digit (T)
type: Class
deprecated: true

obsolete abnormal(ly) has fewer parts of type of hindlimb digit (T)
type: Class
IAO_0000125: abnormally decreased number of hindlimb digit
deprecated: true

obsolete abnormal(ly) has extra parts of type of hindlimb digit (T)
type: Class
IAO_0000125: abnormally increased number of hindlimb digit
deprecated: true

obsolete abnormal(ly) shape of forelimb digit (T)
type: Class
IAO_0000125: abnormal forelimb digit morphology
deprecated: true

obsolete abnormal(ly) has fewer parts of type of forelimb digit (T)
type: Class
IAO_0000125: abnormally decreased number of forelimb digit
deprecated: true

obsolete abnormal(ly) distributed of mesenchyme (T)
type: Class
IAO_0000125: abnormal mesenchyme morphology
deprecated: true

abnormally decreased volume of chondrocranium
type: Class
subclass of: decreased size of the chondrocranium
definition: Abnormal(ly) decreased volume of chondrocranium (Temporary definition).

obsolete abnormal(ly) hypoplastic of chondrocranium (T)
type: Class
IAO_0000125: decreased size of the chondrocranium
deprecated: true

abnormally decreased mass of chondrocranium
type: Class
subclass of: abnormal chondrocranium
definition: Abnormal(ly) decreased mass of chondrocranium (Temporary definition).

obsolete abnormal(ly) duplicated of pelvic girdle (T)
type: Class
IAO_0000125: duplicated pelvic girdle
deprecated: true

obsolete abnormal(ly) concealed of forelimb bud (T)
type: Class
deprecated: true

obsolete abnormal(ly) concealed by of forelimb bud (T)
type: Class
deprecated: true

obsolete abnormal(ly) hyperplastic of hindlimb bud (T)
type: Class
IAO_0000125: increased size of the hindlimb bud
deprecated: true

obsolete abnormal(ly) duplicated of hindlimb bud (T)
type: Class
IAO_0000125: duplicated hindlimb bud
deprecated: true

abnormally increased distribution of hindlimb bud
type: Class
subclass of: abnormal hindlimb bud morphology
definition: Abnormal(ly) increased distribution of hindlimb bud (Temporary definition).

abnormally peramorphic growth of hindlimb bud
type: Class
subclass of: abnormal hindlimb bud
definition: Abnormal(ly) peramorphic growth of hindlimb bud (Temporary definition).

abnormal variability of size of hindlimb bud
type: Class
subclass of: abnormal hindlimb bud
definition: Abnormal(ly) variability of size of hindlimb bud (Temporary definition).

abnormally aplastic growth of hindlimb bud
type: Class
subclass of: abnormal hindlimb bud
definition: Abnormal(ly) aplastic growth of hindlimb bud (Temporary definition).

obsolete abnormal(ly) decreased amount of Meckel's cartilage (T)
type: Class
IAO_0000125: decreased size of the Meckel's cartilage
deprecated: true

obsolete abnormal(ly) incomplete structure of Meckel's cartilage (T)
type: Class
deprecated: true

abnormally posteriorly mislocalised primordial germ cell
type: Class
subclass of: XPO_0126983
definition: Abnormal(ly) mislocalised posteriorly of primordial germ cell (Temporary definition).

obsolete abnormal(ly) decreased amount of primordial germ cell (T)
type: Class
IAO_0000125: XPO_0131191
deprecated: true

abnormally posterioralized primordial germ cell
type: Class
subclass of: abnormal primordial germ cell morphology
definition: Abnormal(ly) posterioralized of primordial germ cell (Temporary definition).

obsolete abnormal(ly) absent of branchial arch skeleton (T)
type: Class
IAO_0000125: absent branchial arch skeleton
deprecated: true

abnormally dilated cardiac ventricle
type: Class
subclass of: increased size of the cardiac ventricle
definition: Abnormal(ly) dilated of cardiac ventricle (Temporary definition).

abnormally open neural tube
type: Class
subclass of: abnormal neural tube morphology
definition: Abnormal(ly) open of neural tube (Temporary definition).

abnormally delayed closure of neural tube
type: Class
subclass of: abnormal neural tube
definition: Abnormal(ly) delayed closure of neural tube (Temporary definition).

abnormally triangular radio-ulna
type: Class
subclass of: abnormal radio-ulna morphology
definition: Abnormal(ly) triangular of radio-ulna (Temporary definition).

abnormally bent metatarsus
type: Class
subclass of: abnormal metatarsus morphology
definition: Abnormal(ly) bent of metatarsus (Temporary definition).

abnormally triangular tibia-fibula
type: Class
subclass of: abnormal tibia-fibula morphology
definition: Abnormal(ly) triangular of tibia-fibula (Temporary definition).

obsolete abnormal(ly) duplicated of femur (T)
type: Class
IAO_0000125: duplicated femur
deprecated: true

abnormally triangular femur
type: Class
subclass of: abnormal femur morphology
definition: Abnormal(ly) triangular of femur (Temporary definition).

obsolete abnormal(ly) surrounding of retinal pigmented epithelium (T)
type: Class
deprecated: true

abnormally ventrally mislocalised retinal pigmented epithelium
type: Class
subclass of: XPO_0127586
definition: Abnormal(ly) mislocalised ventrally of retinal pigmented epithelium (Temporary definition).

abnormally increased amount of hypaxial muscle
type: Class
subclass of: abnormal hypaxial muscle
definition: Abnormal(ly) increased amount of hypaxial muscle (Temporary definition).

obsolete abnormal(ly) decreased amount of hypaxial muscle (T)
type: Class
deprecated: true

abnormally wholly dorsalized epaxial muscle
type: Class
subclass of: abnormal epaxial muscle morphology
definition: Abnormal(ly) wholly dorsalized of epaxial muscle (Temporary definition).

obsolete abnormal(ly) displaced to of ectodermal cell (T)
type: Class
IAO_0000125: XPO_0126481
deprecated: true

obsolete abnormal(ly) hypoplastic of liver primordium (T)
type: Class
IAO_0000125: XPO_0128699
deprecated: true

obsolete abnormal(ly) absent of dorsal fin (T)
type: Class
IAO_0000125: absent dorsal fin
deprecated: true

abnormally edematous dorsal fin
type: Class
subclass of: abnormal dorsal fin morphology
definition: Abnormal(ly) edematous of dorsal fin (Temporary definition).

abnormally ruffled dorsal fin
type: Class
subclass of: abnormal dorsal fin morphology
definition: Abnormal(ly) ruffled of dorsal fin (Temporary definition).

abnormally incomplete structure of ventral tail fin
type: Class
subclass of: abnormal ventral tail fin morphology
definition: Abnormal(ly) incomplete structure of ventral tail fin (Temporary definition).

abnormally ruffled ventral fin margin
type: Class
subclass of: abnormal ventral fin margin morphology
definition: Abnormal(ly) ruffled of ventral fin margin (Temporary definition).

abnormally incomplete structure of ventral fin margin
type: Class
subclass of: abnormal ventral fin margin morphology
definition: Abnormal(ly) incomplete structure of ventral fin margin (Temporary definition).

obsolete abnormal(ly) disrupted of migratory neural crest cell (T)
type: Class
IAO_0000125: abnormal migratory neural crest cell
deprecated: true

abnormally decreased mobility of migratory neural crest cell
type: Class
subclass of: abnormal migratory neural crest cell
definition: Abnormal(ly) decreased mobility of migratory neural crest cell (Temporary definition).

obsolete abnormal(ly) absent of intersomitic vessel (T)
type: Class
IAO_0000125: absent intersomitic vessel
deprecated: true

abnormally increased mobility of non-neural ectoderm
type: Class
subclass of: abnormal non-neural ectoderm
definition: Abnormal(ly) increased mobility of non-neural ectoderm (Temporary definition).

abnormally decreased mobility of non-neural ectoderm
type: Class
subclass of: abnormal non-neural ectoderm
definition: Abnormal(ly) decreased mobility of non-neural ectoderm (Temporary definition).

poorly differentiated retinal ganglion cell
type: Class
subclass of: abnormal retinal ganglion cell
definition: Abnormal(ly) poorly differentiated of retinal ganglion cell (Temporary definition).

abnormally increased diameter of pronephric tubule
type: Class
subclass of: increased size of the pronephric tubule
definition: Abnormal(ly) increased diameter of pronephric tubule (Temporary definition).

abnormally shortened pronephric tubule
type: Class
subclass of: abnormal pronephric tubule morphology
definition: Abnormal(ly) shortened of pronephric tubule (Temporary definition).

obsolete abnormal(ly) shape of regenerating forelimb (T)
type: Class
IAO_0000125: abnormal regenerating forelimb morphology
deprecated: true

abnormally edematous regenerating hindlimb
type: Class
subclass of: abnormal regenerating hindlimb morphology
definition: Abnormal(ly) edematous of regenerating hindlimb (Temporary definition).

obsolete abnormal(ly) duplicated of regenerating hindlimb (T)
type: Class
IAO_0000125: duplicated regenerating hindlimb
deprecated: true

obsolete abnormal(ly) hypermorphic growth of regenerating hindlimb (T)
type: Class
IAO_0000125: XPO_0130058
deprecated: true

obsolete abnormal(ly) has normal numbers of parts of type of regenerating hindlimb (T)
type: Class
deprecated: true

abnormally increased branchiness of regenerating hindlimb
type: Class
subclass of: abnormal regenerating hindlimb morphology
definition: Abnormal(ly) increased branchiness of regenerating hindlimb (Temporary definition).

abnormally shortened regenerating hindlimb
type: Class
subclass of: abnormal regenerating hindlimb morphology
definition: Abnormal(ly) shortened of regenerating hindlimb (Temporary definition).

abnormally incomplete structure of regenerating hindlimb
type: Class
subclass of: abnormal regenerating hindlimb morphology
definition: Abnormal(ly) incomplete structure of regenerating hindlimb (Temporary definition).

abnormally aplastic growth of regenerating tail
type: Class
subclass of: abnormal regenerating tail
definition: Abnormal(ly) aplastic growth of regenerating tail (Temporary definition).

abnormally incomplete structure of regenerating tail
type: Class
subclass of: abnormal regenerating tail morphology
definition: Abnormal(ly) incomplete structure of regenerating tail (Temporary definition).

obsolete abnormal(ly) normal amount of retinal cone cell (T)
type: Class
deprecated: true

obsolete abnormal(ly) normal amount of retinal rod cell (T)
type: Class
deprecated: true

abnormally decreased thickness of apical ectodermal ridge
type: Class
subclass of: XPO_0128940
definition: Abnormal(ly) decreased thickness of apical ectodermal ridge (Temporary definition).

obsolete abnormal(ly) mislocalised of outflow tract (T)
type: Class
IAO_0000125: XPO_0126435
deprecated: true

obsolete abnormal(ly) decreased size of vascular plexus (T)
type: Class
IAO_0000125: XPO_0128534
deprecated: true

obsolete abnormal(ly) normal amount of angioblast (T)
type: Class
deprecated: true

abnormally edematous pericardium
type: Class
subclass of: abnormal pericardium morphology
definition: Abnormal(ly) edematous of pericardium (Temporary definition).

abnormally split primary heart field
type: Class
subclass of: abnormal primary heart field morphology
definition: Abnormal(ly) split of primary heart field (Temporary definition).

obsolete abnormal(ly) fused with of anterior branchial crest (T)
type: Class
deprecated: true

abnormally decreased thickness of motor neuron
type: Class
subclass of: XPO_0128181
definition: Abnormal(ly) decreased thickness of motor neuron (Temporary definition).

obsolete abnormal(ly) disorganized of motor neuron (T)
type: Class
IAO_0000125: abnormal motor neuron morphology
deprecated: true

abnormally defasciculated motor neuron
type: Class
subclass of: abnormal motor neuron morphology
definition: Abnormal(ly) defasciculated of motor neuron (Temporary definition).

obsolete abnormal(ly) incomplete structure of ceratohyal (T)
type: Class
deprecated: true

abnormally edematous pharyngeal region
type: Class
subclass of: abnormal pharyngeal region morphology
definition: Abnormal(ly) edematous of pharyngeal region (Temporary definition).

abnormally inverted hindlimb zeugopod
type: Class
subclass of: abnormal hindlimb zeugopod morphology
definition: Abnormal(ly) inverted of hindlimb zeugopod (Temporary definition).

obsolete abnormal(ly) decreased amount of head mesenchyme (T)
type: Class
deprecated: true

abnormally incomplete structure of cranial muscle
type: Class
subclass of: abnormal cranial muscle morphology
definition: Abnormal(ly) incomplete structure of cranial muscle (Temporary definition).

obsolete abnormal(ly) incomplete structure of basihyal (T)
type: Class
deprecated: true

obsolete abnormal(ly) incomplete structure of infrarostral (T)
type: Class
deprecated: true

obsolete abnormal(ly) incomplete structure of palatoquadrati (T)
type: Class
deprecated: true

obsolete abnormal(ly) incomplete structure of trabecula cranii (T)
type: Class
deprecated: true

abnormally delayed closure of branchial basket
type: Class
subclass of: abnormal branchial basket
definition: Abnormal(ly) delayed closure of branchial basket (Temporary definition).

obsolete abnormal(ly) fused with of hindlimb digit 2 (T)
type: Class
deprecated: true

obsolete abnormal(ly) has fewer parts of type of hindlimb digit 2 (T)
type: Class
deprecated: true

obsolete abnormal(ly) has fewer parts of type of hindlimb digit 3 (T)
type: Class
deprecated: true

obsolete abnormal(ly) has fewer parts of type of hindlimb digit 4 (T)
type: Class
deprecated: true

obsolete abnormal(ly) present of hindlimb digit 5 (T)
type: Class
deprecated: true

obsolete abnormal(ly) has fewer parts of type of hindlimb digit 5 (T)
type: Class
deprecated: true

obsolete abnormal(ly) duplicated of claw of hindlimb digit 4 (T)
type: Class
IAO_0000125: duplicated claw of hindlimb digit 4
deprecated: true

obsolete abnormal(ly) decreased amount of trunk vasculature (T)
type: Class
deprecated: true

obsolete abnormal(ly) protruding into of myocyte (T)
type: Class
deprecated: true

obsolete abnormal(ly) misaligned with of myocyte (T)
type: Class
deprecated: true

obsolete abnormal(ly) has fewer parts of type of forelimb digit 2 (T)
type: Class
deprecated: true

obsolete abnormal(ly) present of spike (T)
type: Class
deprecated: true

abnormally decreased mobility of melanoblast
type: Class
subclass of: abnormal melanoblast
definition: Abnormal(ly) decreased mobility of melanoblast (Temporary definition).

abnormally simple of proximal tubule
type: Class
subclass of: abnormal proximal tubule morphology
definition: Abnormal(ly) simple of proximal tubule (Temporary definition).

abnormally decreased coiling of proximal tubule
type: Class
subclass of: abnormal proximal tubule morphology
definition: Abnormal(ly) decreased coiling of proximal tubule (Temporary definition).

obsolete abnormal(ly) has fewer parts of type of proximal tubule (T)
type: Class
deprecated: true

obsolete abnormal(ly) has extra parts of type of proximal tubule (T)
type: Class
IAO_0000125: abnormally increased number of proximal tubule
deprecated: true

obsolete abnormal(ly) dissociated from of epidermal cell (T)
type: Class
deprecated: true

obsolete abnormal(ly) uncoiled of external coil of the small intestine (T)
type: Class
deprecated: true

abnormally inverted external coil of the small intestine
type: Class
subclass of: abnormal external coil of the small intestine morphology
definition: Abnormal(ly) inverted of external coil of the small intestine (Temporary definition).

obsolete abnormal(ly) uncoiled of internal coil of the small intestine (T)
type: Class
deprecated: true

abnormally abaxially mislocalized anterior foregut
type: Class
subclass of: XPO_0127173
definition: Abnormal(ly) mislocalized abaxially of anterior foregut (Temporary definition).

obsolete abnormal(ly) absent of lung bud (T)
type: Class
IAO_0000125: XPO_0125791
deprecated: true

obsolete abnormal(ly) decreased size of lung bud (T)
type: Class
IAO_0000125: XPO_0129136
deprecated: true

duplicated bone element in claw of hindlimb digit 1
type: Class
subclass of: abnormal claw of hindlimb digit 1
subclass of: abnormally increased number of bone element in the hindlimb
definition: Any abnormal duplication of the bone element in claw of hindlimb digit 1.
has_exact_synonym: abnormally duplicated bone element in claw of hindlimb digit 1

duplicated bone element in claw of hindlimb digit 2
type: Class
subclass of: abnormal claw of hindlimb digit 2
subclass of: abnormally increased number of bone element in the hindlimb
definition: Any abnormal duplication of the bone element in claw of hindlimb digit 2.
has_exact_synonym: abnormally duplicated bone element in claw of hindlimb digit 2

duplicated bone element in claw of hindlimb digit 3
type: Class
subclass of: abnormal claw of hindlimb digit 3
subclass of: abnormally increased number of bone element in the hindlimb
definition: Any abnormal duplication of the bone element in claw of hindlimb digit 3.
has_exact_synonym: abnormally duplicated bone element in claw of hindlimb digit 3

duplicated bone element in claw of hindlimb digit 4
type: Class
subclass of: abnormal claw of hindlimb digit 4
subclass of: abnormally increased number of bone element in the hindlimb
definition: Any abnormal duplication of the bone element in claw of hindlimb digit 4.
has_exact_synonym: abnormally duplicated bone element in claw of hindlimb digit 4

duplicated bone element in claw of hindlimb digit 5
type: Class
subclass of: abnormal claw of hindlimb digit 5
subclass of: abnormally increased number of bone element in the hindlimb
definition: Any abnormal duplication of the bone element in claw of hindlimb digit 5.
has_exact_synonym: abnormally duplicated bone element in claw of hindlimb digit 5

duplicated apical ectodermal ridge in hindlimb bud
type: Class
subclass of: abnormal hindlimb bud
subclass of: abnormal apical ectodermal ridge
definition: Any abnormal duplication of the apical ectodermal ridge in hindlimb bud.
has_exact_synonym: abnormally duplicated apical ectodermal ridge in hindlimb bud

duplicated apical ectodermal ridge in forelimb bud
type: Class
subclass of: abnormal apical ectodermal ridge
subclass of: abnormal forelimb bud
definition: Any abnormal duplication of the apical ectodermal ridge in forelimb bud.
has_exact_synonym: abnormally duplicated apical ectodermal ridge in forelimb bud

duplicated autopod in regenerating hindlimb
type: Class
subclass of: abnormal autopod
subclass of: abnormal regenerating hindlimb
definition: Any abnormal duplication of the autopod in regenerating hindlimb.
has_exact_synonym: abnormally duplicated autopod in regenerating hindlimb

duplicated hindlimb digit in regenerating hindlimb
type: Class
subclass of: abnormally increased number of hindlimb digit in the regenerating hindlimb
definition: Any abnormal duplication of the hindlimb digit in regenerating hindlimb.
has_exact_synonym: abnormally duplicated hindlimb digit in regenerating hindlimb

duplicated femur in regenerating hindlimb
type: Class
subclass of: abnormal regenerating hindlimb
subclass of: duplicated femur
definition: Any abnormal duplication of the femur in regenerating hindlimb.
has_exact_synonym: abnormally duplicated femur in regenerating hindlimb

duplicated hindlimb digit 1 in regenerating hindlimb
type: Class
subclass of: abnormal number of hindlimb digit 1
subclass of: duplicated hindlimb digit in regenerating hindlimb
definition: Any abnormal duplication of the hindlimb digit 1 in regenerating hindlimb.
has_exact_synonym: abnormally duplicated hindlimb digit 1 in regenerating hindlimb

duplicated hindlimb digit 2 in regenerating hindlimb
type: Class
subclass of: abnormal number of hindlimb digit 2
subclass of: duplicated hindlimb digit in regenerating hindlimb
definition: Any abnormal duplication of the hindlimb digit 2 in regenerating hindlimb.
has_exact_synonym: abnormally duplicated hindlimb digit 2 in regenerating hindlimb

duplicated hindlimb digit 3 in regenerating hindlimb
type: Class
subclass of: abnormal number of hindlimb digit 3
subclass of: duplicated hindlimb digit in regenerating hindlimb
definition: Any abnormal duplication of the hindlimb digit 3 in regenerating hindlimb.
has_exact_synonym: abnormally duplicated hindlimb digit 3 in regenerating hindlimb

duplicated hindlimb digit 4 in regenerating hindlimb
type: Class
subclass of: abnormal number of hindlimb digit 4
subclass of: duplicated hindlimb digit in regenerating hindlimb
definition: Any abnormal duplication of the hindlimb digit 4 in regenerating hindlimb.
has_exact_synonym: abnormally duplicated hindlimb digit 4 in regenerating hindlimb

duplicated hindlimb digit 5 in regenerating hindlimb
type: Class
subclass of: abnormal number of hindlimb digit 5
subclass of: duplicated hindlimb digit in regenerating hindlimb
definition: Any abnormal duplication of the hindlimb digit 5 in regenerating hindlimb.
has_exact_synonym: abnormally duplicated hindlimb digit 5 in regenerating hindlimb

duplicated forelimb digit 2 in regenerating forelimb
type: Class
subclass of: abnormally increased number of forelimb digit in the regenerating forelimb
subclass of: abnormal number of forelimb digit 2
definition: Any abnormal duplication of the forelimb digit 2 in regenerating forelimb.
has_exact_synonym: abnormally duplicated forelimb digit 2 in regenerating forelimb

duplicated forelimb digit 3 in regenerating forelimb
type: Class
subclass of: abnormally increased number of forelimb digit in the regenerating forelimb
subclass of: abnormal number of forelimb digit 3
definition: Any abnormal duplication of the forelimb digit 3 in regenerating forelimb.
has_exact_synonym: abnormally duplicated forelimb digit 3 in regenerating forelimb

duplicated forelimb digit 4 in regenerating forelimb
type: Class
subclass of: abnormally increased number of forelimb digit in the regenerating forelimb
subclass of: abnormal number of forelimb digit 4
definition: Any abnormal duplication of the forelimb digit 4 in regenerating forelimb.
has_exact_synonym: abnormally duplicated forelimb digit 4 in regenerating forelimb

duplicated forelimb digit 5 in regenerating forelimb
type: Class
subclass of: abnormally increased number of forelimb digit in the regenerating forelimb
subclass of: abnormal number of forelimb digit 5
definition: Any abnormal duplication of the forelimb digit 5 in regenerating forelimb.
has_exact_synonym: abnormally duplicated forelimb digit 5 in regenerating forelimb

duplicated pelvic girdle in regenerating hindlimb
type: Class
subclass of: abnormal regenerating hindlimb
subclass of: duplicated pelvic girdle
definition: Any abnormal duplication of the pelvic girdle in regenerating hindlimb.
has_exact_synonym: abnormally duplicated pelvic girdle in regenerating hindlimb

duplicated tarsus in regenerating hindlimb
type: Class
subclass of: abnormal regenerating hindlimb
subclass of: abnormal tarsus
subclass of: abnormally increased number of bone element in the hindlimb
definition: Any abnormal duplication of the tarsus in regenerating hindlimb.
has_exact_synonym: abnormally duplicated tarsus in regenerating hindlimb

duplicated tibia-fibula in regenerating hindlimb
type: Class
subclass of: abnormal regenerating hindlimb
subclass of: XPO_0141514
definition: Any abnormal duplication of the tibia-fibula in regenerating hindlimb.
has_exact_synonym: abnormally duplicated tibia-fibula in regenerating hindlimb

duplicated zeugopod in regenerating hindlimb
type: Class
subclass of: abnormal zeugopod
subclass of: abnormal regenerating hindlimb
definition: Any abnormal duplication of the zeugopod in regenerating hindlimb.
has_exact_synonym: abnormally duplicated zeugopod in regenerating hindlimb

obsolete duplicated anterior-posterior axis in anterior region
type: Class
IAO_0000125: duplicated anterior-posterior axis
deprecated: true

obsolete duplicated anterior-posterior axis in antero-dorsal region
type: Class
IAO_0000125: duplicated anterior-posterior axis
deprecated: true

duplicated cement gland
type: Class
subclass of: abnormal cement gland
definition: Any abnormal duplication of the cement gland.
has_exact_synonym: abnormal duplication of cement gland
has_exact_synonym: abnormally duplicated cement gland

duplicated claw of hindlimb digit 1
type: Class
subclass of: abnormal claw of hindlimb digit 1
definition: Any abnormal duplication of the claw of hindlimb digit 1.
has_exact_synonym: abnormal duplication of claw of hindlimb digit 1
has_exact_synonym: abnormally duplicated claw of hindlimb digit 1

duplicated claw of hindlimb digit 2
type: Class
subclass of: abnormal claw of hindlimb digit 2
definition: Any abnormal duplication of the claw of hindlimb digit 2.
has_exact_synonym: abnormal duplication of claw of hindlimb digit 2
has_exact_synonym: abnormally duplicated claw of hindlimb digit 2

duplicated claw of hindlimb digit 3
type: Class
subclass of: abnormal claw of hindlimb digit 3
definition: Any abnormal duplication of the claw of hindlimb digit 3.
has_exact_synonym: abnormal duplication of claw of hindlimb digit 3
has_exact_synonym: abnormally duplicated claw of hindlimb digit 3

duplicated claw of hindlimb digit 4
type: Class
subclass of: abnormal claw of hindlimb digit 4
definition: Any abnormal duplication of the claw of hindlimb digit 4.
has_exact_synonym: abnormal duplication of claw of hindlimb digit 4
has_exact_synonym: abnormally duplicated claw of hindlimb digit 4

duplicated claw of hindlimb digit 5
type: Class
subclass of: abnormal claw of hindlimb digit 5
definition: Any abnormal duplication of the claw of hindlimb digit 5.
has_exact_synonym: abnormal duplication of claw of hindlimb digit 5
has_exact_synonym: abnormally duplicated claw of hindlimb digit 5

duplicated femur
type: Class
subclass of: abnormal femur
definition: Any abnormal duplication of the femur.
has_exact_synonym: abnormal duplication of femur
has_exact_synonym: abnormally duplicated femur

duplicated forelimb
type: Class
subclass of: abnormal forelimb
definition: Any abnormal duplication of the forelimb.
has_exact_synonym: abnormal duplication of forelimb
has_exact_synonym: abnormally duplicated forelimb

duplicated forelimb bud
type: Class
subclass of: abnormal forelimb bud
definition: Any abnormal duplication of the forelimb bud.
has_exact_synonym: abnormal duplication of forelimb bud
has_exact_synonym: abnormally duplicated forelimb bud

duplicated hand
type: Class
subclass of: abnormal hand
definition: Any abnormal duplication of the hand.
has_exact_synonym: abnormal duplication of hand
has_exact_synonym: abnormally duplicated hand

obsolete duplicated left hindlimb
type: Class
deprecated: true

obsolete duplicated right hindlimb
type: Class
deprecated: true

obsolete duplicated left forelimb
type: Class
deprecated: true

obsolete duplicated right forelimb
type: Class
deprecated: true

duplicated forelimb stylopod
type: Class
subclass of: abnormal forelimb stylopod
definition: Any abnormal duplication of the forelimb stylopod.
has_exact_synonym: abnormal duplication of forelimb stylopod
has_exact_synonym: abnormally duplicated forelimb stylopod

duplicated forelimb zeugopod
type: Class
subclass of: abnormal forelimb zeugopod
definition: Any abnormal duplication of the forelimb zeugopod.
has_exact_synonym: abnormal duplication of forelimb zeugopod
has_exact_synonym: abnormally duplicated forelimb zeugopod

duplicated head
type: Class
subclass of: abnormal head
definition: Any abnormal duplication of the head.
has_exact_synonym: abnormal duplication of head
has_exact_synonym: abnormally duplicated head

duplicated heart
type: Class
subclass of: abnormal heart
definition: Any abnormal duplication of the heart.
has_exact_synonym: abnormal duplication of heart
has_exact_synonym: abnormally duplicated heart

duplicated hindlimb
type: Class
subclass of: abnormally increased number of hindlimb
definition: Any abnormal duplication of the hindlimb.
has_exact_synonym: abnormal duplication of hindlimb
has_exact_synonym: abnormally duplicated hindlimb

duplicated hindlimb bud
type: Class
subclass of: abnormal hindlimb bud
definition: Any abnormal duplication of the hindlimb bud.
has_exact_synonym: abnormal duplication of hindlimb bud
has_exact_synonym: abnormally duplicated hindlimb bud

duplicated foot
type: Class
subclass of: abnormally increased number of foot
definition: Any abnormal duplication of the foot.
has_exact_synonym: abnormal duplication of foot
has_exact_synonym: abnormally duplicated foot

duplicated lens
type: Class
subclass of: abnormal lens
definition: Any abnormal duplication of the lens.
has_exact_synonym: abnormal duplication of lens
has_exact_synonym: abnormally duplicated lens

duplicated pelvic girdle
type: Class
subclass of: abnormal pelvic girdle
definition: Any abnormal duplication of the pelvic girdle.
has_exact_synonym: abnormal duplication of pelvic girdle
has_exact_synonym: abnormally duplicated pelvic girdle

duplicated regenerating hindlimb
type: Class
subclass of: abnormal regenerating hindlimb
definition: Any abnormal duplication of the regenerating hindlimb.
has_exact_synonym: abnormal duplication of regenerating hindlimb
has_exact_synonym: abnormally duplicated regenerating hindlimb

duplicated tail
type: Class
subclass of: abnormal tail
definition: Any abnormal duplication of the tail.
has_exact_synonym: abnormal duplication of tail
has_exact_synonym: abnormally duplicated tail

duplicated trunk
type: Class
subclass of: abnormal trunk
definition: Any abnormal duplication of the trunk.
has_exact_synonym: abnormal duplication of trunk
has_exact_synonym: abnormally duplicated trunk

duplicated utricle
type: Class
subclass of: abnormal utricle
definition: Any abnormal duplication of the utricle.
has_exact_synonym: abnormal duplication of utricle
has_exact_synonym: abnormally duplicated utricle

duplicated anatomical axis
type: Class
subclass of: abnormal anatomical axis
definition: Any abnormal duplication of the anatomical axis.
has_exact_synonym: abnormal duplication of anatomical axis
has_exact_synonym: abnormally duplicated anatomical axis

duplicated anterior-posterior axis
type: Class
subclass of: abnormal anterior-posterior axis
subclass of: duplicated anatomical axis
definition: Any abnormal duplication of the anterior-posterior axis.
has_exact_synonym: abnormal duplication of anterior-posterior axis
has_exact_synonym: abnormally duplicated anterior-posterior axis

duplicated dorsal-ventral axis
type: Class
subclass of: abnormal dorsal-ventral axis
subclass of: duplicated anatomical axis
definition: Any abnormal duplication of the dorsal-ventral axis.
has_exact_synonym: abnormal duplication of dorsal-ventral axis
has_exact_synonym: abnormally duplicated dorsal-ventral axis

duplicated hindlimb stylopod
type: Class
subclass of: abnormal hindlimb stylopod
definition: Any abnormal duplication of the hindlimb stylopod.
has_exact_synonym: abnormal duplication of hindlimb stylopod
has_exact_synonym: abnormally duplicated hindlimb stylopod

duplicated hindlimb zeugopod
type: Class
subclass of: abnormally increased number of hindlimb zeugopod
definition: Any abnormal duplication of the hindlimb zeugopod.
has_exact_synonym: abnormal duplication of hindlimb zeugopod
has_exact_synonym: abnormally duplicated hindlimb zeugopod

obsolete duplicated left eye
type: Class
deprecated: true

obsolete duplicated right eye
type: Class
deprecated: true

duplicated dorsal trunk
type: Class
subclass of: abnormal dorsal trunk
definition: Any abnormal duplication of the dorsal trunk.
has_exact_synonym: abnormal duplication of dorsal trunk
has_exact_synonym: abnormally duplicated dorsal trunk

obsolete duplicated left part of brain
type: Class
deprecated: true

obsolete duplicated right part of brain
type: Class
deprecated: true

obsolete abnormal(ly) shape of regenerating hindlimb in digit (T)
type: Class
IAO_0000125: XPO_0141547
deprecated: true

obsolete abnormal(ly) shape of regenerating hindlimb in autopod (T)
type: Class
IAO_0000125: XPO_0141548
deprecated: true

obsolete abnormal(ly) orientation of mesodermal cell in somite (T)
type: Class
IAO_0000125: abnormal somite morphology
deprecated: true

obsolete abnormal(ly) quality of regenerating forelimb in cartilage tissue (T)
type: Class
IAO_0000125: XPO_0141549
deprecated: true

obsolete abnormal(ly) quality of regenerating hindlimb in cartilage tissue (T)
type: Class
IAO_0000125: XPO_0141550
deprecated: true

obsolete abnormal(ly) quality of tarsus in joint (T)
type: Class
IAO_0000125: XPO_0141551
deprecated: true

obsolete abnormal(ly) quality of hindlimb in nervous system (T)
type: Class
IAO_0000125: XPO_0141552
deprecated: true

obsolete abnormal(ly) quality of hindlimb bud in iridophore (T)
type: Class
IAO_0000125: XPO_0141553
deprecated: true

obsolete abnormal(ly) quality of regenerating hindlimb in blood vessel (T)
type: Class
IAO_0000125: XPO_0141554
deprecated: true

obsolete abnormal(ly) quality of epidermal cell in whole organism (T)
type: Class
IAO_0000125: abnormal epidermal cell
deprecated: true

obsolete abnormal(ly) quality of regenerating tail in neuron (T)
type: Class
IAO_0000125: XPO_0141555
deprecated: true

obsolete abnormal(ly) quality of forelimb in digit (T)
type: Class
IAO_0000125: abnormal forelimb digit
deprecated: true

obsolete abnormal(ly) quality of hindlimb in digit (T)
type: Class
IAO_0000125: abnormal forelimb digit
deprecated: true

obsolete abnormal(ly) quality of regenerating forelimb in digit (T)
type: Class
IAO_0000125: XPO_0141556
deprecated: true

obsolete abnormal(ly) quality of regenerating hindlimb in digit (T)
type: Class
IAO_0000125: XPO_0141547
deprecated: true

obsolete abnormal(ly) quality of forelimb in forelimb digit (T)
type: Class
IAO_0000125: abnormal forelimb digit
deprecated: true

obsolete abnormal(ly) quality of regenerating hindlimb in pelvic girdle (T)
type: Class
IAO_0000125: XPO_0141557
deprecated: true

obsolete abnormal(ly) quality of regenerating hindlimb in claw (T)
type: Class
IAO_0000125: XPO_0141558
deprecated: true

obsolete abnormal(ly) quality of heart in left atrium (T)
type: Class
deprecated: true

obsolete abnormal(ly) quality of hindlimb in metacarpus (T)
type: Class
deprecated: true

obsolete abnormal(ly) quality of forelimb in radio-ulna (T)
type: Class
IAO_0000125: abnormal radio-ulna
deprecated: true

obsolete abnormal(ly) quality of hindlimb in tarsus (T)
type: Class
IAO_0000125: abnormal tarsus
deprecated: true

obsolete abnormal(ly) quality of regenerating hindlimb in tarsus (T)
type: Class
IAO_0000125: XPO_0141559
deprecated: true

obsolete abnormal(ly) quality of autopod in tarsus (T)
type: Class
IAO_0000125: abnormal tarsus
deprecated: true

obsolete abnormal(ly) quality of regenerating limb in tarsus (T)
type: Class
IAO_0000125: XPO_0141559
deprecated: true

obsolete abnormal(ly) quality of hindlimb in metatarsus (T)
type: Class
IAO_0000125: abnormal metatarsus
deprecated: true

obsolete abnormal(ly) quality of regenerating hindlimb in metatarsus (T)
type: Class
IAO_0000125: XPO_0141560
deprecated: true

obsolete abnormal(ly) quality of hindlimb in tibia-fibula (T)
type: Class
IAO_0000125: abnormal tibia-fibula
deprecated: true

obsolete abnormal(ly) quality of regenerating hindlimb in tibia-fibula (T)
type: Class
IAO_0000125: XPO_0141561
deprecated: true

obsolete abnormal(ly) quality of regenerating hindlimb in femur (T)
type: Class
IAO_0000125: XPO_0141562
deprecated: true

obsolete abnormal(ly) quality of regenerating hindlimb in cartilage element (T)
type: Class
IAO_0000125: XPO_0141563
deprecated: true

obsolete abnormal(ly) quality of hindlimb bud in apical ectodermal ridge (T)
type: Class
IAO_0000125: XPO_0141564
deprecated: true

obsolete abnormal(ly) quality of heart in outflow tract (T)
type: Class
IAO_0000125: abnormal outflow tract
deprecated: true

obsolete abnormal(ly) quality of hindlimb in stylopod (T)
type: Class
IAO_0000125: abnormal hindlimb stylopod
deprecated: true

obsolete abnormal(ly) quality of regenerating hindlimb in stylopod (T)
type: Class
IAO_0000125: XPO_0141565
deprecated: true

obsolete abnormal(ly) quality of hindlimb in zeugopod (T)
type: Class
IAO_0000125: abnormal hindlimb zeugopod
deprecated: true

obsolete abnormal(ly) quality of hindlimb digit in zeugopod (T)
type: Class
deprecated: true

obsolete abnormal(ly) quality of forelimb in autopod (T)
type: Class
IAO_0000125: abnormal hand morphology
deprecated: true

obsolete abnormal(ly) quality of hindlimb in autopod (T)
type: Class
IAO_0000125: abnormal foot morphology
deprecated: true

obsolete abnormal(ly) quality of hindlimb digit in autopod (T)
type: Class
IAO_0000125: abnormal hindlimb digit
deprecated: true

obsolete abnormal(ly) quality of regenerating forelimb in autopod (T)
type: Class
IAO_0000125: XPO_0141566
deprecated: true

obsolete abnormal(ly) quality of regenerating hindlimb in autopod (T)
type: Class
IAO_0000125: XPO_0141548
deprecated: true

obsolete abnormal(ly) quality of regenerating limb in autopod (T)
type: Class
IAO_0000125: XPO_0141507
deprecated: true

obsolete abnormal(ly) quality of femur in joint region (T)
type: Class
IAO_0000125: XPO_0141567
deprecated: true

obsolete abnormal(ly) quality of regenerating forelimb in digit-joint region (T)
type: Class
IAO_0000125: XPO_0141568
deprecated: true

obsolete abnormal(ly) quality of regenerating hindlimb in digit-joint region (T)
type: Class
IAO_0000125: XPO_0141569
deprecated: true

obsolete abnormal(ly) quality of autopod in digit-joint region (T)
type: Class
IAO_0000125: abnormal digit-joint region morphology
deprecated: true

obsolete abnormal(ly) quality of hindlimb in hindlimb digit 2 (T)
type: Class
IAO_0000125: abnormal hindlimb digit 2
deprecated: true

obsolete abnormal(ly) quality of hindlimb in hindlimb digit 3 (T)
type: Class
IAO_0000125: abnormal hindlimb digit 3
deprecated: true

obsolete abnormal(ly) quality of hindlimb in hindlimb digit 4 (T)
type: Class
IAO_0000125: abnormal hindlimb digit 4
deprecated: true

obsolete abnormal(ly) quality of hindlimb in hindlimb digit 5 (T)
type: Class
IAO_0000125: abnormal hindlimb digit 5
deprecated: true

obsolete abnormal(ly) quality of metacarpus in hindlimb digit 5 (T)
type: Class
deprecated: true

obsolete abnormal(ly) quality of forelimb in forelimb digit 2 (T)
type: Class
IAO_0000125: abnormal forelimb digit 2
deprecated: true

obsolete abnormal(ly) quality of forelimb in forelimb digit 3 (T)
type: Class
IAO_0000125: abnormal forelimb digit 3
deprecated: true

obsolete abnormal(ly) quality of forelimb in forelimb digit 4 (T)
type: Class
IAO_0000125: abnormal forelimb digit 4
deprecated: true

obsolete abnormal(ly) quality of forelimb in forelimb digit 5 (T)
type: Class
IAO_0000125: abnormal forelimb digit 5
deprecated: true

obsolete abnormal(ly) quality of pelvic girdle in iliac process (T)
type: Class
IAO_0000125: abnormal iliac process
deprecated: true

obsolete abnormal(ly) quality of hindlimb zeugopod in dorsal-ventral axis (T)
type: Class
IAO_0000125: XPO_0141571
deprecated: true

obsolete abnormal(ly) quality of hindlimb bud in dorsal margin (T)
type: Class
deprecated: true

obsolete abnormal(ly) quality of sarcomere organization in skeletal muscle (T)
type: Class
IAO_0000125: XPO_0133353
deprecated: true

obsolete abnormal(ly) quality of hindlimb in bone tissue (T)
type: Class
IAO_0000125: XPO_0141572
deprecated: true

obsolete abnormal(ly) quality of hindlimb in cartilage tissue (T)
type: Class
IAO_0000125: XPO_0141573
deprecated: true

obsolete abnormal(ly) quality of hindlimb in muscle (T)
type: Class
IAO_0000125: XPO_0141574
deprecated: true

obsolete abnormal(ly) quality of cell in foregut (T)
type: Class
IAO_0000125: abnormal foregut morphology
deprecated: true

obsolete abnormal(ly) quality of hindlimb bud in ventral (T)
type: Class
IAO_0000125: abnormal hindlimb bud morphology
deprecated: true

obsolete abnormal(ly) quality of tibia-fibula in regenerating hindlimb (T)
type: Class
IAO_0000125: XPO_0141561
deprecated: true

obsolete abnormal(ly) quality of hindlimb in femur (T)
type: Class
IAO_0000125: abnormal femur
deprecated: true

obsolete abnormal(ly) quality of femur in regenerating hindlimb (T)
type: Class
IAO_0000125: XPO_0141562
deprecated: true

obsolete abnormal(ly) quality of eye in retinal pigmented epithelium (T)
type: Class
IAO_0000125: abnormal retinal pigmented epithelium
deprecated: true

obsolete abnormal(ly) quality of hindlimb in cartilage element (T)
type: Class
IAO_0000125: XPO_0141575
deprecated: true

obsolete abnormal(ly) quality of regenerating forelimb in cartilage element (T)
type: Class
IAO_0000125: XPO_0141576
deprecated: true

obsolete abnormal(ly) quality of hindlimb bud in distal mesenchyme (T)
type: Class
IAO_0000125: XPO_0141577
deprecated: true

obsolete abnormal(ly) quality of apical ectodermal ridge in hindlimb bud (T)
type: Class
IAO_0000125: XPO_0141564
deprecated: true

obsolete abnormal(ly) quality of stylopod in hindlimb (T)
type: Class
IAO_0000125: abnormal hindlimb stylopod
deprecated: true

obsolete abnormal(ly) quality of zeugopod in hindlimb (T)
type: Class
IAO_0000125: abnormal hindlimb zeugopod
deprecated: true

obsolete abnormal(ly) quality of regenerating hindlimb in zeugopod (T)
type: Class
IAO_0000125: XPO_0141561
deprecated: true

obsolete abnormal(ly) quality of autopod in hindlimb (T)
type: Class
IAO_0000125: abnormal foot
deprecated: true

obsolete abnormal(ly) quality of hindlimb in joint region (T)
type: Class
IAO_0000125: XPO_0141578
deprecated: true

obsolete abnormal(ly) quality of hindlimb zeugopod in joint region (T)
type: Class
IAO_0000125: XPO_0141579
deprecated: true

obsolete abnormal(ly) quality of forelimb digit 2 in forelimb (T)
type: Class
IAO_0000125: abnormal forelimb digit 2
deprecated: true

obsolete abnormal(ly) quality of forelimb digit 5 in forelimb (T)
type: Class
IAO_0000125: abnormal forelimb digit 5
deprecated: true

obsolete abnormal(ly) quality of epithelium in foregut endoderm (T)
type: Class
deprecated: true

obsolete abnormal(ly) absent of gall bladder in left side (T)
type: Class
IAO_0000125: XPO_0139710
deprecated: true

obsolete abnormal(ly) absent of outflow tract in left side (T)
type: Class
IAO_0000125: XPO_0139711
deprecated: true

obsolete abnormal(ly) absent of regenerating forelimb in skeletal muscle (T)
type: Class
IAO_0000125: XPO_0141520
deprecated: true

obsolete abnormal(ly) absent of ventral in trigeminal nerve (T)
type: Class
IAO_0000125: abnormal trigeminal nerve morphology
deprecated: true

obsolete abnormal(ly) absent of regenerating hindlimb in claw (T)
type: Class
IAO_0000125: XPO_0141521
deprecated: true

obsolete abnormal(ly) absent of regenerating hindlimb in tarsus (T)
type: Class
IAO_0000125: XPO_0141522
deprecated: true

obsolete abnormal(ly) absent of hindlimb in tibia-fibula (T)
type: Class
IAO_0000125: absent tibia-fibula
deprecated: true

obsolete abnormal(ly) absent of regenerating hindlimb in tibia-fibula (T)
type: Class
IAO_0000125: XPO_0141523
deprecated: true

obsolete abnormal(ly) absent of hindlimb zeugopod in tibia-fibula (T)
type: Class
IAO_0000125: absent tibia-fibula
deprecated: true

obsolete abnormal(ly) absent of hindlimb in femur (T)
type: Class
IAO_0000125: absent femur
deprecated: true

obsolete abnormal(ly) absent of regenerating forelimb in perichondrium (T)
type: Class
IAO_0000125: absent perichondrium in the regenerating forelimb
deprecated: true

obsolete abnormal(ly) absent of hindlimb in hindlimb digit 1 (T)
type: Class
IAO_0000125: absent hindlimb digit 1
deprecated: true

obsolete abnormal(ly) absent of regenerating hindlimb in hindlimb digit 1 (T)
type: Class
IAO_0000125: XPO_0141524
deprecated: true

obsolete abnormal(ly) absent of regenerating hindlimb in zeugopod (T)
type: Class
IAO_0000125: XPO_0141532
deprecated: true

obsolete abnormal(ly) absent of forelimb in autopod (T)
type: Class
IAO_0000125: absent hand
deprecated: true

obsolete abnormal(ly) absent of hindlimb in autopod (T)
type: Class
IAO_0000125: absent foot
deprecated: true

obsolete abnormal(ly) absent of regenerating forelimb in autopod (T)
type: Class
IAO_0000125: XPO_0141525
deprecated: true

obsolete abnormal(ly) absent of regenerating hindlimb in autopod (T)
type: Class
IAO_0000125: XPO_0141526
deprecated: true

obsolete abnormal(ly) absent of hindlimb digit 1 in digit-joint region (T)
type: Class
IAO_0000125: absent digit-joint region in the hindlimb digit 1
deprecated: true

obsolete abnormal(ly) absent of hindlimb digit 2 in digit-joint region (T)
type: Class
IAO_0000125: absent digit-joint region in the hindlimb digit 2
deprecated: true

obsolete abnormal(ly) absent of hindlimb digit 3 in digit-joint region (T)
type: Class
IAO_0000125: absent digit-joint region in the hindlimb digit 3
deprecated: true

obsolete abnormal(ly) absent of hindlimb digit 4 in digit-joint region (T)
type: Class
IAO_0000125: absent digit-joint region in the hindlimb digit 4
deprecated: true

obsolete abnormal(ly) absent of hindlimb digit 5 in digit-joint region (T)
type: Class
IAO_0000125: absent digit-joint region in the hindlimb digit 5
deprecated: true

obsolete abnormal(ly) absent of regenerating hindlimb in wound epidermis (T)
type: Class
IAO_0000125: XPO_0141527
deprecated: true

obsolete abnormal(ly) absent of regenerating hindlimb in hindlimb digit 2 (T)
type: Class
IAO_0000125: XPO_0141528
deprecated: true

obsolete abnormal(ly) absent of regenerating hindlimb in hindlimb digit 3 (T)
type: Class
IAO_0000125: XPO_0141529
deprecated: true

obsolete abnormal(ly) absent of hindlimb in hindlimb digit 5 (T)
type: Class
IAO_0000125: absent hindlimb digit 5
deprecated: true

obsolete abnormal(ly) absent of regenerating hindlimb in claw of hindlimb digit 4 (T)
type: Class
IAO_0000125: XPO_0141530
deprecated: true

obsolete abnormal(ly) absent of regenerating hindlimb in claw of hindlimb digit 5 (T)
type: Class
IAO_0000125: XPO_0141531
deprecated: true

obsolete abnormal(ly) absent of forelimb in forelimb digit 3 (T)
type: Class
IAO_0000125: absent forelimb digit 3
deprecated: true

obsolete abnormal(ly) absent of eye in left (T)
type: Class
deprecated: true

obsolete abnormal(ly) absent of inner ear in left (T)
type: Class
deprecated: true

obsolete abnormal(ly) absent of olfactory pit in left (T)
type: Class
deprecated: true

obsolete abnormal(ly) absent of inner ear in right (T)
type: Class
IAO_0000125: absent inner ear
deprecated: true

obsolete abnormal(ly) present of posterior in whole organism (T)
type: Class
deprecated: true

obsolete abnormal(ly) present of regenerating hindlimb in claw (T)
type: Class
deprecated: true

obsolete abnormal(ly) present of regenerating hindlimb in tibia-fibula (T)
type: Class
deprecated: true

obsolete abnormal(ly) present of hindlimb in femur (T)
type: Class
deprecated: true

obsolete abnormal(ly) present of claw of hindlimb digit 1 in regenerating tissue (T)
type: Class
deprecated: true

obsolete abnormal(ly) present of claw of hindlimb digit 2 in regenerating tissue (T)
type: Class
deprecated: true

obsolete abnormal(ly) present of claw of hindlimb digit 3 in regenerating tissue (T)
type: Class
deprecated: true

obsolete abnormal(ly) present of regenerating hindlimb in claw of hindlimb digit 3 (T)
type: Class
deprecated: true

obsolete abnormal(ly) present of regenerating hindlimb in interdigital webbing (T)
type: Class
deprecated: true

obsolete abnormal(ly) increased amount of neuroectoderm in head region (T)
type: Class
IAO_0000125: XPO_0130963
deprecated: true

obsolete abnormal(ly) increased amount of mesoderm in trunk region (T)
type: Class
IAO_0000125: XPO_0130962
deprecated: true

obsolete abnormal(ly) increased amount of apoptotic cell in foregut (T)
type: Class
IAO_0000125: XPO_0133712
deprecated: true

obsolete abnormal(ly) increased amount of epidermis in iridophore (T)
type: Class
IAO_0000125: XPO_0141545
deprecated: true

obsolete abnormal(ly) increased amount of hindlimb bud in iridophore (T)
type: Class
IAO_0000125: abnormally increased number of iridophore in the hindlimb bud
deprecated: true

obsolete abnormal(ly) increased amount of forelimb in digit (T)
type: Class
IAO_0000125: abnormally increased number of forelimb digit
deprecated: true

obsolete abnormal(ly) increased amount of hindlimb in digit (T)
type: Class
IAO_0000125: abnormally increased number of hindlimb digit
deprecated: true

obsolete abnormal(ly) increased amount of regenerating hindlimb in digit (T)
type: Class
IAO_0000125: abnormally increased number of hindlimb digit in the regenerating hindlimb
deprecated: true

obsolete abnormal(ly) increased amount of autopod in digit (T)
type: Class
IAO_0000125: abnormally increased number of digit
deprecated: true

obsolete abnormal(ly) increased amount of hindlimb in cartilage element (T)
type: Class
IAO_0000125: abnormally increased number of cartilage element in the hindlimb
deprecated: true

obsolete abnormal(ly) increased amount of regenerating hindlimb in cartilage element (T)
type: Class
IAO_0000125: abnormally increased number of cartilage element in the regenerating hindlimb
deprecated: true

obsolete abnormal(ly) increased amount of hindlimb in autopod (T)
type: Class
deprecated: true

obsolete abnormal(ly) increased amount of regenerating hindlimb in autopod (T)
type: Class
IAO_0000125: duplicated autopod in regenerating hindlimb
deprecated: true

obsolete abnormal(ly) increased amount of forelimb in bone element (T)
type: Class
IAO_0000125: abnormally increased number of bone element in the forelimb
deprecated: true

obsolete abnormal(ly) increased amount of hindlimb in bone element (T)
type: Class
IAO_0000125: abnormally increased number of bone element in the hindlimb
deprecated: true

obsolete abnormal(ly) increased amount of regenerating hindlimb in claw of hindlimb digit 1 (T)
type: Class
IAO_0000125: abnormally increased number of claw of hindlimb digit 1 in the regenerating hindlimb
deprecated: true

obsolete abnormal(ly) increased amount of regenerating hindlimb in claw of hindlimb digit 2 (T)
type: Class
IAO_0000125: abnormally increased number of claw of hindlimb digit 2 in the regenerating hindlimb
deprecated: true

obsolete abnormal(ly) increased amount of regenerating hindlimb in claw of hindlimb digit 3 (T)
type: Class
IAO_0000125: abnormally increased number of claw of hindlimb digit 3 in the regenerating hindlimb
deprecated: true

obsolete abnormal(ly) increased amount of regenerating hindlimb in spike (T)
type: Class
IAO_0000125: XPO_0141546
deprecated: true

obsolete abnormal(ly) decreased length of hindlimb in digit (T)
type: Class
IAO_0000125: decreased length of hindlimb digit
deprecated: true

obsolete abnormal(ly) decreased length of regenerating hindlimb in digit (T)
type: Class
IAO_0000125: XPO_0141512
deprecated: true

obsolete abnormal(ly) decreased length of regenerating hindlimb in tarsus (T)
type: Class
IAO_0000125: XPO_0141581
deprecated: true

obsolete abnormal(ly) decreased length of hindlimb in tibia-fibula (T)
type: Class
IAO_0000125: decreased length of tibia-fibula
deprecated: true

obsolete abnormal(ly) decreased length of regenerating hindlimb in tibia-fibula (T)
type: Class
IAO_0000125: XPO_0141582
deprecated: true

obsolete abnormal(ly) decreased length of hindlimb in femur (T)
type: Class
IAO_0000125: decreased length of femur
deprecated: true

obsolete abnormal(ly) decreased length of regenerating hindlimb in femur (T)
type: Class
IAO_0000125: XPO_0141583
deprecated: true

abnormally decreased length of hindlimb digit 1 in regenerating tissue
type: Class
subclass of: XPO_0128168
subclass of: XPO_0141512
definition: Abnormal(ly) decreased length of hindlimb digit 1 in regenerating tissue (Temporary definition).

abnormally decreased length of hindlimb digit 2 in regenerating tissue
type: Class
subclass of: XPO_0128272
subclass of: XPO_0141512
definition: Abnormal(ly) decreased length of hindlimb digit 2 in regenerating tissue (Temporary definition).

abnormally decreased length of hindlimb digit 3 in regenerating tissue
type: Class
subclass of: XPO_0128802
subclass of: XPO_0141512
definition: Abnormal(ly) decreased length of hindlimb digit 3 in regenerating tissue (Temporary definition).

abnormally decreased length of hindlimb digit 4 in regenerating tissue
type: Class
subclass of: XPO_0129321
subclass of: XPO_0141512
definition: Abnormal(ly) decreased length of hindlimb digit 4 in regenerating tissue (Temporary definition).

abnormally decreased length of hindlimb digit 5 in regenerating tissue
type: Class
subclass of: XPO_0128451
subclass of: XPO_0141512
definition: Abnormal(ly) decreased length of hindlimb digit 5 in regenerating tissue (Temporary definition).

obsolete abnormal(ly) decreased length of cilium in multiciliated cell (T)
type: Class
IAO_0000125: XPO_0133453
deprecated: true

obsolete abnormal(ly) increased size of cell in foregut (T)
type: Class
IAO_0000125: abnormal foregut morphology
deprecated: true

obsolete abnormal(ly) increased size of eye in left (T)
type: Class
deprecated: true

obsolete abnormal(ly) decreased size of regenerating limb in tarsus (T)
type: Class
IAO_0000125: XPO_0141332
deprecated: true

obsolete abnormal(ly) decreased size of hindlimb in tibia-fibula (T)
type: Class
IAO_0000125: decreased size of the tibia-fibula
deprecated: true

obsolete abnormal(ly) decreased size of branchial arch skeleton in left (T)
type: Class
deprecated: true

obsolete abnormal(ly) decreased size of pharyngeal arch in right (T)
type: Class
IAO_0000125: decreased size of the pharyngeal arch
deprecated: true

obsolete abnormal(ly) decreased size of branchial arch skeleton in right (T)
type: Class
IAO_0000125: decreased size of the branchial arch skeleton
deprecated: true

obsolete abnormal(ly) increased thickness of hindlimb bud in epidermis (T)
type: Class
IAO_0000125: increased thickness of the epidermis in hindlimb bud
deprecated: true

obsolete abnormal(ly) increased volume of regenerating forelimb in autopod (T)
type: Class
IAO_0000125: XPO_0141318
deprecated: true

obsolete abnormal(ly) increased width of regenerating hindlimb in spike (T)
type: Class
IAO_0000125: XPO_0141580
deprecated: true

obsolete abnormal(ly) open of retinal pigmented epithelium in ventral (T)
type: Class
IAO_0000125: abnormal retinal pigmented epithelium morphology
deprecated: true

obsolete abnormal(ly) disoriented of cell in foregut (T)
type: Class
IAO_0000125: abnormal foregut morphology
deprecated: true

obsolete abnormal(ly) inverted of hindlimb zeugopod in dorsal-ventral axis (T)
type: Class
IAO_0000125: XPO_0141540
deprecated: true

obsolete abnormal(ly) inverted of hindlimb in joint region (T)
type: Class
IAO_0000125: XPO_0141541
deprecated: true

obsolete abnormal(ly) mislocalised of gall bladder in right side (T)
type: Class
IAO_0000125: XPO_0127281
deprecated: true

obsolete abnormal(ly) mislocalised of outflow tract in right side (T)
type: Class
IAO_0000125: XPO_0126435
deprecated: true

obsolete abnormal(ly) mislocalised of melanophore in dorsal fin (T)
type: Class
IAO_0000125: XPO_0141427
deprecated: true

obsolete abnormal(ly) fused with of somite in left side (T)
type: Class
deprecated: true

obsolete abnormal(ly) fused with of forelimb in digit (T)
type: Class
deprecated: true

obsolete abnormal(ly) fused with of forelimb digit 2 in metacarpus (T)
type: Class
deprecated: true

obsolete abnormal(ly) fused with of hindlimb in tarsus (T)
type: Class
deprecated: true

obsolete abnormal(ly) fused with of hindlimb digit 2 in metatarsus (T)
type: Class
deprecated: true

obsolete abnormal(ly) fused with of regenerating hindlimb in tibia-fibula (T)
type: Class
deprecated: true

obsolete abnormal(ly) fused with of regenerating hindlimb in spike (T)
type: Class
deprecated: true

obsolete abnormal(ly) fused with of eye in left (T)
type: Class
deprecated: true

obsolete abnormal(ly) fused with of optic stalk in left (T)
type: Class
deprecated: true

obsolete abnormal(ly) fused with of eye in right (T)
type: Class
deprecated: true

obsolete abnormal(ly) fused with of olfactory pit in right (T)
type: Class
deprecated: true

obsolete abnormal(ly) hypoplastic of hindlimb in tibia-fibula (T)
type: Class
IAO_0000125: decreased size of the tibia-fibula
deprecated: true

obsolete abnormal(ly) malformed of eye in lens (T)
type: Class
deprecated: true

obsolete abnormal(ly) malformed of epithelium in foregut (T)
type: Class
deprecated: true

obsolete abnormal(ly) malformed of ventral in trunk (T)
type: Class
deprecated: true

obsolete abnormal(ly) malformed of brain in left (T)
type: Class
deprecated: true

obsolete abnormal(ly) malformed of eye in left (T)
type: Class
deprecated: true

obsolete abnormal(ly) malformed of inner ear in left (T)
type: Class
deprecated: true

obsolete abnormal(ly) malformed of optic vesicle in left (T)
type: Class
deprecated: true

obsolete abnormal(ly) malformed of olfactory pit in left (T)
type: Class
deprecated: true

obsolete abnormal(ly) malformed of Meckel's cartilage in left (T)
type: Class
deprecated: true

obsolete abnormal(ly) malformed of branchial arch skeleton in left (T)
type: Class
deprecated: true

obsolete abnormal(ly) malformed of eye in right (T)
type: Class
deprecated: true

obsolete abnormal(ly) malformed of inner ear in right (T)
type: Class
deprecated: true

obsolete abnormal(ly) paralysed of forelimb in muscle (T)
type: Class
IAO_0000125: obsolete abnormally paralysed forelimb
deprecated: true

obsolete abnormal(ly) paralysed of hindlimb in muscle (T)
type: Class
IAO_0000125: obsolete abnormally paralysed hindlimb
deprecated: true

obsolete abnormal(ly) increased rate of regenerating hindlimb in cell (T)
type: Class
IAO_0000125: XPO_0135499
deprecated: true

obsolete abnormal(ly) truncated of anterior in embryo (T)
type: Class
deprecated: true

obsolete abnormal(ly) truncated of posterior in tail (T)
type: Class
deprecated: true

obsolete abnormal(ly) disorganized of myofibril assembly in heart (T)
type: Class
deprecated: true

obsolete abnormal(ly) disorganized of muscle fiber development in skeletal muscle (T)
type: Class
deprecated: true

obsolete abnormal(ly) disorganized of regenerating tail in neuron (T)
type: Class
deprecated: true

obsolete abnormal(ly) Y-shaped of regenerating hindlimb in femur (T)
type: Class
IAO_0000125: XPO_0141515
deprecated: true

obsolete abnormal(ly) Y-shaped of regenerating hindlimb in spike (T)
type: Class
IAO_0000125: XPO_0141516
deprecated: true

obsolete abnormal(ly) edematous of embryo in ventral (T)
type: Class
IAO_0000125: XPO_0141331
deprecated: true

obsolete abnormal(ly) edematous of ventral in trunk (T)
type: Class
IAO_0000125: XPO_0141320
deprecated: true

obsolete abnormal(ly) duplicated of dorsal in trunk (T)
type: Class
IAO_0000125: duplicated dorsal trunk
deprecated: true

obsolete abnormal(ly) duplicated of regenerating hindlimb in digit (T)
type: Class
IAO_0000125: duplicated hindlimb digit in regenerating hindlimb
deprecated: true

obsolete abnormal(ly) duplicated of regenerating hindlimb in pelvic girdle (T)
type: Class
IAO_0000125: duplicated pelvic girdle in regenerating hindlimb
deprecated: true

obsolete abnormal(ly) duplicated of regenerating hindlimb in tarsus (T)
type: Class
IAO_0000125: duplicated tarsus in regenerating hindlimb
deprecated: true

obsolete abnormal(ly) duplicated of regenerating hindlimb in tibia-fibula (T)
type: Class
IAO_0000125: duplicated tibia-fibula in regenerating hindlimb
deprecated: true

obsolete abnormal(ly) duplicated of regenerating hindlimb in femur (T)
type: Class
IAO_0000125: duplicated femur in regenerating hindlimb
deprecated: true

obsolete abnormal(ly) duplicated of hindlimb bud in apical ectodermal ridge (T)
type: Class
IAO_0000125: duplicated apical ectodermal ridge in hindlimb bud
deprecated: true

obsolete abnormal(ly) duplicated of forelimb in stylopod (T)
type: Class
IAO_0000125: duplicated forelimb stylopod
deprecated: true

obsolete abnormal(ly) duplicated of hindlimb in stylopod (T)
type: Class
IAO_0000125: duplicated hindlimb stylopod
deprecated: true

obsolete abnormal(ly) duplicated of forelimb in zeugopod (T)
type: Class
IAO_0000125: duplicated forelimb zeugopod
deprecated: true

obsolete abnormal(ly) duplicated of hindlimb in zeugopod (T)
type: Class
IAO_0000125: duplicated hindlimb zeugopod
deprecated: true

obsolete abnormal(ly) duplicated of regenerating hindlimb in zeugopod (T)
type: Class
IAO_0000125: duplicated zeugopod in regenerating hindlimb
deprecated: true

obsolete abnormal(ly) duplicated of forelimb in autopod (T)
type: Class
IAO_0000125: duplicated hand
deprecated: true

obsolete abnormal(ly) duplicated of hindlimb in autopod (T)
type: Class
IAO_0000125: duplicated foot
deprecated: true

obsolete abnormal(ly) duplicated of regenerating hindlimb in autopod (T)
type: Class
IAO_0000125: duplicated autopod in regenerating hindlimb
deprecated: true

obsolete abnormal(ly) duplicated of claw of hindlimb digit 4 in bone element (T)
type: Class
IAO_0000125: duplicated bone element in claw of hindlimb digit 4
deprecated: true

obsolete abnormal(ly) duplicated of regenerating hindlimb in hindlimb digit 3 (T)
type: Class
IAO_0000125: duplicated hindlimb digit 3 in regenerating hindlimb
deprecated: true

obsolete abnormal(ly) duplicated of regenerating hindlimb in hindlimb digit 4 (T)
type: Class
IAO_0000125: duplicated hindlimb digit 4 in regenerating hindlimb
deprecated: true

obsolete abnormal(ly) duplicated of regenerating hindlimb in hindlimb digit 5 (T)
type: Class
IAO_0000125: duplicated hindlimb digit 5 in regenerating hindlimb
deprecated: true

obsolete abnormal(ly) duplicated of brain in left (T)
type: Class
deprecated: true

obsolete abnormal(ly) duplicated of eye in left (T)
type: Class
deprecated: true

obsolete abnormal(ly) duplicated of forelimb in left (T)
type: Class
deprecated: true

obsolete abnormal(ly) duplicated of eye in right (T)
type: Class
IAO_0000125: XPO_0141513
deprecated: true

obsolete abnormal(ly) duplicated of forelimb in right (T)
type: Class
IAO_0000125: duplicated forelimb
deprecated: true

obsolete abnormal(ly) condensed of regenerating hindlimb in tarsus (T)
type: Class
IAO_0000125: abnormal regenerating hindlimb morphology
deprecated: true

obsolete abnormal(ly) spherical of endodermal cell in archenteron floor (T)
type: Class
IAO_0000125: abnormal archenteron floor morphology
deprecated: true

obsolete abnormal(ly) disrupted of epithelium in foregut endoderm (T)
type: Class
IAO_0000125: XPO_0141295
deprecated: true

obsolete abnormal(ly) deformed of ventral in trunk (T)
type: Class
IAO_0000125: abnormal ventral trunk morphology
deprecated: true

obsolete abnormal(ly) misaligned with of nucleus in myoblast (T)
type: Class
IAO_0000125: XPO_0141511
deprecated: true

obsolete abnormal(ly) bifurcated of regenerating hindlimb in blood vessel (T)
type: Class
IAO_0000125: XPO_0141518
deprecated: true

obsolete abnormal(ly) bifurcated of regenerating hindlimb in tarsus (T)
type: Class
IAO_0000125: XPO_0141519
deprecated: true

obsolete abnormal(ly) bifurcated of hindlimb in left (T)
type: Class
deprecated: true

obsolete abnormal(ly) bifurcated of hindlimb in right (T)
type: Class
IAO_0000125: bifurcated hindlimb
deprecated: true

obsolete abnormal(ly) loose of endodermal cell in archenteron floor (T)
type: Class
deprecated: true

obsolete abnormal(ly) constricted of ventral in trunk (T)
type: Class
deprecated: true

obsolete abnormal(ly) cylindrical of regenerating hindlimb in tibia-fibula (T)
type: Class
IAO_0000125: XPO_0141561
deprecated: true

obsolete abnormal(ly) U-shaped of hindlimb in tibia-fibula (T)
type: Class
IAO_0000125: XPO_0141542
deprecated: true

obsolete abnormal(ly) has normal numbers of parts of type of regenerating hindlimb in digit (T)
type: Class
deprecated: true

obsolete abnormal(ly) variant shape of cell in neural plate (T)
type: Class
IAO_0000125: abnormal neural plate morphology
deprecated: true

abnormally increased variability of size of cell in endoderm
type: Class
subclass of: abnormal cell
subclass of: abnormal endoderm
definition: Abnormal(ly) increased variability of size of cell in endoderm (Temporary definition).

obsolete abnormal(ly) decreased amount of somite in ventro-lateral region (T)
type: Class
IAO_0000125: XPO_0130957
deprecated: true

obsolete abnormal(ly) decreased amount of melanophore in epidermis (T)
type: Class
IAO_0000125: XPO_0141396
deprecated: true

obsolete abnormal(ly) decreased amount of neuroectoderm in head region (T)
type: Class
IAO_0000125: XPO_0130959
deprecated: true

obsolete abnormal(ly) decreased amount of forelimb in muscle (T)
type: Class
IAO_0000125: XPO_0141533
deprecated: true

obsolete abnormal(ly) decreased amount of hindlimb in muscle (T)
type: Class
IAO_0000125: XPO_0141534
deprecated: true

obsolete abnormal(ly) decreased amount of pigment cell in eye (T)
type: Class
IAO_0000125: XPO_0141343
deprecated: true

obsolete abnormal(ly) decreased amount of forelimb in digit (T)
type: Class
IAO_0000125: abnormally decreased number of forelimb digit
deprecated: true

obsolete abnormal(ly) decreased amount of hindlimb in digit (T)
type: Class
IAO_0000125: abnormally decreased number of hindlimb digit
deprecated: true

obsolete abnormal(ly) decreased amount of regenerating hindlimb in digit (T)
type: Class
IAO_0000125: abnormally decreased number of hindlimb digit in the regenerating hindlimb
deprecated: true

obsolete abnormal(ly) decreased amount of hindlimb in hindlimb digit (T)
type: Class
IAO_0000125: abnormally decreased number of hindlimb digit
deprecated: true

obsolete abnormal(ly) decreased amount of regenerating hindlimb in hindlimb digit (T)
type: Class
IAO_0000125: abnormally decreased number of hindlimb digit in the regenerating hindlimb
deprecated: true

obsolete abnormal(ly) decreased amount of forelimb in forelimb digit (T)
type: Class
IAO_0000125: abnormally decreased number of forelimb digit
deprecated: true

obsolete abnormal(ly) decreased amount of hindlimb in claw (T)
type: Class
IAO_0000125: abnormally decreased number of claw
deprecated: true

obsolete abnormal(ly) decreased amount of regenerating hindlimb in claw (T)
type: Class
IAO_0000125: XPO_0141535
deprecated: true

obsolete abnormal(ly) decreased amount of hindlimb in metatarsus (T)
type: Class
IAO_0000125: abnormally decreased number of metatarsus
deprecated: true

obsolete abnormal(ly) decreased amount of hindlimb in tibia-fibula (T)
type: Class
IAO_0000125: decreased size of the tibia-fibula
deprecated: true

obsolete abnormal(ly) decreased amount of retinal inner plexiform layer in bipolar neuron (T)
type: Class
IAO_0000125: XPO_0141537
deprecated: true

obsolete abnormal(ly) decreased amount of forelimb in autopod (T)
type: Class
deprecated: true

obsolete abnormal(ly) decreased amount of hindlimb in autopod (T)
type: Class
deprecated: true

obsolete abnormal(ly) decreased amount of forelimb in bone element (T)
type: Class
IAO_0000125: XPO_0141538
deprecated: true

obsolete abnormal(ly) decreased amount of hindlimb in bone element (T)
type: Class
IAO_0000125: XPO_0141539
deprecated: true

obsolete abnormal(ly) decreased amount of heart in trabecula (T)
type: Class
IAO_0000125: abnormally decreased number of trabecula in the heart
deprecated: true

obsolete abnormal(ly) lacks parts or has fewer parts of type of hindlimb in autopod (T)
type: Class
deprecated: true

obsolete abnormal(ly) lacks parts or has fewer parts of type of regenerating hindlimb in autopod (T)
type: Class
IAO_0000125: XPO_0141526
deprecated: true

obsolete abnormal(ly) has fewer parts of type of forelimb in digit (T)
type: Class
IAO_0000125: abnormally decreased number of forelimb digit
deprecated: true

obsolete abnormal(ly) has fewer parts of type of regenerating forelimb in digit (T)
type: Class
IAO_0000125: abnormally decreased number of forelimb digit in the regenerating forelimb
deprecated: true

obsolete abnormal(ly) has fewer parts of type of regenerating hindlimb in digit (T)
type: Class
IAO_0000125: abnormally decreased number of hindlimb digit in the regenerating hindlimb
deprecated: true

obsolete abnormal(ly) has fewer parts of type of regenerating limb in digit (T)
type: Class
IAO_0000125: abnormally decreased number of hindlimb digit in the regenerating hindlimb
deprecated: true

obsolete abnormal(ly) has fewer parts of type of regenerating hindlimb in hindlimb digit (T)
type: Class
IAO_0000125: abnormally decreased number of hindlimb digit in the regenerating hindlimb
deprecated: true

obsolete abnormal(ly) has fewer parts of type of regenerating forelimb in metacarpus (T)
type: Class
IAO_0000125: abnormally decreased number of metacarpus in the regenerating forelimb
deprecated: true

obsolete abnormal(ly) has fewer parts of type of hindlimb in tibia-fibula (T)
type: Class
IAO_0000125: absent tibia-fibula
deprecated: true

obsolete abnormal(ly) has fewer parts of type of regenerating limb in skeletal element (T)
type: Class
IAO_0000125: XPO_0141506
deprecated: true

obsolete abnormal(ly) has fewer parts of type of hindlimb in autopod (T)
type: Class
IAO_0000125: absent foot
deprecated: true

obsolete abnormal(ly) has fewer parts of type of regenerating hindlimb in autopod (T)
type: Class
IAO_0000125: absent foot
deprecated: true

obsolete abnormal(ly) has fewer parts of type of forelimb digit in bone element (T)
type: Class
IAO_0000125: abnormally decreased number of bone element in the forelimb digit
deprecated: true

obsolete abnormal(ly) has fewer parts of type of regenerating forelimb in digit-joint region (T)
type: Class
IAO_0000125: abnormally decreased number of digit-joint region in the regenerating forelimb
deprecated: true

obsolete abnormal(ly) has fewer parts of type of forelimb in forelimb digit 3 (T)
type: Class
IAO_0000125: absent forelimb digit 3
deprecated: true

obsolete abnormal(ly) has extra parts of type of regenerating hindlimb in digit (T)
type: Class
IAO_0000125: abnormally increased number of hindlimb digit in the regenerating hindlimb
deprecated: true

obsolete abnormal(ly) has extra parts of type of regenerating hindlimb in hindlimb digit (T)
type: Class
IAO_0000125: abnormally increased number of hindlimb digit in the regenerating hindlimb
deprecated: true

obsolete abnormal(ly) has extra parts of type of hindlimb in zeugopod (T)
type: Class
IAO_0000125: XPO_0141514
deprecated: true

obsolete abnormal(ly) has extra parts of type of hindlimb in autopod (T)
type: Class
IAO_0000125: duplicated foot
deprecated: true

obsolete abnormal(ly) conical of regenerating forelimb in autopod (T)
type: Class
IAO_0000125: XPO_0141543
deprecated: true

obsolete abnormal(ly) conical of regenerating hindlimb in autopod (T)
type: Class
IAO_0000125: XPO_0141543
deprecated: true

obsolete abnormal(ly) normal amount of migratory neural crest cell in tail region (T)
type: Class
deprecated: true

obsolete abnormal(ly) normal amount of hindlimb in digit (T)
type: Class
deprecated: true

obsolete abnormal(ly) normal amount of regenerating hindlimb in digit (T)
type: Class
deprecated: true

obsolete abnormal(ly) altered number of of forelimb in digit (T)
type: Class
IAO_0000125: abnormal number of forelimb digits
deprecated: true

obsolete abnormal(ly) altered number of of hindlimb in digit (T)
type: Class
IAO_0000125: abnormal number of hindlimb digits
deprecated: true

obsolete abnormal(ly) altered number of of forelimb in metacarpus (T)
type: Class
IAO_0000125: abnormal number of metacarpal bones
deprecated: true

obsolete abnormal(ly) altered number of of regenerating hindlimb in tibia-fibula (T)
type: Class
IAO_0000125: abnormally decreased number of skeletal element in the regenerating hindlimb
deprecated: true

obsolete abnormal(ly) altered number of of hindlimb in hindlimb digit 2 (T)
type: Class
IAO_0000125: abnormal number of hindlimb digit 2
deprecated: true

obsolete abnormal(ly) altered number of of hindlimb in hindlimb digit 3 (T)
type: Class
IAO_0000125: abnormal number of hindlimb digit 3
deprecated: true

obsolete abnormal(ly) altered number of of hindlimb in hindlimb digit 4 (T)
type: Class
IAO_0000125: abnormal number of hindlimb digit 4
deprecated: true

obsolete abnormal(ly) altered number of of hindlimb in hindlimb digit 5 (T)
type: Class
IAO_0000125: abnormal number of hindlimb digit 5
deprecated: true

obsolete abnormal(ly) multiple of regenerating forelimb in autopod (T)
type: Class
deprecated: true

obsolete abnormal(ly) adjacent to of eye in left side (T)
type: Class
IAO_0000125: XPO_0131524
deprecated: true

obsolete abnormal(ly) decreased mobility of cilium in ciliated epidermal cell (T)
type: Class
IAO_0000125: XPO_0133501
deprecated: true

obsolete abnormal(ly) decreased mobility of cilium in multiciliated cell (T)
type: Class
IAO_0000125: XPO_0133500
deprecated: true

obsolete abnormal(ly) increased branchiness of regenerating forelimb in autopod (T)
type: Class
IAO_0000125: XPO_0141544
deprecated: true

obsolete abnormal(ly) segmented of regenerating forelimb in autopod (T)
type: Class
IAO_0000125: XPO_0141517
deprecated: true

obsolete abnormal(ly) decreased adhesivity of endodermal cell in archenteron floor (T)
type: Class
IAO_0000125: XPO_0141360
deprecated: true

obsolete abnormal(ly) decreased adhesivity of cell in foregut (T)
type: Class
IAO_0000125: XPO_0141346
deprecated: true

obsolete abnormal(ly) shortened of regenerating tail in neuron (T)
type: Class
IAO_0000125: XPO_0141584
deprecated: true

obsolete abnormal(ly) extends to of axon in optic tract (T)
type: Class
deprecated: true

obsolete abnormal(ly) oblique orientation of heart in left atrium (T)
type: Class
deprecated: true

obsolete abnormal(ly) oblique orientation of heart in right atrium (T)
type: Class
IAO_0000125: XPO_0131468
deprecated: true

obsolete abnormal(ly) oblique orientation of heart in cardiac ventricle (T)
type: Class
IAO_0000125: XPO_0131468
deprecated: true

obsolete abnormal(ly) oblique orientation of heart in outflow tract (T)
type: Class
IAO_0000125: XPO_0131468
deprecated: true

obsolete abnormal(ly) incomplete structure of cartilage element in branchial arch (T)
type: Class
deprecated: true

obsolete abnormal(ly) incomplete structure of cartilage element in head (T)
type: Class
deprecated: true

obsolete abnormal(ly) irregularly shaped of epithelial cell in foregut endoderm (T)
type: Class
IAO_0000125: XPO_0141510
deprecated: true

abnormal behavior
type: Class
subclass of: abnormal biological process
definition: An anomaly in behavior.

obsolete abnormal adrenal gland development
type: Class
IAO_0000125: XPO_0131815
deprecated: true

obsolete abnormal anatomical structure development
type: Class
IAO_0000125: XPO_0131760
deprecated: true

obsolete abnormal animal organ development
type: Class
deprecated: true

abnormal axis specification
type: Class
subclass of: abnormal biological process
definition: Abnormal axis specification.

abnormal biological process
type: Class
subclass of: Xenopus phenotype
definition: Abnormal biological_process.

obsolete abnormal brain development
type: Class
IAO_0000125: XPO_0131890
deprecated: true

obsolete abnormal bronchus development
type: Class
IAO_0000125: XPO_0133319
deprecated: true

obsolete abnormal camera-type eye development
type: Class
deprecated: true

obsolete abnormal cardiac chamber development
type: Class
IAO_0000125: XPO_0131980
deprecated: true

obsolete abnormal cardiac ventricle development
type: Class
IAO_0000125: XPO_0132821
deprecated: true

obsolete abnormal cement gland development
type: Class
IAO_0000125: XPO_0132420
deprecated: true

obsolete abnormal central nervous system development
type: Class
IAO_0000125: XPO_0131977
deprecated: true

obsolete abnormal chordate embryonic development
type: Class
IAO_0000125: XPO_0131871
deprecated: true

obsolete abnormal circulatory system development
type: Class
IAO_0000125: XPO_0131952
deprecated: true

obsolete abnormal cloaca development
type: Class
IAO_0000125: XPO_0132267
deprecated: true

obsolete abnormal digestive system development
type: Class
IAO_0000125: XPO_0131927
deprecated: true

obsolete abnormal digestive tract development
type: Class
IAO_0000125: XPO_0131927
deprecated: true

obsolete abnormal digestive tract morphogenesis
type: Class
deprecated: true

obsolete abnormal ear development
type: Class
IAO_0000125: XPO_0132323
deprecated: true

obsolete abnormal ectoderm development
type: Class
IAO_0000125: XPO_0131900
deprecated: true

obsolete abnormal embryo development
type: Class
IAO_0000125: XPO_0131871
deprecated: true

obsolete abnormal embryonic morphogenesis
type: Class
deprecated: true

obsolete abnormal embryonic organ development
type: Class
deprecated: true

obsolete abnormal endocrine system development
type: Class
IAO_0000125: XPO_0132139
deprecated: true

obsolete abnormal endoderm development
type: Class
IAO_0000125: XPO_0131802
deprecated: true

obsolete abnormal epidermis development
type: Class
IAO_0000125: XPO_0132295
deprecated: true

obsolete abnormal eye development
type: Class
IAO_0000125: XPO_0131897
deprecated: true

obsolete abnormal fin development
type: Class
IAO_0000125: XPO_0132020
deprecated: true

obsolete abnormal gall bladder development
type: Class
IAO_0000125: XPO_0132805
deprecated: true

obsolete abnormal gland development
type: Class
deprecated: true

obsolete abnormal gonad development
type: Class
IAO_0000125: XPO_0131972
deprecated: true

obsolete abnormal head development
type: Class
IAO_0000125: XPO_0131781
deprecated: true

obsolete abnormal heart development
type: Class
IAO_0000125: XPO_0131763
deprecated: true

obsolete abnormal hemopoietic or lymphoid organ development
type: Class
deprecated: true

obsolete abnormal hepaticobiliary system development
type: Class
IAO_0000125: XPO_0131987
deprecated: true

obsolete abnormal immune system development
type: Class
IAO_0000125: XPO_0131969
deprecated: true

obsolete abnormal kidney development
type: Class
IAO_0000125: XPO_0132588
deprecated: true

obsolete abnormal liver development
type: Class
IAO_0000125: XPO_0132489
deprecated: true

obsolete abnormal lung development
type: Class
IAO_0000125: XPO_0132902
deprecated: true

obsolete abnormal mesoderm development
type: Class
IAO_0000125: XPO_0131830
deprecated: true

obsolete abnormal mesonephros development
type: Class
IAO_0000125: XPO_0131821
deprecated: true

obsolete abnormal muscle organ development
type: Class
IAO_0000125: XPO_0131826
deprecated: true

obsolete abnormal nervous system development
type: Class
IAO_0000125: XPO_0131978
deprecated: true

obsolete abnormal neural crest cell development
type: Class
deprecated: true

obsolete abnormal nose development
type: Class
deprecated: true

obsolete abnormal notochord development
type: Class
IAO_0000125: XPO_0132047
deprecated: true

obsolete abnormal otic vesicle development
type: Class
IAO_0000125: XPO_0132416
deprecated: true

obsolete abnormal pancreas development
type: Class
IAO_0000125: XPO_0132328
deprecated: true

obsolete abnormal pharyngeal system development
type: Class
deprecated: true

obsolete abnormal post-anal tail morphogenesis
type: Class
deprecated: true

obsolete abnormal pronephros development
type: Class
IAO_0000125: XPO_0132303
deprecated: true

obsolete abnormal renal system development
type: Class
deprecated: true

obsolete abnormal respiratory system development
type: Class
IAO_0000125: XPO_0131839
deprecated: true

obsolete abnormal respiratory tube development
type: Class
deprecated: true

obsolete abnormal sensory organ development
type: Class
deprecated: true

obsolete abnormal somite development
type: Class
IAO_0000125: XPO_0132108
deprecated: true

obsolete abnormal spinal cord development
type: Class
IAO_0000125: XPO_0131803
deprecated: true

obsolete abnormal spleen development
type: Class
IAO_0000125: XPO_0132370
deprecated: true

obsolete abnormal stem cell development
type: Class
IAO_0000125: XPO_0131993
deprecated: true

obsolete abnormal stomach development
type: Class
IAO_0000125: XPO_0131931
deprecated: true

obsolete abnormal thymus development
type: Class
IAO_0000125: XPO_0132897
deprecated: true

obsolete abnormal thyroid gland development
type: Class
IAO_0000125: XPO_0133057
deprecated: true

obsolete abnormal tissue development
type: Class
IAO_0000125: XPO_0131755
deprecated: true

obsolete abnormal urinary bladder development
type: Class
IAO_0000125: XPO_0132627
deprecated: true

absent biological process
type: Class
subclass of: Xenopus phenotype
definition: Lack of biological_process.

absent cell
type: Class
subclass of: abnormal cell
subclass of: absent anatomical structure
definition: Absence of cell.
has_exact_synonym: missing cell

absent anatomical structure
type: Class
subclass of: abnormal anatomical structure
definition: Absence of anatomical structure.
has_exact_synonym: missing anatomical structure

absent accessory olfactory bulb
type: Class
subclass of: abnormal accessory olfactory bulb
subclass of: absent multi-tissue structure
definition: Absence of accessory olfactory bulb.
has_exact_synonym: missing accessory olfactory bulb

absent multi-tissue structure
type: Class
subclass of: abnormal multi-tissue structure
subclass of: absent multicellular anatomical structure
definition: Absence of multi-tissue structure.
has_exact_synonym: missing multi-tissue structure

absent multicellular anatomical structure
type: Class
subclass of: abnormal multicellular anatomical structure
subclass of: absent anatomical structure
definition: Absence of multicellular anatomical structure.
has_exact_synonym: missing multicellular anatomical structure

absent cardiac neural crest
type: Class
subclass of: abnormal cardiac neural crest
subclass of: absent tissue
definition: Absence of cardiac neural crest.
has_exact_synonym: missing cardiac neural crest

absent heart
type: Class
subclass of: abnormal heart
subclass of: absent cavitated compound organ
subclass of: absent viscus
definition: Absence of heart.
has_exact_synonym: missing heart

absent tissue
type: Class
subclass of: abnormal tissue
subclass of: absent multicellular anatomical structure
definition: Absence of tissue.
has_exact_synonym: missing tissue

absent paired appendage
type: Class
subclass of: abnormal paired appendage
subclass of: absent appendage
definition: Absence of paired appendage.
has_exact_synonym: missing paired appendage

absent appendage
type: Class
subclass of: abnormal appendage
subclass of: absent organism subdivision
definition: Absence of appendage.
has_exact_synonym: missing appendage

absent pelvic appendage
type: Class
subclass of: abnormal pelvic appendage
subclass of: absent paired appendage
definition: Absence of pelvic appendage.
has_exact_synonym: missing pelvic appendage

absent olfactory bulb
type: Class
subclass of: abnormal olfactory bulb
subclass of: absent multi-tissue structure
definition: Absence of olfactory bulb.
has_exact_synonym: missing olfactory bulb

absent branchial head muscle
type: Class
subclass of: abnormal branchial head muscle
subclass of: absent cranial muscle
definition: Absence of branchial head muscle.
has_exact_synonym: missing branchial head muscle

absent cranial muscle
type: Class
subclass of: abnormal cranial muscle
subclass of: absent muscle
definition: Absence of cranial muscle.
has_exact_synonym: missing cranial muscle

absent skeletal element
type: Class
subclass of: abnormal skeletal element
subclass of: absent solid compound organ
definition: Absence of skeletal element.
has_exact_synonym: missing skeletal element

absent chondrocranium
type: Class
subclass of: abnormal chondrocranium
subclass of: absent cranium
definition: Absence of chondrocranium.
has_exact_synonym: missing chondrocranium

absent chondrocyte
type: Class
subclass of: abnormal chondrocyte
subclass of: absent cell
definition: Absence of chondrocyte.
has_exact_synonym: missing chondrocyte

absent head somite
type: Class
subclass of: abnormal head somite
subclass of: absent somite
definition: Absence of head somite.
has_exact_synonym: missing head somite

absent organism subdivision
type: Class
subclass of: abnormal organism subdivision
subclass of: absent multicellular anatomical structure
definition: Absence of organism subdivision.
has_exact_synonym: missing organism subdivision

absent trunk
type: Class
subclass of: abnormal trunk
subclass of: absent organism subdivision
definition: Absence of trunk.
has_exact_synonym: missing trunk

absent vein
type: Class
subclass of: abnormal vein
subclass of: absent blood vessel
definition: Absence of vein.
has_exact_synonym: missing vein

absent head vasculature
type: Class
subclass of: abnormal head vasculature
subclass of: absent multi-tissue structure
definition: Absence of head vasculature.
has_exact_synonym: missing head vasculature

absent blood vessel
type: Class
subclass of: abnormal blood vessel
subclass of: absent multi-tissue structure
definition: Absence of blood vessel.
has_exact_synonym: missing blood vessel

absent extraembryonic structure
type: Class
subclass of: abnormal extraembryonic structure
subclass of: absent anatomical structure
definition: Absence of extraembryonic structure.
has_exact_synonym: missing extraembryonic structure

absent olfactory epithelium
type: Class
subclass of: abnormal olfactory epithelium
subclass of: absent epithelium
definition: Absence of olfactory epithelium.
has_exact_synonym: missing olfactory epithelium

absent anatomical space
type: Class
subclass of: abnormal anatomical space
definition: Absence of anatomical space.
has_exact_synonym: missing anatomical space

absent myotome
type: Class
subclass of: abnormal myotome
subclass of: absent tissue
definition: Absence of myotome.
has_exact_synonym: missing myotome

absent lower blastopore lip
type: Class
subclass of: abnormal lower blastopore lip
subclass of: absent embryonic structure
definition: Absence of lower blastopore lip.
has_exact_synonym: missing lower blastopore lip

absent embryonic structure
type: Class
subclass of: abnormal embryonic structure
subclass of: absent anatomical structure
definition: Absence of embryonic structure.
has_exact_synonym: missing embryonic structure

absent cranial muscle primordium
type: Class
subclass of: abnormal cranial muscle primordium
subclass of: absent multi-tissue structure
definition: Absence of cranial muscle primordium.
has_exact_synonym: missing cranial muscle primordium

absent endoderm
type: Class
subclass of: abnormal endoderm
subclass of: absent primary germ layer
definition: Absence of endoderm.
has_exact_synonym: missing endoderm

absent posterior hypothalamus
type: Class
subclass of: abnormal posterior hypothalamus
subclass of: absent multi-tissue structure
definition: Absence of posterior hypothalamus.
has_exact_synonym: missing posterior hypothalamus

absent anatomical system
type: Class
subclass of: abnormal anatomical system
subclass of: absent anatomical group
definition: Absence of anatomical system.
has_exact_synonym: missing anatomical system

absent anatomical group
type: Class
subclass of: abnormal anatomical group
subclass of: absent anatomical structure
definition: Absence of anatomical group.
has_exact_synonym: missing anatomical group

absent stage V oocyte
type: Class
subclass of: abnormal stage V oocyte
subclass of: absent oocyte
definition: Absence of stage V oocyte.
has_exact_synonym: missing stage V oocyte

absent oocyte
type: Class
subclass of: abnormal oocyte
subclass of: absent germ cell
definition: Absence of oocyte.
has_exact_synonym: missing oocyte

absent mitral cell layer of the olfactory bulb
type: Class
subclass of: abnormal mitral cell layer of the olfactory bulb
subclass of: absent tissue
definition: Absence of mitral cell layer of the olfactory bulb.
has_exact_synonym: missing mitral cell layer of the olfactory bulb

absent animal cap inner layer
type: Class
subclass of: abnormal animal cap inner layer
subclass of: absent tissue
definition: Absence of animal cap inner layer.
has_exact_synonym: missing animal cap inner layer

absent trunk somite 8
type: Class
subclass of: abnormal trunk somite 8
subclass of: absent trunk somite
definition: Absence of trunk somite 8.
has_exact_synonym: missing trunk somite 8

absent trunk somite
type: Class
subclass of: abnormal trunk somite
subclass of: absent somite
definition: Absence of trunk somite.
has_exact_synonym: missing trunk somite

absent optic vesicle
type: Class
subclass of: abnormal optic vesicle
subclass of: absent embryonic structure
definition: Absence of optic vesicle.
has_exact_synonym: missing optic vesicle

absent radial glial cell
type: Class
subclass of: abnormal radial glial cell
subclass of: absent glial cell
definition: Absence of radial glial cell.
has_exact_synonym: missing radial glial cell

absent glial cell
type: Class
subclass of: abnormal glial cell
subclass of: absent cell
definition: Absence of glial cell.
has_exact_synonym: missing glial cell

absent dorsomedial edge of myotome
type: Class
subclass of: abnormal dorsomedial edge of myotome
subclass of: absent tissue
definition: Absence of dorsomedial edge of myotome.
has_exact_synonym: missing dorsomedial edge of myotome

absent odontogenic papilla
type: Class
subclass of: abnormal odontogenic papilla
subclass of: absent cell condensation
definition: Absence of odontogenic papilla.
has_exact_synonym: missing odontogenic papilla

absent cell condensation
type: Class
subclass of: abnormal cell condensation
subclass of: absent anatomical structure
definition: Absence of cell condensation.
has_exact_synonym: missing cell condensation

absent optic tectum
type: Class
subclass of: abnormal optic tectum
subclass of: absent multi-tissue structure
definition: Absence of optic tectum.
has_exact_synonym: missing optic tectum

absent Muller cell
type: Class
subclass of: abnormal Muller cell
subclass of: absent glial cell
definition: Absence of Muller cell.
has_exact_synonym: missing Muller cell

absent neutrophil
type: Class
subclass of: abnormal neutrophil
subclass of: absent circulating cell
definition: Absence of neutrophil.
has_exact_synonym: missing neutrophil

absent circulating cell
type: Class
subclass of: abnormal circulating cell
subclass of: absent cell
definition: Absence of circulating cell.
has_exact_synonym: missing circulating cell

absent muscle
type: Class
subclass of: abnormal muscle
subclass of: absent tissue
definition: Absence of muscle.
has_exact_synonym: missing muscle

absent neuron
type: Class
subclass of: abnormal neuron
subclass of: absent cell
definition: Absence of neuron.
has_exact_synonym: missing neuron

absent neural crest
type: Class
subclass of: abnormal neural crest
subclass of: absent tissue
definition: Absence of neural crest.
has_exact_synonym: missing neural crest

absent enteric nervous system
type: Class
subclass of: abnormal enteric nervous system
subclass of: absent nervous system
definition: Absence of enteric nervous system.
has_exact_synonym: missing enteric nervous system

absent vertebra
type: Class
subclass of: abnormal vertebra
subclass of: absent endochondral bone
definition: Absence of vertebra.
has_exact_synonym: missing vertebra

absent endochondral bone
type: Class
subclass of: abnormal endochondral bone
subclass of: absent endochondral element
definition: Absence of endochondral bone.
has_exact_synonym: missing endochondral bone

absent cell part
type: Class
subclass of: abnormal cell part
subclass of: absent anatomical structure
definition: Absence of cell part.
has_exact_synonym: missing cell part

absent anatomical cluster
type: Class
subclass of: abnormal anatomical cluster
subclass of: absent anatomical group
definition: Absence of anatomical cluster.
has_exact_synonym: missing anatomical cluster

absent spinal nerve
type: Class
subclass of: abnormal spinal nerve
subclass of: absent nerve
definition: Absence of spinal nerve.
has_exact_synonym: missing spinal nerve

absent nerve
type: Class
subclass of: abnormal nerve
subclass of: absent tissue
definition: Absence of nerve.
has_exact_synonym: missing nerve

absent dermal skeleton
type: Class
subclass of: abnormal dermal skeleton
subclass of: absent skeletal subdivision
definition: Absence of dermal skeleton.
has_exact_synonym: missing dermal skeleton

absent skeletal subdivision
type: Class
subclass of: abnormal skeletal subdivision
subclass of: absent anatomical cluster
definition: Absence of skeletal subdivision.
has_exact_synonym: missing skeletal subdivision

absent mesoderm
type: Class
subclass of: abnormal mesoderm
subclass of: absent primary germ layer
definition: Absence of mesoderm.
has_exact_synonym: missing mesoderm

absent involuted dorsal mesoderm
type: Class
subclass of: abnormal involuted dorsal mesoderm
subclass of: absent tissue
definition: Absence of involuted dorsal mesoderm.
has_exact_synonym: missing involuted dorsal mesoderm

absent posterior foregut
type: Class
subclass of: abnormal posterior foregut
subclass of: absent embryonic structure
definition: Absence of posterior foregut.
has_exact_synonym: missing posterior foregut

absent peripheral nervous system
type: Class
subclass of: abnormal peripheral nervous system
subclass of: absent nervous system
definition: Absence of peripheral nervous system.
has_exact_synonym: missing peripheral nervous system

absent central vegetal yolk mass
type: Class
subclass of: abnormal central vegetal yolk mass
subclass of: absent embryonic structure
definition: Absence of central vegetal yolk mass.
has_exact_synonym: missing central vegetal yolk mass

absent blastema
type: Class
subclass of: abnormal blastema
subclass of: absent regenerating tissue
definition: Absence of blastema.
has_exact_synonym: missing blastema

absent regenerating tissue
type: Class
subclass of: abnormal regenerating tissue
subclass of: absent tissue
definition: Absence of regenerating tissue.
has_exact_synonym: missing regenerating tissue

absent trunk somite 2
type: Class
subclass of: abnormal trunk somite 2
subclass of: absent trunk somite
definition: Absence of trunk somite 2.
has_exact_synonym: missing trunk somite 2

absent regenerating limb
type: Class
subclass of: abnormal regenerating limb
subclass of: absent regenerating tissue
definition: Absence of regenerating limb.
has_exact_synonym: missing regenerating limb

absent pelvic girdle
type: Class
subclass of: abnormal pelvic girdle
subclass of: absent skeletal subdivision
definition: Absence of pelvic girdle.
has_exact_synonym: missing pelvic girdle

absent endochondral element
type: Class
subclass of: abnormal endochondral element
subclass of: XPO_0125767
definition: Absence of endochondral element.
has_exact_synonym: missing endochondral element

absent prethalamus basal plate
type: Class
subclass of: abnormal prethalamus basal plate
subclass of: absent tissue
definition: Absence of prethalamus basal plate.
has_exact_synonym: missing prethalamus basal plate

absent dermis
type: Class
subclass of: abnormal dermis
subclass of: absent multi-tissue structure
definition: Absence of dermis.
has_exact_synonym: missing dermis

absent epidermis
type: Class
subclass of: abnormal epidermis
subclass of: absent multi-tissue structure
definition: Absence of epidermis.
has_exact_synonym: missing epidermis

absent cranium
type: Class
subclass of: abnormal cranium
subclass of: absent anatomical cluster
definition: Absence of cranium.
has_exact_synonym: missing cranium

absent mouth primordium
type: Class
subclass of: abnormal mouth primordium
subclass of: absent multi-tissue structure
definition: Absence of mouth primordium.
has_exact_synonym: missing mouth primordium

absent solid compound organ
type: Class
subclass of: abnormal solid compound organ
subclass of: absent compound organ
definition: Absence of solid compound organ.
has_exact_synonym: missing solid compound organ

absent head region
type: Class
subclass of: absent anatomical region
definition: Absence of head region.
has_exact_synonym: missing head region

absent anatomical region
type: Class
subclass of: XPO_0141315
definition: Absence of anatomical region.
has_exact_synonym: missing anatomical region

absent surface structure
type: Class
subclass of: abnormal surface structure
subclass of: absent organism subdivision
definition: Absence of surface structure.
has_exact_synonym: missing surface structure

absent neural stem cell
type: Class
subclass of: abnormal neural stem cell
subclass of: absent stem cell
definition: Absence of neural stem cell.
has_exact_synonym: missing neural stem cell

absent stem cell
type: Class
subclass of: abnormal stem cell
subclass of: absent cell
definition: Absence of stem cell.
has_exact_synonym: missing stem cell

absent cardinal vein
type: Class
subclass of: abnormal cardinal vein
subclass of: absent vein
definition: Absence of cardinal vein.
has_exact_synonym: missing cardinal vein

absent trunk vasculature
type: Class
subclass of: abnormal trunk vasculature
subclass of: absent multi-tissue structure
definition: Absence of trunk vasculature.
has_exact_synonym: missing trunk vasculature

absent ilium
type: Class
subclass of: abnormal ilium
subclass of: absent endochondral bone
definition: Absence of ilium.
has_exact_synonym: missing ilium

absent aorta
type: Class
subclass of: abnormal aorta
subclass of: absent artery
definition: Absence of aorta.
has_exact_synonym: missing aorta

absent artery
type: Class
subclass of: abnormal artery
subclass of: absent blood vessel
definition: Absence of artery.
has_exact_synonym: missing artery

absent paired dorsal aorta
type: Class
subclass of: abnormal paired dorsal aorta
subclass of: absent aorta
definition: Absence of paired dorsal aorta.
has_exact_synonym: missing paired dorsal aorta

absent dermatome
type: Class
subclass of: abnormal dermatome
subclass of: absent tissue
definition: Absence of dermatome.
has_exact_synonym: missing dermatome

absent internal coil of the small intestine
type: Class
subclass of: abnormal internal coil of the small intestine
subclass of: absent multi-tissue structure
definition: Absence of internal coil of the small intestine.
has_exact_synonym: missing internal coil of the small intestine

absent basal ganglion
type: Class
subclass of: abnormal basal ganglion
subclass of: absent anatomical cluster
definition: Absence of basal ganglion.
has_exact_synonym: missing basal ganglion

absent alimentary system
type: Class
subclass of: abnormal alimentary system
subclass of: absent anatomical system
definition: Absence of alimentary system.
has_exact_synonym: missing alimentary system

absent regenerating pelvic girdle
type: Class
subclass of: abnormal regenerating pelvic girdle
subclass of: absent regenerating tissue
definition: Absence of regenerating pelvic girdle.
has_exact_synonym: missing regenerating pelvic girdle

absent pharyngeal mesenchyme
type: Class
subclass of: abnormal pharyngeal mesenchyme
subclass of: absent mesenchyme
definition: Absence of pharyngeal mesenchyme.
has_exact_synonym: missing pharyngeal mesenchyme

absent mesenchyme
type: Class
subclass of: abnormal mesenchyme
subclass of: absent tissue
definition: Absence of mesenchyme.
has_exact_synonym: missing mesenchyme

absent spinal cord
type: Class
subclass of: abnormal spinal cord
subclass of: absent cavitated compound organ
definition: Absence of spinal cord.
has_exact_synonym: missing spinal cord

absent cavitated compound organ
type: Class
subclass of: abnormal cavitated compound organ
subclass of: absent compound organ
definition: Absence of cavitated compound organ.
has_exact_synonym: missing cavitated compound organ

absent secondary spermatogonium
type: Class
subclass of: abnormal secondary spermatogonium
subclass of: absent germ cell
definition: Absence of secondary spermatogonium.
has_exact_synonym: missing secondary spermatogonium

absent germ cell
type: Class
subclass of: abnormal germ cell
subclass of: absent cell
definition: Absence of germ cell.
has_exact_synonym: missing germ cell

absent lateral line placode
type: Class
subclass of: abnormal lateral line placode
subclass of: absent neurogenic placode
definition: Absence of lateral line placode.
has_exact_synonym: missing lateral line placode

absent neurogenic placode
type: Class
subclass of: abnormal neurogenic placode
subclass of: absent cranial placode
definition: Absence of neurogenic placode.
has_exact_synonym: missing neurogenic placode

absent anterior placodal area
type: Class
subclass of: abnormal anterior placodal area
subclass of: absent tissue
definition: Absence of anterior placodal area.
has_exact_synonym: missing anterior placodal area

absent neuromere
type: Class
subclass of: abnormal neuromere
subclass of: absent organism subdivision
definition: Absence of neuromere.
has_exact_synonym: missing neuromere

absent hindbrain
type: Class
subclass of: abnormal hindbrain
subclass of: absent multi-tissue structure
definition: Absence of hindbrain.
has_exact_synonym: missing hindbrain

absent presumptive rhombomere
type: Class
subclass of: abnormal presumptive rhombomere
subclass of: absent embryonic structure
definition: Absence of presumptive rhombomere.
has_exact_synonym: missing presumptive rhombomere

absent ectodermal cell
type: Class
subclass of: abnormal ectodermal cell
subclass of: absent cell
definition: Absence of ectodermal cell.
has_exact_synonym: missing ectodermal cell

absent peripheral ganglion
type: Class
subclass of: abnormal peripheral ganglion
subclass of: absent ganglion
definition: Absence of peripheral ganglion.
has_exact_synonym: missing peripheral ganglion

absent olfactory system
type: Class
subclass of: abnormal olfactory system
subclass of: absent sensory system
definition: Absence of olfactory system.
has_exact_synonym: missing olfactory system

absent sensory system
type: Class
subclass of: abnormal sensory system
subclass of: absent anatomical system
definition: Absence of sensory system.
has_exact_synonym: missing sensory system

absent mm. levator arcuum branchialium III primordium
type: Class
subclass of: abnormal mm. levator arcuum branchialium III primordium
subclass of: absent cranial muscle primordium
definition: Absence of mm. levator arcuum branchialium III primordium.
has_exact_synonym: missing mm. levator arcuum branchialium III primordium

absent sclerotome
type: Class
subclass of: abnormal sclerotome
subclass of: absent tissue
definition: Absence of sclerotome.
has_exact_synonym: missing sclerotome

absent ectoderm
type: Class
subclass of: abnormal ectoderm
subclass of: absent primary germ layer
definition: Absence of ectoderm.
has_exact_synonym: missing ectoderm

absent primary germ layer
type: Class
subclass of: abnormal primary germ layer
subclass of: absent tissue
definition: Absence of primary germ layer.
has_exact_synonym: missing primary germ layer

absent telencephalon
type: Class
subclass of: abnormal telencephalon
subclass of: absent multi-tissue structure
definition: Absence of telencephalon.
has_exact_synonym: missing telencephalon

absent splanchnic layer of lateral plate mesoderm
type: Class
subclass of: abnormal splanchnic layer of lateral plate mesoderm
subclass of: absent embryonic structure
definition: Absence of splanchnic layer of lateral plate mesoderm.
has_exact_synonym: missing splanchnic layer of lateral plate mesoderm

absent keratin accumulating cell
type: Class
subclass of: abnormal keratin accumulating cell
subclass of: absent cell
definition: Absence of keratin accumulating cell.
has_exact_synonym: missing keratin accumulating cell

absent retinal neural layer
type: Class
subclass of: abnormal retinal neural layer
subclass of: absent multi-tissue structure
definition: Absence of retinal neural layer.
has_exact_synonym: missing retinal neural layer

absent rhombomere R4
type: Class
subclass of: abnormal rhombomere R4
subclass of: absent rhombomere
definition: Absence of rhombomere R4.
has_exact_synonym: missing rhombomere R4

absent rhombomere
type: Class
subclass of: abnormal rhombomere
subclass of: absent neuromere
definition: Absence of rhombomere.
has_exact_synonym: missing rhombomere

absent liver and biliary system
type: Class
subclass of: abnormal liver and biliary system
subclass of: absent anatomical system
definition: Absence of liver and biliary system.
has_exact_synonym: missing liver and biliary system

absent cloaca
type: Class
subclass of: abnormal cloaca
subclass of: absent multi-tissue structure
definition: Absence of cloaca.
has_exact_synonym: missing cloaca

absent visual system
type: Class
subclass of: abnormal visual system
subclass of: absent sensory system
definition: Absence of visual system.
has_exact_synonym: missing visual system

absent thrombocyte
type: Class
subclass of: abnormal thrombocyte
subclass of: absent cell
definition: Absence of thrombocyte.
has_exact_synonym: missing thrombocyte

absent striatum
type: Class
subclass of: abnormal striatum
subclass of: absent anatomical cluster
definition: Absence of striatum.
has_exact_synonym: missing striatum

absent right ventricle
type: Class
subclass of: abnormal right ventricle
subclass of: absent lateral ventricle
definition: Absence of right ventricle.
has_exact_synonym: missing right ventricle

absent lateral ventricle
type: Class
subclass of: abnormal lateral ventricle
subclass of: absent brain ventricle
definition: Absence of lateral ventricle.
has_exact_synonym: missing lateral ventricle

absent neural plate
type: Class
subclass of: abnormal neural plate
subclass of: absent tissue
definition: Absence of neural plate.
has_exact_synonym: missing neural plate

absent venous endothelium
type: Class
subclass of: abnormal venous endothelium
subclass of: absent simple squamous epithelium
definition: Absence of venous endothelium.
has_exact_synonym: missing venous endothelium

absent uveal tract
type: Class
subclass of: abnormal uveal tract
subclass of: absent tissue
definition: Absence of uveal tract.
has_exact_synonym: missing uveal tract

absent tail somite 15
type: Class
subclass of: abnormal tail somite 15
subclass of: absent tail somite
definition: Absence of tail somite 15.
has_exact_synonym: missing tail somite 15

absent prime meridian
type: Class
subclass of: abnormal prime meridian
subclass of: absent anatomical region
definition: Absence of prime meridian.
has_exact_synonym: missing prime meridian

absent blastomere D1.2.2
type: Class
subclass of: abnormal blastomere D1.2.2
subclass of: absent dorsal animal hemisphere blastomere
definition: Absence of blastomere D1.2.2.
has_exact_synonym: missing blastomere D1.2.2

absent dorsal animal hemisphere blastomere
type: Class
subclass of: abnormal dorsal animal hemisphere blastomere
subclass of: absent animal blastomere
definition: Absence of dorsal animal hemisphere blastomere.
has_exact_synonym: missing dorsal animal hemisphere blastomere

absent habenula
type: Class
subclass of: abnormal habenula
subclass of: absent multi-tissue structure
definition: Absence of habenula.
has_exact_synonym: missing habenula

absent hindgut
type: Class
subclass of: abnormal hindgut
subclass of: absent embryonic structure
definition: Absence of hindgut.
has_exact_synonym: missing hindgut

absent lateral plate mesoderm
type: Class
subclass of: abnormal lateral plate mesoderm
subclass of: absent embryonic structure
definition: Absence of lateral plate mesoderm.
has_exact_synonym: missing lateral plate mesoderm

obsolete absent left optic vesicle
type: Class
deprecated: true

absent fin margin
type: Class
subclass of: abnormal fin margin
subclass of: absent tissue
definition: Absence of fin margin.
has_exact_synonym: missing fin margin

absent distal stomach
type: Class
subclass of: abnormal distal stomach
subclass of: absent multi-tissue structure
definition: Absence of distal stomach.
has_exact_synonym: missing distal stomach

absent midbrain tegmentum
type: Class
subclass of: abnormal midbrain tegmentum
subclass of: absent multi-tissue structure
definition: Absence of midbrain tegmentum.
has_exact_synonym: missing midbrain tegmentum

absent primary heart field
type: Class
subclass of: abnormal primary heart field
subclass of: absent tissue
definition: Absence of primary heart field.
has_exact_synonym: missing primary heart field

absent trigeminal placode
type: Class
subclass of: abnormal trigeminal placode
subclass of: absent neurogenic placode
definition: Absence of trigeminal placode.
has_exact_synonym: missing trigeminal placode

absent cornea
type: Class
subclass of: abnormal cornea
subclass of: absent surface structure
definition: Absence of cornea.
has_exact_synonym: missing cornea

absent urinary system
type: Class
subclass of: abnormal urinary system
subclass of: absent anatomical system
definition: Absence of urinary system.
has_exact_synonym: missing urinary system

absent median fin skeleton
type: Class
subclass of: abnormal median fin skeleton
subclass of: absent skeletal subdivision
definition: Absence of median fin skeleton.
has_exact_synonym: missing median fin skeleton

absent hematological system
type: Class
subclass of: abnormal hematological system
subclass of: absent anatomical system
definition: Absence of hematological system.
has_exact_synonym: missing hematological system

absent limb segment
type: Class
subclass of: abnormal limb segment
subclass of: absent organism subdivision
definition: Absence of limb segment.
has_exact_synonym: missing limb segment

absent enteroendocrine cell
type: Class
subclass of: abnormal enteroendocrine cell
subclass of: absent endocrine cell
definition: Absence of enteroendocrine cell.
has_exact_synonym: missing enteroendocrine cell

absent endocrine cell
type: Class
subclass of: abnormal endocrine cell
subclass of: absent cell
definition: Absence of endocrine cell.
has_exact_synonym: missing endocrine cell

absent islets of Langerhans
type: Class
subclass of: abnormal islets of Langerhans
subclass of: absent multi-tissue structure
definition: Absence of islets of Langerhans.
has_exact_synonym: missing islets of Langerhans

absent ventral aorta
type: Class
subclass of: abnormal ventral aorta
subclass of: absent aorta
definition: Absence of ventral aorta.
has_exact_synonym: missing ventral aorta

absent ventral fin margin
type: Class
subclass of: abnormal ventral fin margin
subclass of: absent fin margin
definition: Absence of ventral fin margin.
has_exact_synonym: missing ventral fin margin

absent subpallium
type: Class
subclass of: abnormal subpallium
subclass of: absent multi-tissue structure
definition: Absence of subpallium.
has_exact_synonym: missing subpallium

absent proximal stomach
type: Class
subclass of: abnormal proximal stomach
subclass of: absent multi-tissue structure
definition: Absence of proximal stomach.
has_exact_synonym: missing proximal stomach

absent centrosome
type: Class
subclass of: abnormal centrosome
subclass of: absent cell part
definition: Absence of centrosome.
has_exact_synonym: missing centrosome

absent second pancreatic bud
type: Class
subclass of: abnormal second pancreatic bud
subclass of: absent multi-tissue structure
definition: Absence of second pancreatic bud.
has_exact_synonym: missing second pancreatic bud

absent first pancreatic bud
type: Class
subclass of: abnormal first pancreatic bud
subclass of: absent primordium
definition: Absence of first pancreatic bud.
has_exact_synonym: missing first pancreatic bud

absent hepato-pancreatic progenitor cell
type: Class
subclass of: abnormal hepato-pancreatic progenitor cell
subclass of: absent progenitor cell
definition: Absence of hepato-pancreatic progenitor cell.
has_exact_synonym: missing hepato-pancreatic progenitor cell

absent oropharyngeal papilla
type: Class
subclass of: abnormal oropharyngeal papilla
subclass of: absent odontogenic papilla
definition: Absence of oropharyngeal papilla.
has_exact_synonym: missing oropharyngeal papilla

absent dorsal lateral line
type: Class
subclass of: abnormal dorsal lateral line
subclass of: absent lateral line
definition: Absence of dorsal lateral line.
has_exact_synonym: missing dorsal lateral line

absent lateral line
type: Class
subclass of: abnormal lateral line
subclass of: absent tissue
definition: Absence of lateral line.
has_exact_synonym: missing lateral line

absent simple squamous epithelium
type: Class
subclass of: abnormal simple squamous epithelium
subclass of: absent unilaminar epithelium
definition: Absence of simple squamous epithelium.
has_exact_synonym: missing simple squamous epithelium

absent central canal
type: Class
subclass of: abnormal central canal
subclass of: absent anatomical cluster
definition: Absence of central canal.
has_exact_synonym: missing central canal

absent brain ventricle
type: Class
subclass of: abnormal brain ventricle
subclass of: absent anatomical space
definition: Absence of brain ventricle.
has_exact_synonym: missing brain ventricle

absent truncus arteriosus
type: Class
subclass of: abnormal truncus arteriosus
subclass of: absent blood vessel
definition: Absence of truncus arteriosus.
has_exact_synonym: missing truncus arteriosus

absent lymphatic system
type: Class
subclass of: abnormal lymphatic system
subclass of: absent anatomical system
definition: Absence of lymphatic system.
has_exact_synonym: missing lymphatic system

absent compound organ
type: Class
subclass of: abnormal compound organ
subclass of: absent multicellular anatomical structure
definition: Absence of compound organ.
has_exact_synonym: missing compound organ

absent claw
type: Class
subclass of: abnormal claw
subclass of: absent acellular anatomical structure
definition: Absence of claw.
has_exact_synonym: missing claw

absent acellular anatomical structure
type: Class
subclass of: abnormal acellular anatomical structure
subclass of: absent anatomical structure
definition: Absence of acellular anatomical structure.
has_exact_synonym: missing acellular anatomical structure

absent circumblastoporal collar
type: Class
subclass of: abnormal circumblastoporal collar
subclass of: absent embryonic structure
definition: Absence of circumblastoporal collar.
has_exact_synonym: missing circumblastoporal collar

absent trunk somite 13
type: Class
subclass of: abnormal trunk somite 13
subclass of: absent trunk somite
definition: Absence of trunk somite 13.
has_exact_synonym: missing trunk somite 13

absent avascular GAG-rich matrix
type: Class
subclass of: abnormal avascular GAG-rich matrix
subclass of: absent proteinaceous extracellular matrix
definition: Absence of avascular GAG-rich matrix.
has_exact_synonym: missing avascular GAG-rich matrix

absent non-mineralized cartilage tissue
type: Class
subclass of: abnormal non-mineralized cartilage tissue
subclass of: absent cartilage tissue
definition: Absence of non-mineralized cartilage tissue.
has_exact_synonym: missing non-mineralized cartilage tissue

absent proteinaceous extracellular matrix
type: Class
subclass of: abnormal proteinaceous extracellular matrix
subclass of: absent extracellular matrix
definition: Absence of proteinaceous extracellular matrix.
has_exact_synonym: missing proteinaceous extracellular matrix

absent postcranial axial skeleton
type: Class
subclass of: abnormal postcranial axial skeleton
subclass of: absent skeletal subdivision
definition: Absence of postcranial axial skeleton.
has_exact_synonym: missing postcranial axial skeleton

absent dorsal region
type: Class
subclass of: abnormal dorsal region
subclass of: absent anatomical region
definition: Absence of dorsal region.
has_exact_synonym: missing dorsal region

absent mandibular arch
type: Class
subclass of: abnormal mandibular arch
subclass of: absent pharyngeal arch
definition: Absence of mandibular arch.
has_exact_synonym: missing mandibular arch

absent pharyngeal arch
type: Class
subclass of: abnormal pharyngeal arch
subclass of: absent multi-tissue structure
definition: Absence of pharyngeal arch.
has_exact_synonym: missing pharyngeal arch

absent choroid
type: Class
subclass of: abnormal choroid
subclass of: absent tissue
definition: Absence of choroid.
has_exact_synonym: missing choroid

absent interneuron
type: Class
subclass of: abnormal interneuron
subclass of: absent neuron
definition: Absence of interneuron.
has_exact_synonym: missing interneuron

absent sclerotomal cartilage
type: Class
subclass of: abnormal sclerotomal cartilage
subclass of: absent tissue
definition: Absence of sclerotomal cartilage.
has_exact_synonym: missing sclerotomal cartilage

absent smooth muscle
type: Class
subclass of: abnormal smooth muscle
subclass of: absent muscle
definition: Absence of smooth muscle.
has_exact_synonym: missing smooth muscle

absent neural nucleus
type: Class
subclass of: abnormal neural nucleus
subclass of: absent anatomical cluster
definition: Absence of neural nucleus.
has_exact_synonym: missing neural nucleus

absent prethalamus
type: Class
subclass of: abnormal prethalamus
subclass of: absent multi-tissue structure
definition: Absence of prethalamus.
has_exact_synonym: missing prethalamus

absent involuting marginal zone
type: Class
subclass of: abnormal involuting marginal zone
subclass of: absent marginal zone
definition: Absence of involuting marginal zone.
has_exact_synonym: missing involuting marginal zone

absent marginal zone
type: Class
subclass of: abnormal marginal zone
subclass of: absent embryonic structure
definition: Absence of marginal zone.
has_exact_synonym: missing marginal zone

absent skin gland
type: Class
subclass of: abnormal skin gland
subclass of: absent surface structure
definition: Absence of skin gland.
has_exact_synonym: missing skin gland

absent mesonephric tubule
type: Class
subclass of: abnormal mesonephric tubule
subclass of: absent tissue
definition: Absence of mesonephric tubule.
has_exact_synonym: missing mesonephric tubule

absent mesonephric nephron
type: Class
subclass of: abnormal mesonephric nephron
subclass of: absent multi-tissue structure
definition: Absence of mesonephric nephron.
has_exact_synonym: missing mesonephric nephron

absent osteoid
type: Class
subclass of: abnormal osteoid
subclass of: absent bone tissue
subclass of: absent matrix-based tissue
definition: Absence of osteoid.
has_exact_synonym: missing osteoid

absent bone tissue
type: Class
subclass of: abnormal bone tissue
subclass of: absent skeletal tissue
definition: Absence of bone tissue.
has_exact_synonym: missing bone tissue

absent matrix-based tissue
type: Class
subclass of: abnormal matrix-based tissue
subclass of: absent tissue
definition: Absence of matrix-based tissue.
has_exact_synonym: missing matrix-based tissue

absent supraorbital lateral line
type: Class
subclass of: abnormal supraorbital lateral line
subclass of: absent lateral line
definition: Absence of supraorbital lateral line.
has_exact_synonym: missing supraorbital lateral line

absent gastrocoel roof plate
type: Class
subclass of: abnormal gastrocoel roof plate
subclass of: absent tissue
definition: Absence of gastrocoel roof plate.
has_exact_synonym: missing gastrocoel roof plate

absent tympanic annulus
type: Class
subclass of: abnormal tympanic annulus
subclass of: absent cartilage element
definition: Absence of tympanic annulus.
has_exact_synonym: missing tympanic annulus

absent neuroectoderm
type: Class
subclass of: abnormal neuroectoderm
subclass of: absent tissue
definition: Absence of neuroectoderm.
has_exact_synonym: missing neuroectoderm

absent liver parenchyme
type: Class
subclass of: abnormal liver parenchyme
subclass of: absent tissue
definition: Absence of liver parenchyme.
has_exact_synonym: missing liver parenchyme

absent animal hemisphere
type: Class
subclass of: abnormal animal hemisphere
subclass of: absent anatomical region
definition: Absence of animal hemisphere.
has_exact_synonym: missing animal hemisphere

absent branchial crest
type: Class
subclass of: abnormal branchial crest
subclass of: absent tissue
definition: Absence of branchial crest.
has_exact_synonym: missing branchial crest

absent progenitor cell
type: Class
subclass of: abnormal progenitor cell
subclass of: absent cell
definition: Absence of progenitor cell.
has_exact_synonym: missing progenitor cell

absent heart primordium
type: Class
subclass of: abnormal heart primordium
subclass of: absent primordium
definition: Absence of heart primordium.
has_exact_synonym: missing heart primordium

absent digit
type: Class
subclass of: abnormal digit
subclass of: absent anatomical cluster
definition: Absence of digit.
has_exact_synonym: missing digit

absent trunk somite 9
type: Class
subclass of: abnormal trunk somite 9
subclass of: absent trunk somite
definition: Absence of trunk somite 9.
has_exact_synonym: missing trunk somite 9

absent trunk somite 10
type: Class
subclass of: abnormal trunk somite 10
subclass of: absent trunk somite
definition: Absence of trunk somite 10.
has_exact_synonym: missing trunk somite 10

absent dorsolateral neural tube
type: Class
subclass of: abnormal dorsolateral neural tube
subclass of: absent embryonic structure
definition: Absence of dorsolateral neural tube.
has_exact_synonym: missing dorsolateral neural tube

absent foregut
type: Class
subclass of: abnormal foregut
subclass of: absent embryonic structure
definition: Absence of foregut.
has_exact_synonym: missing foregut

absent extracellular matrix
type: Class
subclass of: abnormal extracellular matrix
subclass of: absent acellular anatomical structure
definition: Absence of extracellular matrix.
has_exact_synonym: missing extracellular matrix

absent tail region
type: Class
subclass of: abnormal tail region
subclass of: absent anatomical region
definition: Absence of tail region.
has_exact_synonym: missing tail region

absent pronephric duct
type: Class
subclass of: abnormal pronephric duct
subclass of: absent duct
definition: Absence of pronephric duct.
has_exact_synonym: missing pronephric duct

absent duct
type: Class
subclass of: abnormal duct
subclass of: absent multi-tissue structure
definition: Absence of duct.
has_exact_synonym: missing duct

absent dorsal pancreatic bud
type: Class
subclass of: abnormal dorsal pancreatic bud
subclass of: absent primordium
definition: Absence of dorsal pancreatic bud.
has_exact_synonym: missing dorsal pancreatic bud

absent primordium
type: Class
subclass of: abnormal primordium
subclass of: absent embryonic structure
definition: Absence of primordium.
has_exact_synonym: missing primordium

absent medulla oblongata
type: Class
subclass of: abnormal medulla oblongata
subclass of: absent multi-tissue structure
definition: Absence of medulla oblongata.
has_exact_synonym: missing medulla oblongata

absent presomitic mesoderm
type: Class
subclass of: abnormal presomitic mesoderm
subclass of: absent tissue
definition: Absence of presomitic mesoderm.
has_exact_synonym: missing presomitic mesoderm

absent liver diverticulum
type: Class
subclass of: abnormal liver diverticulum
subclass of: absent embryonic structure
definition: Absence of liver diverticulum.
has_exact_synonym: missing liver diverticulum

absent non-neural ectoderm
type: Class
subclass of: abnormal non-neural ectoderm
subclass of: absent tissue
definition: Absence of non-neural ectoderm.
has_exact_synonym: missing non-neural ectoderm

absent fin
type: Class
subclass of: abnormal fin
subclass of: absent surface structure
definition: Absence of fin.
has_exact_synonym: missing fin

absent trunk neural crest
type: Class
subclass of: abnormal trunk neural crest
subclass of: XPO_0141463
definition: Absence of trunk neural crest.
has_exact_synonym: missing trunk neural crest

absent tail fin
type: Class
subclass of: abnormal tail fin
subclass of: absent fin
definition: Absence of tail fin.
has_exact_synonym: missing tail fin

absent midbrain-hindbrain boundary
type: Class
subclass of: abnormal midbrain-hindbrain boundary
subclass of: absent anatomical line
definition: Absence of midbrain-hindbrain boundary.
has_exact_synonym: missing midbrain-hindbrain boundary

absent anatomical line
type: Class
subclass of: abnormal anatomical line
definition: Absence of anatomical line.
has_exact_synonym: missing anatomical line

absent perichondrium
type: Class
subclass of: abnormal perichondrium
subclass of: absent connective tissue
definition: Absence of perichondrium.
has_exact_synonym: missing perichondrium

absent connective tissue
type: Class
subclass of: abnormal connective tissue
subclass of: absent tissue
definition: Absence of connective tissue.
has_exact_synonym: missing connective tissue

absent metencephalic artery
type: Class
subclass of: abnormal metencephalic artery
subclass of: absent artery
definition: Absence of metencephalic artery.
has_exact_synonym: missing metencephalic artery

absent blastomere
type: Class
subclass of: abnormal blastomere
subclass of: absent early embryonic cell
definition: Absence of blastomere.
has_exact_synonym: missing blastomere

absent vegetal hemisphere
type: Class
subclass of: abnormal vegetal hemisphere
subclass of: absent anatomical region
definition: Absence of vegetal hemisphere.
has_exact_synonym: missing vegetal hemisphere

absent early embryonic cell
type: Class
subclass of: abnormal early embryonic cell
subclass of: absent cell
definition: Absence of early embryonic cell.
has_exact_synonym: missing early embryonic cell

absent osteoblast
type: Class
subclass of: abnormal osteoblast
subclass of: absent cell
definition: Absence of osteoblast.
has_exact_synonym: missing osteoblast

absent blastopore lip
type: Class
subclass of: abnormal blastopore lip
subclass of: absent embryonic structure
definition: Absence of blastopore lip.
has_exact_synonym: missing blastopore lip

absent medial ganglionic eminence
type: Class
subclass of: abnormal medial ganglionic eminence
subclass of: absent tissue
definition: Absence of medial ganglionic eminence.
has_exact_synonym: missing medial ganglionic eminence

absent spike
type: Class
subclass of: abnormal spike
subclass of: absent regenerating tissue
definition: Absence of spike.
has_exact_synonym: missing spike

absent dorsal aorta
type: Class
subclass of: abnormal dorsal aorta
subclass of: absent aorta
definition: Absence of dorsal aorta.
has_exact_synonym: missing dorsal aorta

absent cardiac mesoderm
type: Class
subclass of: abnormal cardiac mesoderm
subclass of: absent embryonic structure
definition: Absence of cardiac mesoderm.
has_exact_synonym: missing cardiac mesoderm

absent stapes
type: Class
subclass of: abnormal stapes
subclass of: absent cartilage element
subclass of: absent auditory ossicle
definition: Absence of stapes.
has_exact_synonym: missing stapes

absent auditory ossicle
type: Class
subclass of: abnormal auditory ossicle
subclass of: absent bone element
definition: Absence of auditory ossicle.
has_exact_synonym: missing auditory ossicle

absent anterior dorsal lateral plate region
type: Class
subclass of: abnormal anterior dorsal lateral plate region
subclass of: absent embryonic structure
definition: Absence of anterior dorsal lateral plate region.
has_exact_synonym: missing anterior dorsal lateral plate region

absent head endoderm
type: Class
subclass of: abnormal head endoderm
subclass of: absent tissue
definition: Absence of head endoderm.
has_exact_synonym: missing head endoderm

absent granule cell layer of the cerebellum
type: Class
subclass of: abnormal granule cell layer of the cerebellum
subclass of: absent tissue
definition: Absence of granule cell layer of the cerebellum.
has_exact_synonym: missing granule cell layer of the cerebellum

absent bone element
type: Class
subclass of: abnormal bone element
subclass of: absent skeletal element
definition: Absence of bone element.
has_exact_synonym: missing bone element

absent pallidum
type: Class
subclass of: abnormal pallidum
subclass of: absent anatomical cluster
definition: Absence of pallidum.
has_exact_synonym: missing pallidum

absent eye muscle
type: Class
subclass of: abnormal eye muscle
subclass of: absent cranial muscle
definition: Absence of eye muscle.
has_exact_synonym: missing eye muscle

absent m. obliquus superior primordium
type: Class
subclass of: abnormal m. obliquus superior primordium
subclass of: absent cranial muscle primordium
definition: Absence of m. obliquus superior primordium.
has_exact_synonym: missing m. obliquus superior primordium

absent visceral pouch 2
type: Class
subclass of: abnormal visceral pouch 2
subclass of: absent visceral pouch
definition: Absence of visceral pouch 2.
has_exact_synonym: missing visceral pouch 2

absent visceral pouch
type: Class
subclass of: abnormal visceral pouch
subclass of: absent embryonic structure
definition: Absence of visceral pouch.
has_exact_synonym: missing visceral pouch

absent limb
type: Class
subclass of: abnormal limb
subclass of: absent organism subdivision
definition: Absence of limb.
has_exact_synonym: missing limb

absent axial skeleton
type: Class
subclass of: abnormal axial skeleton
subclass of: absent skeletal subdivision
definition: Absence of axial skeleton.
has_exact_synonym: missing axial skeleton

absent pronephric kidney
type: Class
subclass of: abnormal pronephric kidney
subclass of: absent multi-tissue structure
subclass of: absent embryonic kidney
definition: Absence of pronephric kidney.
has_exact_synonym: missing pronephric kidney

absent embryonic kidney
type: Class
subclass of: abnormal embryonic kidney
subclass of: absent kidney
definition: Absence of embryonic kidney.
has_exact_synonym: missing embryonic kidney

absent embryo
type: Class
subclass of: abnormal embryo
definition: Absence of embryo.
has_exact_synonym: missing embryo

absent sclerotome of head somite 4
type: Class
subclass of: abnormal sclerotome of head somite 4
subclass of: absent sclerotome
definition: Absence of sclerotome of head somite 4.
has_exact_synonym: missing sclerotome of head somite 4

absent claw primordium
type: Class
subclass of: abnormal claw primordium
subclass of: absent tissue
definition: Absence of claw primordium.
has_exact_synonym: missing claw primordium

absent m. constrictor laryngis
type: Class
subclass of: abnormal m. constrictor laryngis
subclass of: absent laryngeal muscle
definition: Absence of m. constrictor laryngis.
has_exact_synonym: missing m. constrictor laryngis

absent laryngeal muscle
type: Class
subclass of: abnormal laryngeal muscle
subclass of: absent cranial muscle
definition: Absence of laryngeal muscle.
has_exact_synonym: missing laryngeal muscle

absent animal cap
type: Class
subclass of: abnormal animal cap
subclass of: absent embryonic structure
definition: Absence of animal cap.
has_exact_synonym: missing animal cap

absent iliofibularis
type: Class
subclass of: abnormal iliofibularis
subclass of: absent muscle
definition: Absence of iliofibularis.
has_exact_synonym: missing iliofibularis

absent m. levator mandibulae longus internus
type: Class
subclass of: abnormal m. levator mandibulae longus internus
subclass of: absent mandibular head muscle
definition: Absence of m. levator mandibulae longus internus.
has_exact_synonym: missing m. levator mandibulae longus internus

absent mandibular head muscle
type: Class
subclass of: abnormal mandibular head muscle
subclass of: absent cranial muscle
definition: Absence of mandibular head muscle.
has_exact_synonym: missing mandibular head muscle

absent skeletal myocyte
type: Class
subclass of: abnormal skeletal myocyte
subclass of: absent myocyte
definition: Absence of skeletal myocyte.
has_exact_synonym: missing skeletal myocyte

absent myocyte
type: Class
subclass of: abnormal myocyte
subclass of: absent cell
definition: Absence of myocyte.
has_exact_synonym: missing myocyte

absent nucleus reticularis medialis
type: Class
subclass of: abnormal nucleus reticularis medialis
subclass of: absent neural nucleus
definition: Absence of nucleus reticularis medialis.
has_exact_synonym: missing nucleus reticularis medialis

absent trunk placode
type: Class
subclass of: abnormal trunk placode
subclass of: absent embryonic structure
definition: Absence of trunk placode.
has_exact_synonym: missing trunk placode

absent zygote
type: Class
subclass of: abnormal zygote
subclass of: absent cell
definition: Absence of zygote.
has_exact_synonym: missing zygote

absent neuropil of the optic tectum
type: Class
subclass of: abnormal neuropil of the optic tectum
subclass of: absent tissue
definition: Absence of neuropil of the optic tectum.
has_exact_synonym: missing neuropil of the optic tectum

absent midbrain
type: Class
subclass of: abnormal midbrain
subclass of: absent multi-tissue structure
definition: Absence of midbrain.
has_exact_synonym: missing midbrain

absent dorsal lymph space
type: Class
subclass of: abnormal dorsal lymph space
subclass of: absent anatomical space
definition: Absence of dorsal lymph space.
has_exact_synonym: missing dorsal lymph space

absent dermomyotome
type: Class
subclass of: abnormal dermomyotome
subclass of: absent multilaminar epithelium
definition: Absence of dermomyotome.
has_exact_synonym: missing dermomyotome

absent multilaminar epithelium
type: Class
subclass of: abnormal multilaminar epithelium
subclass of: absent epithelium
definition: Absence of multilaminar epithelium.
has_exact_synonym: missing multilaminar epithelium

absent tuberal region
type: Class
subclass of: abnormal tuberal region
subclass of: absent multi-tissue structure
definition: Absence of tuberal region.
has_exact_synonym: missing tuberal region

absent basal body
type: Class
subclass of: abnormal basal body
subclass of: absent cell part
definition: Absence of basal body.
has_exact_synonym: missing basal body

absent m. quadrato-hyoangularis
type: Class
subclass of: abnormal m. quadrato-hyoangularis
subclass of: absent hyoid head muscle
definition: Absence of m. quadrato-hyoangularis.
has_exact_synonym: missing m. quadrato-hyoangularis

absent hyoid head muscle
type: Class
subclass of: abnormal hyoid head muscle
subclass of: absent cranial muscle
definition: Absence of hyoid head muscle.
has_exact_synonym: missing hyoid head muscle

absent pancreas
type: Class
subclass of: abnormal pancreas
subclass of: absent compound organ
subclass of: absent viscus
definition: Absence of pancreas.
has_exact_synonym: missing pancreas

absent viscus
type: Class
subclass of: abnormal viscus
subclass of: absent anatomical cluster
definition: Absence of viscus.
has_exact_synonym: missing viscus

absent m. interhyoideus
type: Class
subclass of: abnormal m. interhyoideus
subclass of: absent hyoid head muscle
definition: Absence of m. interhyoideus.
has_exact_synonym: missing m. interhyoideus

absent amygdala
type: Class
subclass of: abnormal amygdala
subclass of: absent anatomical cluster
definition: Absence of amygdala.
has_exact_synonym: missing amygdala

absent m. rectus anterior primordium
type: Class
subclass of: abnormal m. rectus anterior primordium
subclass of: absent cranial muscle primordium
definition: Absence of m. rectus anterior primordium.
has_exact_synonym: missing m. rectus anterior primordium

absent ganglion
type: Class
subclass of: abnormal ganglion
subclass of: absent tissue
definition: Absence of ganglion.
has_exact_synonym: missing ganglion

absent aortic arch 6
type: Class
subclass of: abnormal aortic arch 6
subclass of: absent aortic arch
definition: Absence of aortic arch 6.
has_exact_synonym: missing aortic arch 6

absent ovary
type: Class
subclass of: abnormal ovary
subclass of: absent gonad
definition: Absence of ovary.
has_exact_synonym: missing ovary

absent gonad
type: Class
subclass of: abnormal gonad
subclass of: absent cavitated compound organ
definition: Absence of gonad.
has_exact_synonym: missing gonad

absent small intestine
type: Class
subclass of: abnormal small intestine
subclass of: absent multi-tissue structure
definition: Absence of small intestine.
has_exact_synonym: missing small intestine

absent telencephalon septum
type: Class
subclass of: abnormal telencephalon septum
subclass of: XPO_0141690
definition: Absence of telencephalon septum.
has_exact_synonym: missing telencephalon septum

absent sensorial layer of neurectoderm
type: Class
subclass of: abnormal sensorial layer of neurectoderm
subclass of: absent tissue
definition: Absence of sensorial layer of neurectoderm.
has_exact_synonym: missing sensorial layer of neurectoderm

absent proepicardium
type: Class
subclass of: abnormal proepicardium
subclass of: absent progenitor cell
definition: Absence of proepicardium.
has_exact_synonym: missing proepicardium

absent hindgut endoderm
type: Class
subclass of: abnormal hindgut endoderm
subclass of: absent tissue
definition: Absence of hindgut endoderm.
has_exact_synonym: missing hindgut endoderm

absent glomus
type: Class
subclass of: abnormal glomus
subclass of: absent multi-tissue structure
definition: Absence of glomus.
has_exact_synonym: missing glomus

absent infundibulum
type: Class
subclass of: abnormal infundibulum
subclass of: absent multi-tissue structure
definition: Absence of infundibulum.
has_exact_synonym: missing infundibulum

absent periosteum
type: Class
subclass of: abnormal periosteum
subclass of: absent connective tissue
definition: Absence of periosteum.
has_exact_synonym: missing periosteum

absent raphe nucleus
type: Class
subclass of: abnormal raphe nucleus
subclass of: absent multi-tissue structure
definition: Absence of raphe nucleus.
has_exact_synonym: missing raphe nucleus

absent eye primordium
type: Class
subclass of: abnormal eye primordium
subclass of: absent primordium
definition: Absence of eye primordium.
has_exact_synonym: missing eye primordium

absent sclerotome of trunk somite 1
type: Class
subclass of: abnormal sclerotome of trunk somite 1
subclass of: absent sclerotome
definition: Absence of sclerotome of trunk somite 1.
has_exact_synonym: missing sclerotome of trunk somite 1

absent larval alimentary system
type: Class
subclass of: abnormal larval alimentary system
subclass of: absent alimentary system
definition: Absence of larval alimentary system.
has_exact_synonym: missing larval alimentary system

absent larval aorta
type: Class
subclass of: abnormal larval aorta
subclass of: absent artery
definition: Absence of larval aorta.
has_exact_synonym: missing larval aorta

absent supraoptoparaventricular region
type: Class
subclass of: abnormal supraoptoparaventricular region
subclass of: absent neural nucleus
definition: Absence of supraoptoparaventricular region.
has_exact_synonym: missing supraoptoparaventricular region

absent myotome of trunk somite 1
type: Class
subclass of: abnormal myotome of trunk somite 1
subclass of: absent myotome
definition: Absence of myotome of trunk somite 1.
has_exact_synonym: missing myotome of trunk somite 1

absent kidney
type: Class
subclass of: abnormal kidney
subclass of: absent cavitated compound organ
definition: Absence of kidney.
has_exact_synonym: missing kidney

absent isthmic nucleus
type: Class
subclass of: abnormal isthmic nucleus
subclass of: absent neural nucleus
definition: Absence of isthmic nucleus.
has_exact_synonym: missing isthmic nucleus

absent pre-chordal neural plate
type: Class
subclass of: abnormal pre-chordal neural plate
subclass of: absent tissue
definition: Absence of pre-chordal neural plate.
has_exact_synonym: missing pre-chordal neural plate

absent respiratory system
type: Class
subclass of: abnormal respiratory system
subclass of: absent anatomical system
definition: Absence of respiratory system.
has_exact_synonym: missing respiratory system

absent organ part
type: Class
subclass of: abnormal organ part
subclass of: absent anatomical structure
definition: Absence of organ part.
has_exact_synonym: missing organ part

absent humerus
type: Class
subclass of: abnormal humerus
subclass of: absent endochondral bone
definition: Absence of humerus.
has_exact_synonym: missing humerus

absent radio-ulna
type: Class
subclass of: abnormal radio-ulna
subclass of: absent endochondral bone
definition: Absence of radio-ulna.
has_exact_synonym: missing radio-ulna

absent coeliaco-mesenteric artery
type: Class
subclass of: abnormal coeliaco-mesenteric artery
subclass of: absent artery
definition: Absence of coeliaco-mesenteric artery.
has_exact_synonym: missing coeliaco-mesenteric artery

absent zeugopod
type: Class
subclass of: abnormal zeugopod
subclass of: absent limb segment
definition: Absence of zeugopod.
has_exact_synonym: missing zeugopod

absent muscular system
type: Class
subclass of: abnormal muscular system
subclass of: absent anatomical system
definition: Absence of muscular system.
has_exact_synonym: missing muscular system

absent elastica externa
type: Class
subclass of: abnormal elastica externa
subclass of: absent tissue
definition: Absence of elastica externa.
has_exact_synonym: missing elastica externa

absent subclavian vein
type: Class
subclass of: abnormal subclavian vein
subclass of: absent vein
definition: Absence of subclavian vein.
has_exact_synonym: missing subclavian vein

absent tail somite
type: Class
subclass of: abnormal tail somite
subclass of: absent somite
definition: Absence of tail somite.
has_exact_synonym: missing tail somite

absent epithelial cell
type: Class
subclass of: abnormal epithelial cell
subclass of: absent cell
definition: Absence of epithelial cell.
has_exact_synonym: missing epithelial cell

absent foregut endoderm
type: Class
subclass of: abnormal foregut endoderm
subclass of: absent primordium
definition: Absence of foregut endoderm.
has_exact_synonym: missing foregut endoderm

absent archenteron
type: Class
subclass of: abnormal archenteron
subclass of: absent anatomical space
definition: Absence of archenteron.
has_exact_synonym: missing archenteron

absent limb bud
type: Class
subclass of: abnormal limb bud
subclass of: absent surface structure
definition: Absence of limb bud.
has_exact_synonym: missing limb bud

absent larval immune system
type: Class
subclass of: abnormal larval immune system
subclass of: absent immune system
definition: Absence of larval immune system.
has_exact_synonym: missing larval immune system

absent immune system
type: Class
subclass of: abnormal immune system
subclass of: absent anatomical system
definition: Absence of immune system.
has_exact_synonym: missing immune system

absent dental epithelium
type: Class
subclass of: abnormal dental epithelium
subclass of: absent epithelium
definition: Absence of dental epithelium.
has_exact_synonym: missing dental epithelium

absent epithelium
type: Class
subclass of: abnormal epithelium
subclass of: absent tissue
definition: Absence of epithelium.
has_exact_synonym: missing epithelium

absent sclerotome of trunk somite 5
type: Class
subclass of: abnormal sclerotome of trunk somite 5
subclass of: absent sclerotome
definition: Absence of sclerotome of trunk somite 5.
has_exact_synonym: missing sclerotome of trunk somite 5

absent m. transversus anterior primordium
type: Class
subclass of: abnormal m. transversus anterior primordium
subclass of: absent cranial muscle primordium
definition: Absence of m. transversus anterior primordium.
has_exact_synonym: missing m. transversus anterior primordium

absent epidermis inner layer
type: Class
subclass of: abnormal epidermis inner layer
subclass of: absent tissue
definition: Absence of epidermis inner layer.
has_exact_synonym: missing epidermis inner layer

absent mesenchymal stem cell
type: Class
subclass of: abnormal mesenchymal stem cell
subclass of: absent stem cell
definition: Absence of mesenchymal stem cell.
has_exact_synonym: missing mesenchymal stem cell

absent paracrine cell
type: Class
subclass of: abnormal paracrine cell
subclass of: absent cell
definition: Absence of paracrine cell.
has_exact_synonym: missing paracrine cell

absent horizontal cell
type: Class
subclass of: abnormal horizontal cell
subclass of: absent neuron
definition: Absence of horizontal cell.
has_exact_synonym: missing horizontal cell

absent cardiac atrium
type: Class
subclass of: abnormal cardiac atrium
subclass of: absent cavitated compound organ
definition: Absence of cardiac atrium.
has_exact_synonym: missing cardiac atrium

absent skeletal muscle satellite cell
type: Class
subclass of: abnormal skeletal muscle satellite cell
subclass of: absent cell
definition: Absence of skeletal muscle satellite cell.
has_exact_synonym: missing skeletal muscle satellite cell

absent process
type: Class
subclass of: abnormal process
subclass of: absent anatomical structure
definition: Absence of process.
has_exact_synonym: missing process

absent m. levator mandibulae longus internus primordium
type: Class
subclass of: abnormal m. levator mandibulae longus internus primordium
subclass of: absent cranial muscle primordium
definition: Absence of m. levator mandibulae longus internus primordium.
has_exact_synonym: missing m. levator mandibulae longus internus primordium

absent m. dilatator laryngis primordium
type: Class
subclass of: abnormal m. dilatator laryngis primordium
subclass of: absent cranial muscle primordium
definition: Absence of m. dilatator laryngis primordium.
has_exact_synonym: missing m. dilatator laryngis primordium

absent vegetal yolk mass
type: Class
subclass of: abnormal vegetal yolk mass
subclass of: absent embryonic structure
definition: Absence of vegetal yolk mass.
has_exact_synonym: missing vegetal yolk mass

absent preplacodal ectoderm
type: Class
subclass of: abnormal preplacodal ectoderm
subclass of: absent tissue
definition: Absence of preplacodal ectoderm.
has_exact_synonym: missing preplacodal ectoderm

absent cranial placode
type: Class
subclass of: abnormal cranial placode
subclass of: absent embryonic structure
definition: Absence of cranial placode.
has_exact_synonym: missing cranial placode

absent anterior neural ridge
type: Class
subclass of: abnormal anterior neural ridge
subclass of: absent tissue
definition: Absence of anterior neural ridge.
has_exact_synonym: missing anterior neural ridge

absent sensorial layer
type: Class
subclass of: abnormal sensorial layer
subclass of: absent tissue
definition: Absence of sensorial layer.
has_exact_synonym: missing sensorial layer

absent nucleus reticularis inferior
type: Class
subclass of: abnormal nucleus reticularis inferior
subclass of: absent neural nucleus
definition: Absence of nucleus reticularis inferior.
has_exact_synonym: missing nucleus reticularis inferior

absent tail somite 17
type: Class
subclass of: abnormal tail somite 17
subclass of: absent tail somite
definition: Absence of tail somite 17.
has_exact_synonym: missing tail somite 17

absent musculoabdominal vein
type: Class
subclass of: abnormal musculoabdominal vein
subclass of: absent vein
definition: Absence of musculoabdominal vein.
has_exact_synonym: missing musculoabdominal vein

absent tail somite 14
type: Class
subclass of: abnormal tail somite 14
subclass of: absent tail somite
definition: Absence of tail somite 14.
has_exact_synonym: missing tail somite 14

absent medium cavity
type: Class
subclass of: abnormal medium cavity
subclass of: absent anatomical space
definition: Absence of medium cavity.
has_exact_synonym: missing medium cavity

absent blood
type: Class
subclass of: abnormal blood
subclass of: XPO_0125466
definition: Absence of blood.
has_exact_synonym: missing blood

absent internal carotid artery
type: Class
subclass of: abnormal internal carotid artery
subclass of: absent artery
definition: Absence of internal carotid artery.
has_exact_synonym: missing internal carotid artery

absent mm. levator arcuum branchialium II primordium
type: Class
subclass of: abnormal mm. levator arcuum branchialium II primordium
subclass of: absent cranial muscle primordium
definition: Absence of mm. levator arcuum branchialium II primordium.
has_exact_synonym: missing mm. levator arcuum branchialium II primordium

absent intersomitic epithelium
type: Class
subclass of: abnormal intersomitic epithelium
subclass of: absent epithelium
definition: Absence of intersomitic epithelium.
has_exact_synonym: missing intersomitic epithelium

absent male genitalia
type: Class
subclass of: abnormal male genitalia
subclass of: absent genital system
definition: Absence of male genitalia.
has_exact_synonym: missing male genitalia

absent genital system
type: Class
subclass of: abnormal genital system
subclass of: absent anatomical system
definition: Absence of genital system.
has_exact_synonym: missing genital system

absent ventral abdominal vein
type: Class
subclass of: abnormal ventral abdominal vein
subclass of: absent vein
definition: Absence of ventral abdominal vein.
has_exact_synonym: missing ventral abdominal vein

absent trunk somite 11
type: Class
subclass of: abnormal trunk somite 11
subclass of: absent trunk somite
definition: Absence of trunk somite 11.
has_exact_synonym: missing trunk somite 11

absent neural plate border
type: Class
subclass of: abnormal neural plate border
subclass of: absent tissue
definition: Absence of neural plate border.
has_exact_synonym: missing neural plate border

absent vascular endothelium
type: Class
subclass of: abnormal vascular endothelium
subclass of: absent simple squamous epithelium
definition: Absence of vascular endothelium.
has_exact_synonym: missing vascular endothelium

absent ventral trunk
type: Class
subclass of: abnormal ventral trunk
subclass of: absent organism subdivision
definition: Absence of ventral trunk.
has_exact_synonym: missing ventral trunk

absent anterior ventral blood island
type: Class
subclass of: abnormal anterior ventral blood island
subclass of: absent tissue
definition: Absence of anterior ventral blood island.
has_exact_synonym: missing anterior ventral blood island

absent dentine
type: Class
subclass of: abnormal dentine
subclass of: absent odontoid tissue
definition: Absence of dentine.
has_exact_synonym: missing dentine

absent odontoid tissue
type: Class
subclass of: abnormal odontoid tissue
subclass of: absent skeletal tissue
definition: Absence of odontoid tissue.
has_exact_synonym: missing odontoid tissue

absent lateral line system
type: Class
subclass of: abnormal lateral line system
subclass of: absent sensory system
definition: Absence of lateral line system.
has_exact_synonym: missing lateral line system

absent duct of Cuvier
type: Class
subclass of: abnormal duct of Cuvier
subclass of: absent vein
definition: Absence of duct of Cuvier.
has_exact_synonym: missing duct of Cuvier

absent forelimb stylopod
type: Class
subclass of: abnormal forelimb stylopod
subclass of: absent stylopod
definition: Absence of forelimb stylopod.
has_exact_synonym: missing forelimb stylopod

absent stylopod
type: Class
subclass of: abnormal stylopod
subclass of: absent limb segment
definition: Absence of stylopod.
has_exact_synonym: missing stylopod

absent astrocyte
type: Class
subclass of: abnormal astrocyte
subclass of: absent glial cell
definition: Absence of astrocyte.
has_exact_synonym: missing astrocyte

absent head mesoderm
type: Class
subclass of: abnormal head mesoderm
subclass of: absent tissue
definition: Absence of head mesoderm.
has_exact_synonym: missing head mesoderm

absent ventral tail fin
type: Class
subclass of: abnormal ventral tail fin
subclass of: absent fin
definition: Absence of ventral tail fin.
has_exact_synonym: missing ventral tail fin

absent retina
type: Class
subclass of: abnormal retina
subclass of: absent multi-tissue structure
definition: Absence of retina.
has_exact_synonym: missing retina

absent cutaneous magnus
type: Class
subclass of: abnormal cutaneous magnus
subclass of: absent vein
definition: Absence of cutaneous magnus.
has_exact_synonym: missing cutaneous magnus

absent branchial arch skeleton 1
type: Class
subclass of: abnormal branchial arch skeleton 1
subclass of: absent branchial arch skeleton
definition: Absence of branchial arch skeleton 1.
has_exact_synonym: missing branchial arch skeleton 1

absent branchial arch skeleton
type: Class
subclass of: abnormal branchial arch skeleton
subclass of: absent skeletal subdivision
definition: Absence of branchial arch skeleton.
has_exact_synonym: missing branchial arch skeleton

absent exocrine cell
type: Class
subclass of: abnormal exocrine cell
subclass of: absent cell
definition: Absence of exocrine cell.
has_exact_synonym: missing exocrine cell

absent stomodeal-hypophyseal primordium
type: Class
subclass of: abnormal stomodeal-hypophyseal primordium
subclass of: absent primordium
definition: Absence of stomodeal-hypophyseal primordium.
has_exact_synonym: missing stomodeal-hypophyseal primordium

absent spinal neuron
type: Class
subclass of: abnormal spinal neuron
subclass of: absent neuron
definition: Absence of spinal neuron.
has_exact_synonym: missing spinal neuron

absent dorsal marginal zone
type: Class
subclass of: abnormal dorsal marginal zone
subclass of: absent marginal zone
definition: Absence of dorsal marginal zone.
has_exact_synonym: missing dorsal marginal zone

absent vertebral centrum
type: Class
subclass of: abnormal vertebral centrum
subclass of: absent skeletal element
definition: Absence of vertebral centrum.
has_exact_synonym: missing vertebral centrum

absent musculoskeletal system
type: Class
subclass of: abnormal musculoskeletal system
subclass of: absent anatomical system
definition: Absence of musculoskeletal system.
has_exact_synonym: missing musculoskeletal system

absent craniofacial skeleton
type: Class
subclass of: abnormal craniofacial skeleton
subclass of: absent cranial skeleton
definition: Absence of craniofacial skeleton.
has_exact_synonym: missing craniofacial skeleton

absent ethmoid region
type: Class
subclass of: abnormal ethmoid region
subclass of: absent anatomical cluster
definition: Absence of ethmoid region.
has_exact_synonym: missing ethmoid region

absent caudal vertebra
type: Class
subclass of: abnormal caudal vertebra
subclass of: absent vertebra
definition: Absence of caudal vertebra.
has_exact_synonym: missing caudal vertebra

absent visceral pouch 3
type: Class
subclass of: abnormal visceral pouch 3
subclass of: absent visceral pouch
definition: Absence of visceral pouch 3.
has_exact_synonym: missing visceral pouch 3

absent mandibular crest
type: Class
subclass of: abnormal mandibular crest
subclass of: absent tissue
definition: Absence of mandibular crest.
has_exact_synonym: missing mandibular crest

absent posteroventral tegmental nucleus
type: Class
subclass of: abnormal posteroventral tegmental nucleus
subclass of: absent neural nucleus
definition: Absence of posteroventral tegmental nucleus.
has_exact_synonym: missing posteroventral tegmental nucleus

absent dorsal longitudinal anastomosing vessel
type: Class
subclass of: abnormal dorsal longitudinal anastomosing vessel
subclass of: absent blood vessel
definition: Absence of dorsal longitudinal anastomosing vessel.
has_exact_synonym: missing dorsal longitudinal anastomosing vessel

absent spermatozoon
type: Class
subclass of: abnormal spermatozoon
subclass of: absent gamete
definition: Absence of spermatozoon.
has_exact_synonym: missing spermatozoon

absent gamete
type: Class
subclass of: abnormal gamete
subclass of: absent germ cell
definition: Absence of gamete.
has_exact_synonym: missing gamete

absent cartilage tissue
type: Class
subclass of: abnormal cartilage tissue
subclass of: absent skeletal tissue
definition: Absence of cartilage tissue.
has_exact_synonym: missing cartilage tissue

absent skeletal tissue
type: Class
subclass of: abnormal skeletal tissue
subclass of: absent connective tissue
definition: Absence of skeletal tissue.
has_exact_synonym: missing skeletal tissue

absent prepollex
type: Class
subclass of: abnormal prepollex
subclass of: absent cartilage element
definition: Absence of prepollex.
has_exact_synonym: missing prepollex

absent spiracle
type: Class
subclass of: abnormal spiracle
subclass of: absent surface structure
definition: Absence of spiracle.
has_exact_synonym: missing spiracle

absent tendon
type: Class
subclass of: abnormal tendon
subclass of: absent dense regular connective tissue
definition: Absence of tendon.
has_exact_synonym: missing tendon

absent dense regular connective tissue
type: Class
subclass of: abnormal dense regular connective tissue
subclass of: absent connective tissue
definition: Absence of dense regular connective tissue.
has_exact_synonym: missing dense regular connective tissue

absent myotome of trunk somite 8
type: Class
subclass of: abnormal myotome of trunk somite 8
subclass of: absent myotome
definition: Absence of myotome of trunk somite 8.
has_exact_synonym: missing myotome of trunk somite 8

absent auditory tube
type: Class
subclass of: abnormal auditory tube
subclass of: absent multi-tissue structure
definition: Absence of auditory tube.
has_exact_synonym: missing auditory tube

absent pylorus
type: Class
subclass of: abnormal pylorus
subclass of: absent multi-tissue structure
definition: Absence of pylorus.
has_exact_synonym: missing pylorus

absent intermediate mesoderm
type: Class
subclass of: abnormal intermediate mesoderm
subclass of: absent tissue
definition: Absence of intermediate mesoderm.
has_exact_synonym: missing intermediate mesoderm

absent cardiovascular system
type: Class
subclass of: abnormal cardiovascular system
subclass of: absent anatomical system
definition: Absence of cardiovascular system.
has_exact_synonym: missing cardiovascular system

obsolete absent zygote cortex
type: Class
deprecated: true

absent motor neuron
type: Class
subclass of: abnormal motor neuron
subclass of: absent neuron
definition: Absence of motor neuron.
has_exact_synonym: missing motor neuron

absent gall bladder primordium
type: Class
subclass of: abnormal gall bladder primordium
subclass of: absent primordium
definition: Absence of gall bladder primordium.
has_exact_synonym: missing gall bladder primordium

absent endocrine system
type: Class
subclass of: abnormal endocrine system
subclass of: absent anatomical system
definition: Absence of endocrine system.
has_exact_synonym: missing endocrine system

absent central amygdala
type: Class
subclass of: abnormal central amygdala
subclass of: absent neural nucleus
definition: Absence of central amygdala.
has_exact_synonym: missing central amygdala

absent trunk musculature
type: Class
subclass of: abnormal trunk musculature
subclass of: absent anatomical cluster
definition: Absence of trunk musculature.
has_exact_synonym: missing trunk musculature

absent trigeminal nerve
type: Class
subclass of: abnormal trigeminal nerve
subclass of: absent cranial nerve
definition: Absence of trigeminal nerve.
has_exact_synonym: missing trigeminal nerve

absent cranial nerve
type: Class
subclass of: abnormal cranial nerve
subclass of: XPO_0131498
definition: Absence of cranial nerve.
has_exact_synonym: missing cranial nerve

absent skin
type: Class
subclass of: abnormal skin
subclass of: absent surface structure
definition: Absence of skin.
has_exact_synonym: missing skin

absent lens
type: Class
subclass of: abnormal lens
subclass of: absent multi-tissue structure
definition: Absence of lens.
has_exact_synonym: missing lens

absent spleen
type: Class
subclass of: abnormal spleen
subclass of: absent compound organ
subclass of: absent viscus
definition: Absence of spleen.
has_exact_synonym: missing spleen

absent pharyngeal region
type: Class
subclass of: abnormal pharyngeal region
subclass of: absent anatomical region
definition: Absence of pharyngeal region.
has_exact_synonym: missing pharyngeal region

absent epibranchial placode
type: Class
subclass of: abnormal epibranchial placode
subclass of: absent neurogenic placode
definition: Absence of epibranchial placode.
has_exact_synonym: missing epibranchial placode

absent germ plasm
type: Class
subclass of: abnormal germ plasm
subclass of: absent cell part
definition: Absence of germ plasm.
has_exact_synonym: missing germ plasm

absent cranial skeleton
type: Class
subclass of: abnormal cranial skeleton
subclass of: absent skeletal subdivision
definition: Absence of cranial skeleton.
has_exact_synonym: missing cranial skeleton

absent cranial neural crest
type: Class
subclass of: abnormal cranial neural crest
subclass of: absent tissue
definition: Absence of cranial neural crest.
has_exact_synonym: missing cranial neural crest

absent hyomandibular lateral line
type: Class
subclass of: abnormal hyomandibular lateral line
subclass of: absent lateral line
definition: Absence of hyomandibular lateral line.
has_exact_synonym: missing hyomandibular lateral line

absent mesencephalic vein
type: Class
subclass of: abnormal mesencephalic vein
subclass of: absent vein
definition: Absence of mesencephalic vein.
has_exact_synonym: missing mesencephalic vein

absent amputated tissue
type: Class
subclass of: abnormal amputated tissue
subclass of: absent tissue
definition: Absence of amputated tissue.
has_exact_synonym: missing amputated tissue

absent mineralized bone tissue
type: Class
subclass of: abnormal mineralized bone tissue
subclass of: absent bone tissue
subclass of: absent mineralized tissue
definition: Absence of mineralized bone tissue.
has_exact_synonym: missing mineralized bone tissue

absent mineralized tissue
type: Class
subclass of: abnormal mineralized tissue
subclass of: absent skeletal tissue
definition: Absence of mineralized tissue.
has_exact_synonym: missing mineralized tissue

absent blastomere D1.2
type: Class
subclass of: abnormal blastomere D1.2
subclass of: absent dorsal animal hemisphere blastomere
definition: Absence of blastomere D1.2.
has_exact_synonym: missing blastomere D1.2

absent animal blastomere
type: Class
subclass of: abnormal animal blastomere
subclass of: absent blastomere
definition: Absence of animal blastomere.
has_exact_synonym: missing animal blastomere

absent m. rectus inferior primordium
type: Class
subclass of: abnormal m. rectus inferior primordium
subclass of: absent cranial muscle primordium
definition: Absence of m. rectus inferior primordium.
has_exact_synonym: missing m. rectus inferior primordium

absent neuroendocrine cell
type: Class
subclass of: abnormal neuroendocrine cell
subclass of: absent endocrine cell
definition: Absence of neuroendocrine cell.
has_exact_synonym: missing neuroendocrine cell

absent intestine
type: Class
subclass of: abnormal intestine
subclass of: absent cavitated compound organ
subclass of: absent viscus
definition: Absence of intestine.
has_exact_synonym: missing intestine

absent midgut
type: Class
subclass of: abnormal midgut
subclass of: absent embryonic structure
definition: Absence of midgut.
has_exact_synonym: missing midgut

absent skeleton
type: Class
subclass of: abnormal skeleton
subclass of: absent anatomical cluster
definition: Absence of skeleton.
has_exact_synonym: missing skeleton

absent trunk somite 6
type: Class
subclass of: abnormal trunk somite 6
subclass of: absent trunk somite
definition: Absence of trunk somite 6.
has_exact_synonym: missing trunk somite 6

absent hyoid arch skeleton
type: Class
subclass of: abnormal hyoid arch skeleton
subclass of: absent skeletal subdivision
definition: Absence of hyoid arch skeleton.
has_exact_synonym: missing hyoid arch skeleton

absent right channel of ventral aorta
type: Class
subclass of: abnormal right channel of ventral aorta
subclass of: absent artery
definition: Absence of right channel of ventral aorta.
has_exact_synonym: missing right channel of ventral aorta

absent pars distalis
type: Class
subclass of: abnormal pars distalis
subclass of: absent multi-tissue structure
definition: Absence of pars distalis.
has_exact_synonym: missing pars distalis

absent delta cell
type: Class
subclass of: abnormal delta cell
subclass of: absent enteroendocrine cell
definition: Absence of delta cell.
has_exact_synonym: missing delta cell

absent dorsal funiculus
type: Class
subclass of: abnormal dorsal funiculus
subclass of: absent anatomical cluster
definition: Absence of dorsal funiculus.
has_exact_synonym: missing dorsal funiculus

absent chordal neural plate border
type: Class
subclass of: abnormal chordal neural plate border
subclass of: absent tissue
definition: Absence of chordal neural plate border.
has_exact_synonym: missing chordal neural plate border

absent mesonephric early proximal tubule
type: Class
subclass of: abnormal mesonephric early proximal tubule
subclass of: absent mesonephric tubule
definition: Absence of mesonephric early proximal tubule.
has_exact_synonym: missing mesonephric early proximal tubule

absent cerebral vein
type: Class
subclass of: abnormal cerebral vein
subclass of: absent vein
definition: Absence of cerebral vein.
has_exact_synonym: missing cerebral vein

absent appendicular skeleton
type: Class
subclass of: abnormal appendicular skeleton
subclass of: absent skeletal subdivision
definition: Absence of appendicular skeleton.
has_exact_synonym: missing appendicular skeleton

absent pelvic girdle primordium
type: Class
subclass of: abnormal pelvic girdle primordium
subclass of: absent multi-tissue structure
definition: Absence of pelvic girdle primordium.
has_exact_synonym: missing pelvic girdle primordium

absent vegetal blastomere
type: Class
subclass of: abnormal vegetal blastomere
subclass of: absent blastomere
definition: Absence of vegetal blastomere.
has_exact_synonym: missing vegetal blastomere

absent posterior placodal area
type: Class
subclass of: abnormal posterior placodal area
subclass of: absent tissue
definition: Absence of posterior placodal area.
has_exact_synonym: missing posterior placodal area

absent mm. constrictores branchiales III primordium
type: Class
subclass of: abnormal mm. constrictores branchiales III primordium
subclass of: absent cranial muscle primordium
definition: Absence of mm. constrictores branchiales III primordium.
has_exact_synonym: missing mm. constrictores branchiales III primordium

absent occipitovertebral artery
type: Class
subclass of: abnormal occipitovertebral artery
subclass of: absent artery
definition: Absence of occipitovertebral artery.
has_exact_synonym: missing occipitovertebral artery

absent pharynx
type: Class
subclass of: abnormal pharynx
subclass of: absent multi-tissue structure
definition: Absence of pharynx.
has_exact_synonym: missing pharynx

absent ureter
type: Class
subclass of: abnormal ureter
subclass of: absent multi-tissue structure
definition: Absence of ureter.
has_exact_synonym: missing ureter

absent pallium
type: Class
subclass of: abnormal pallium
subclass of: absent multi-tissue structure
definition: Absence of pallium.
has_exact_synonym: missing pallium

absent axial region
type: Class
subclass of: abnormal axial region
subclass of: absent anatomical region
definition: Absence of axial region.
has_exact_synonym: missing axial region

absent ventral vegetal hemisphere blastomere
type: Class
subclass of: abnormal ventral vegetal hemisphere blastomere
subclass of: absent vegetal blastomere
definition: Absence of ventral vegetal hemisphere blastomere.
has_exact_synonym: missing ventral vegetal hemisphere blastomere

absent blastomere V2
type: Class
subclass of: abnormal blastomere V2
subclass of: absent blastomere
definition: Absence of blastomere V2.
has_exact_synonym: missing blastomere V2

absent granule cell
type: Class
subclass of: abnormal granule cell
subclass of: absent interneuron
definition: Absence of granule cell.
has_exact_synonym: missing granule cell

absent ciliary body
type: Class
subclass of: abnormal ciliary body
subclass of: absent tissue
definition: Absence of ciliary body.
has_exact_synonym: missing ciliary body

absent vestibulocochlear nerve
type: Class
subclass of: abnormal vestibulocochlear nerve
subclass of: absent cranial nerve
definition: Absence of vestibulocochlear nerve.
has_exact_synonym: missing vestibulocochlear nerve

absent proximal tubule
type: Class
subclass of: abnormal proximal tubule
subclass of: absent tissue
definition: Absence of proximal tubule.
has_exact_synonym: missing proximal tubule

absent mm. levator arcuum branchialium IV primordium
type: Class
subclass of: abnormal mm. levator arcuum branchialium IV primordium
subclass of: absent cranial muscle primordium
definition: Absence of mm. levator arcuum branchialium IV primordium.
has_exact_synonym: missing mm. levator arcuum branchialium IV primordium

absent adenohypophyseal placode
type: Class
subclass of: abnormal adenohypophyseal placode
subclass of: XPO_0131518
definition: Absence of adenohypophyseal placode.
has_exact_synonym: missing adenohypophyseal placode

absent trunk somite 1
type: Class
subclass of: abnormal trunk somite 1
subclass of: absent trunk somite
definition: Absence of trunk somite 1.
has_exact_synonym: missing trunk somite 1

absent choana
type: Class
subclass of: abnormal choana
subclass of: absent anatomical space
definition: Absence of choana.
has_exact_synonym: missing choana

absent odontode tissue
type: Class
subclass of: abnormal odontode tissue
subclass of: absent odontoid tissue
definition: Absence of odontode tissue.
has_exact_synonym: missing odontode tissue

absent left lymph heart
type: Class
subclass of: abnormal left lymph heart
subclass of: absent cavitated compound organ
definition: Absence of left lymph heart.
has_exact_synonym: missing left lymph heart

absent blastomere D1
type: Class
subclass of: abnormal blastomere D1
subclass of: absent blastomere
definition: Absence of blastomere D1.
has_exact_synonym: missing blastomere D1

absent aortic arch 5
type: Class
subclass of: abnormal aortic arch 5
subclass of: absent aortic arch
definition: Absence of aortic arch 5.
has_exact_synonym: missing aortic arch 5

absent aortic arch
type: Class
subclass of: abnormal aortic arch
subclass of: absent artery
definition: Absence of aortic arch.
has_exact_synonym: missing aortic arch

absent diencephalon
type: Class
subclass of: abnormal diencephalon
subclass of: absent multi-tissue structure
definition: Absence of diencephalon.
has_exact_synonym: missing diencephalon

absent hindlimb skeleton
type: Class
subclass of: abnormal hindlimb skeleton
subclass of: absent skeletal subdivision
definition: Absence of hindlimb skeleton.
has_exact_synonym: missing hindlimb skeleton

absent basal forebrain
type: Class
subclass of: abnormal basal forebrain
subclass of: absent multi-tissue structure
definition: Absence of basal forebrain.
has_exact_synonym: missing basal forebrain

absent trunk somite 7
type: Class
subclass of: abnormal trunk somite 7
subclass of: absent trunk somite
definition: Absence of trunk somite 7.
has_exact_synonym: missing trunk somite 7

absent amputated limb
type: Class
subclass of: abnormal amputated limb
subclass of: absent amputated tissue
definition: Absence of amputated limb.
has_exact_synonym: missing amputated limb

absent forelimb digit
type: Class
subclass of: abnormal number of forelimb digits
subclass of: absent digit
definition: Absence of forelimb digit.
has_exact_synonym: missing forelimb digit

absent mesonephric kidney
type: Class
subclass of: abnormal mesonephric kidney
subclass of: absent adult kidney
definition: Absence of mesonephric kidney.
has_exact_synonym: missing mesonephric kidney

absent adult kidney
type: Class
subclass of: abnormal adult kidney
subclass of: absent kidney
definition: Absence of adult kidney.
has_exact_synonym: missing adult kidney

absent vertebral column
type: Class
subclass of: abnormal vertebral column
subclass of: absent skeletal subdivision
definition: Absence of vertebral column.
has_exact_synonym: missing vertebral column

absent nervous system
type: Class
subclass of: abnormal nervous system
subclass of: absent anatomical system
definition: Absence of nervous system.
has_exact_synonym: missing nervous system

absent nucleus accumbens
type: Class
subclass of: abnormal nucleus accumbens
subclass of: absent neural nucleus
definition: Absence of nucleus accumbens.
has_exact_synonym: missing nucleus accumbens

absent dermal bone
type: Class
subclass of: abnormal dermal bone
subclass of: absent membrane bone
definition: Absence of dermal bone.
has_exact_synonym: missing dermal bone

absent membrane bone
type: Class
subclass of: abnormal membrane bone
subclass of: absent bone element
definition: Absence of membrane bone.
has_exact_synonym: missing membrane bone

absent neural fold
type: Class
subclass of: abnormal neural fold
subclass of: absent tissue
definition: Absence of neural fold.
has_exact_synonym: missing neural fold

absent chordal neural plate
type: Class
subclass of: abnormal chordal neural plate
subclass of: absent tissue
definition: Absence of chordal neural plate.
has_exact_synonym: missing chordal neural plate

absent basilar papilla
type: Class
subclass of: abnormal basilar papilla
subclass of: absent tissue
definition: Absence of basilar papilla.
has_exact_synonym: missing basilar papilla

absent vestibuloauditory system
type: Class
subclass of: abnormal vestibuloauditory system
subclass of: absent sensory system
definition: Absence of vestibuloauditory system.
has_exact_synonym: missing vestibuloauditory system

absent cement gland primordium
type: Class
subclass of: abnormal cement gland primordium
subclass of: absent primordium
definition: Absence of cement gland primordium.
has_exact_synonym: missing cement gland primordium

absent m. rectus abdominis
type: Class
subclass of: abnormal m. rectus abdominis
subclass of: absent muscle
definition: Absence of m. rectus abdominis.
has_exact_synonym: missing m. rectus abdominis

absent musculature of face
type: Class
subclass of: abnormal musculature of face
subclass of: absent muscle
definition: Absence of musculature of face.
has_exact_synonym: missing musculature of face

absent processus lateralis hyalis
type: Class
subclass of: abnormal processus lateralis hyalis
subclass of: absent cartilage element
definition: Absence of processus lateralis hyalis.
has_exact_synonym: missing processus lateralis hyalis

absent primary oogonium
type: Class
subclass of: abnormal primary oogonium
subclass of: absent germ cell
definition: Absence of primary oogonium.
has_exact_synonym: missing primary oogonium

absent hyoid crest
type: Class
subclass of: abnormal hyoid crest
subclass of: absent tissue
definition: Absence of hyoid crest.
has_exact_synonym: missing hyoid crest

absent glomerular layer of the olfactory bulb
type: Class
subclass of: abnormal glomerular layer of the olfactory bulb
subclass of: absent tissue
definition: Absence of glomerular layer of the olfactory bulb.
has_exact_synonym: missing glomerular layer of the olfactory bulb

absent head somite 4
type: Class
subclass of: abnormal head somite 4
subclass of: absent head somite
definition: Absence of head somite 4.
has_exact_synonym: missing head somite 4

absent postmigratory neural crest cell
type: Class
subclass of: abnormal postmigratory neural crest cell
subclass of: absent cell
definition: Absence of postmigratory neural crest cell.
has_exact_synonym: missing postmigratory neural crest cell

absent forebrain
type: Class
subclass of: abnormal forebrain
subclass of: absent multi-tissue structure
definition: Absence of forebrain.
has_exact_synonym: missing forebrain

absent blastomere V2.2
type: Class
subclass of: abnormal blastomere V2.2
subclass of: absent ventral vegetal hemisphere blastomere
definition: Absence of blastomere V2.2.
has_exact_synonym: missing blastomere V2.2

absent trunk somite 5
type: Class
subclass of: abnormal trunk somite 5
subclass of: absent trunk somite
definition: Absence of trunk somite 5.
has_exact_synonym: missing trunk somite 5

absent lymphocyte
type: Class
subclass of: abnormal lymphocyte
subclass of: absent cell
definition: Absence of lymphocyte.
has_exact_synonym: missing lymphocyte

absent thymocyte
type: Class
subclass of: abnormal thymocyte
subclass of: absent lymphocyte
definition: Absence of thymocyte.
has_exact_synonym: missing thymocyte

absent eye photoreceptor cell
type: Class
subclass of: abnormal eye photoreceptor cell
subclass of: absent cell
definition: Absence of eye photoreceptor cell.
has_exact_synonym: missing eye photoreceptor cell

absent retinal ganglion cell
type: Class
subclass of: abnormal retinal ganglion cell
subclass of: absent neuron
definition: Absence of retinal ganglion cell.
has_exact_synonym: missing retinal ganglion cell

absent blastomere D2.1.1
type: Class
subclass of: abnormal blastomere D2.1.1
subclass of: absent dorsal vegetal hemisphere blastomere
definition: Absence of blastomere D2.1.1.
has_exact_synonym: missing blastomere D2.1.1

absent dorsal vegetal hemisphere blastomere
type: Class
subclass of: abnormal dorsal vegetal hemisphere blastomere
subclass of: absent vegetal blastomere
definition: Absence of dorsal vegetal hemisphere blastomere.
has_exact_synonym: missing dorsal vegetal hemisphere blastomere

absent trunk somite 4
type: Class
subclass of: abnormal trunk somite 4
subclass of: absent trunk somite
definition: Absence of trunk somite 4.
has_exact_synonym: missing trunk somite 4

absent posterior crista
type: Class
subclass of: abnormal posterior crista
subclass of: absent sensory epithelial cell
definition: Absence of posterior crista.
has_exact_synonym: missing posterior crista

absent sensory epithelial cell
type: Class
subclass of: abnormal sensory epithelial cell
subclass of: absent epithelial cell
definition: Absence of sensory epithelial cell.
has_exact_synonym: missing sensory epithelial cell

absent involuted ventral mesoderm
type: Class
subclass of: abnormal involuted ventral mesoderm
subclass of: absent tissue
definition: Absence of involuted ventral mesoderm.
has_exact_synonym: missing involuted ventral mesoderm

absent trunk somite 12
type: Class
subclass of: abnormal trunk somite 12
subclass of: absent trunk somite
definition: Absence of trunk somite 12.
has_exact_synonym: missing trunk somite 12

absent hypophysis
type: Class
subclass of: abnormal hypophysis
subclass of: absent multi-tissue structure
definition: Absence of hypophysis.
has_exact_synonym: missing hypophysis

absent unilaminar epithelium
type: Class
subclass of: abnormal unilaminar epithelium
subclass of: absent epithelium
definition: Absence of unilaminar epithelium.
has_exact_synonym: missing unilaminar epithelium

absent left-dorsal blastomere
type: Class
subclass of: abnormal left-dorsal blastomere
subclass of: absent blastomere
definition: Absence of left-dorsal blastomere.
has_exact_synonym: missing left-dorsal blastomere

absent preoptic area
type: Class
subclass of: abnormal preoptic area
subclass of: absent multi-tissue structure
definition: Absence of preoptic area.
has_exact_synonym: missing preoptic area

absent pronephric nephron
type: Class
subclass of: abnormal pronephric nephron
subclass of: absent multi-tissue structure
definition: Absence of pronephric nephron.
has_exact_synonym: missing pronephric nephron

absent bone marrow
type: Class
subclass of: abnormal bone marrow
subclass of: absent tissue
definition: Absence of bone marrow.
has_exact_synonym: missing bone marrow

absent anterior semicircular canal
type: Class
subclass of: abnormal anterior semicircular canal
subclass of: absent semicircular canal
definition: Absence of anterior semicircular canal.
has_exact_synonym: missing anterior semicircular canal

absent semicircular canal
type: Class
subclass of: abnormal semicircular canal
subclass of: absent tissue
definition: Absence of semicircular canal.
has_exact_synonym: missing semicircular canal

absent subcommissural organ
type: Class
subclass of: abnormal subcommissural organ
subclass of: absent multi-tissue structure
definition: Absence of subcommissural organ.
has_exact_synonym: missing subcommissural organ

absent dorsal trunk
type: Class
subclass of: abnormal dorsal trunk
subclass of: absent organism subdivision
definition: Absence of dorsal trunk.
has_exact_synonym: missing dorsal trunk

absent fin vasculature
type: Class
subclass of: abnormal fin vasculature
subclass of: absent blood vessel
definition: Absence of fin vasculature.
has_exact_synonym: missing fin vasculature

absent interrenal vein
type: Class
subclass of: abnormal interrenal vein
subclass of: absent vein
definition: Absence of interrenal vein.
has_exact_synonym: missing interrenal vein

absent tail vasculature
type: Class
subclass of: abnormal tail vasculature
subclass of: absent blood vessel
definition: Absence of tail vasculature.
has_exact_synonym: missing tail vasculature

absent prosomere 6
type: Class
subclass of: abnormal prosomere 6
subclass of: absent prosomere
definition: Absence of prosomere 6.
has_exact_synonym: missing prosomere 6

absent prosomere
type: Class
subclass of: abnormal prosomere
subclass of: absent neuromere
definition: Absence of prosomere.
has_exact_synonym: missing prosomere

absent pineal gland
type: Class
subclass of: abnormal pineal gland
subclass of: absent multi-tissue structure
definition: Absence of pineal gland.
has_exact_synonym: missing pineal gland

absent auditory apparatus
type: Class
subclass of: abnormal auditory apparatus
subclass of: absent cavitated compound organ
definition: Absence of auditory apparatus.
has_exact_synonym: missing auditory apparatus

absent ventral blood island
type: Class
subclass of: abnormal ventral blood island
subclass of: absent tissue
definition: Absence of ventral blood island.
has_exact_synonym: missing ventral blood island

absent ventral mesoderm
type: Class
subclass of: abnormal ventral mesoderm
subclass of: absent embryonic structure
definition: Absence of ventral mesoderm.
has_exact_synonym: missing ventral mesoderm

absent trunk somite 3
type: Class
subclass of: abnormal trunk somite 3
subclass of: absent trunk somite
definition: Absence of trunk somite 3.
has_exact_synonym: missing trunk somite 3

absent processus anterior hyalis
type: Class
subclass of: abnormal processus anterior hyalis
subclass of: absent cartilage element
definition: Absence of processus anterior hyalis.
has_exact_synonym: missing processus anterior hyalis

absent anterior amygdala
type: Class
subclass of: abnormal anterior amygdala
subclass of: absent neural nucleus
definition: Absence of anterior amygdala.
has_exact_synonym: missing anterior amygdala

absent m. rectus superior primordium
type: Class
subclass of: abnormal m. rectus superior primordium
subclass of: absent cranial muscle primordium
definition: Absence of m. rectus superior primordium.
has_exact_synonym: missing m. rectus superior primordium

absent caudal vein
type: Class
subclass of: abnormal caudal vein
subclass of: absent vein
definition: Absence of caudal vein.
has_exact_synonym: missing caudal vein

absent gustatory system
type: Class
subclass of: abnormal gustatory system
subclass of: absent sensory system
definition: Absence of gustatory system.
has_exact_synonym: missing gustatory system

absent left blastomere
type: Class
subclass of: abnormal left blastomere
subclass of: absent blastomere
definition: Absence of left blastomere.
has_exact_synonym: missing left blastomere

absent epicardial precursor cell
type: Class
subclass of: abnormal epicardial precursor cell
subclass of: absent cell
definition: Absence of epicardial precursor cell.
has_exact_synonym: missing epicardial precursor cell

absent pre-dentine
type: Class
subclass of: abnormal pre-dentine
subclass of: absent odontoid tissue
definition: Absence of pre-dentine.
has_exact_synonym: missing pre-dentine

absent oligodendrocyte
type: Class
subclass of: abnormal oligodendrocyte
subclass of: absent glial cell
definition: Absence of oligodendrocyte.
has_exact_synonym: missing oligodendrocyte

absent mouth
type: Class
subclass of: abnormal mouth
subclass of: absent anatomical space
definition: Absence of mouth.
has_exact_synonym: missing mouth

absent oropharynx
type: Class
subclass of: abnormal oropharynx
subclass of: absent anatomical cluster
definition: Absence of oropharynx.
has_exact_synonym: missing oropharynx

absent colon
type: Class
subclass of: abnormal colon
subclass of: absent multi-tissue structure
definition: Absence of colon.
has_exact_synonym: missing colon

absent aortic arch 4
type: Class
subclass of: abnormal aortic arch 4
subclass of: absent aortic arch
definition: Absence of aortic arch 4.
has_exact_synonym: missing aortic arch 4

absent ventricular zone
type: Class
subclass of: abnormal ventricular zone
subclass of: absent anatomical region
definition: Absence of ventricular zone.
has_exact_synonym: missing ventricular zone

absent ossicle
type: Class
subclass of: abnormal ossicle
subclass of: absent skeletal element
definition: Absence of ossicle.
has_exact_synonym: missing ossicle

absent blastomere V2.1
type: Class
subclass of: abnormal blastomere V2.1
subclass of: absent ventral vegetal hemisphere blastomere
definition: Absence of blastomere V2.1.
has_exact_synonym: missing blastomere V2.1

absent lens placode
type: Class
subclass of: abnormal lens placode
subclass of: XPO_0131518
definition: Absence of lens placode.
has_exact_synonym: missing lens placode

absent retinal progenitor cell
type: Class
subclass of: abnormal retinal progenitor cell
subclass of: absent progenitor cell
definition: Absence of retinal progenitor cell.
has_exact_synonym: missing retinal progenitor cell

absent vitelline vein
type: Class
subclass of: abnormal vitelline vein
subclass of: absent vein
definition: Absence of vitelline vein.
has_exact_synonym: missing vitelline vein

absent female genitalia
type: Class
subclass of: abnormal female genitalia
subclass of: absent genital system
definition: Absence of female genitalia.
has_exact_synonym: missing female genitalia

absent retinal outer nuclear layer
type: Class
subclass of: abnormal retinal outer nuclear layer
subclass of: absent tissue
definition: Absence of retinal outer nuclear layer.
has_exact_synonym: missing retinal outer nuclear layer

absent peritoneum
type: Class
subclass of: abnormal peritoneum
subclass of: absent serous membrane
definition: Absence of peritoneum.
has_exact_synonym: missing peritoneum

absent serous membrane
type: Class
subclass of: abnormal serous membrane
subclass of: absent multi-tissue structure
definition: Absence of serous membrane.
has_exact_synonym: missing serous membrane

absent mineralized avascular GAG-rich matrix
type: Class
subclass of: abnormal mineralized avascular GAG-rich matrix
subclass of: absent avascular GAG-rich matrix
subclass of: absent mineralized extracellular matrix
definition: Absence of mineralized avascular GAG-rich matrix.
has_exact_synonym: missing mineralized avascular GAG-rich matrix

absent mineralized extracellular matrix
type: Class
subclass of: abnormal mineralized extracellular matrix
subclass of: absent proteinaceous extracellular matrix
definition: Absence of mineralized extracellular matrix.
has_exact_synonym: missing mineralized extracellular matrix

absent non-mineralized chondroid tissue
type: Class
subclass of: abnormal non-mineralized chondroid tissue
subclass of: absent skeletal tissue
definition: Absence of non-mineralized chondroid tissue.
has_exact_synonym: missing non-mineralized chondroid tissue

absent gut epithelium
type: Class
subclass of: abnormal gut epithelium
subclass of: absent epithelium
definition: Absence of gut epithelium.
has_exact_synonym: missing gut epithelium

absent m. transversus ventralis II primordium
type: Class
subclass of: abnormal m. transversus ventralis II primordium
subclass of: absent cranial muscle primordium
definition: Absence of m. transversus ventralis II primordium.
has_exact_synonym: missing m. transversus ventralis II primordium

absent blastomere D2.2
type: Class
subclass of: abnormal blastomere D2.2
subclass of: absent dorsal vegetal hemisphere blastomere
definition: Absence of blastomere D2.2.
has_exact_synonym: missing blastomere D2.2

absent appendicular ossicle
type: Class
subclass of: abnormal appendicular ossicle
subclass of: absent ossicle
definition: Absence of appendicular ossicle.
has_exact_synonym: missing appendicular ossicle

absent profundal placode
type: Class
subclass of: abnormal profundal placode
subclass of: absent neurogenic placode
definition: Absence of profundal placode.
has_exact_synonym: missing profundal placode

absent myocardium
type: Class
subclass of: abnormal myocardium
subclass of: absent muscle
definition: Absence of myocardium.
has_exact_synonym: missing myocardium

absent secondary oogonium
type: Class
subclass of: abnormal secondary oogonium
subclass of: absent germ cell
definition: Absence of secondary oogonium.
has_exact_synonym: missing secondary oogonium

absent testis
type: Class
subclass of: abnormal testis
subclass of: absent gonad
definition: Absence of testis.
has_exact_synonym: missing testis

absent m. dilatator laryngis
type: Class
subclass of: abnormal m. dilatator laryngis
subclass of: absent laryngeal muscle
definition: Absence of m. dilatator laryngis.
has_exact_synonym: missing m. dilatator laryngis

absent right-dorsal blastomere
type: Class
subclass of: abnormal right-dorsal blastomere
subclass of: absent blastomere
definition: Absence of right-dorsal blastomere.
has_exact_synonym: missing right-dorsal blastomere

absent m. quadrato-hyoangularis primordium
type: Class
subclass of: abnormal m. quadrato-hyoangularis primordium
subclass of: absent cranial muscle primordium
definition: Absence of m. quadrato-hyoangularis primordium.
has_exact_synonym: missing m. quadrato-hyoangularis primordium

absent neurocoel
type: Class
subclass of: abnormal neurocoel
subclass of: absent anatomical space
definition: Absence of neurocoel.
has_exact_synonym: missing neurocoel

absent adipose tissue
type: Class
subclass of: abnormal adipose tissue
subclass of: absent tissue
definition: Absence of adipose tissue.
has_exact_synonym: missing adipose tissue

absent blastomere D2
type: Class
subclass of: abnormal blastomere D2
subclass of: absent blastomere
definition: Absence of blastomere D2.
has_exact_synonym: missing blastomere D2

absent nucleus reticularis superior
type: Class
subclass of: abnormal nucleus reticularis superior
subclass of: absent neural nucleus
definition: Absence of nucleus reticularis superior.
has_exact_synonym: missing nucleus reticularis superior

absent laryngeal muscle primordium
type: Class
subclass of: abnormal laryngeal muscle primordium
subclass of: absent primordium
definition: Absence of laryngeal muscle primordium.
has_exact_synonym: missing laryngeal muscle primordium

absent dorsolateral placode region
type: Class
subclass of: abnormal dorsolateral placode region
subclass of: absent tissue
definition: Absence of dorsolateral placode region.
has_exact_synonym: missing dorsolateral placode region

absent lateral line primordium
type: Class
subclass of: abnormal lateral line primordium
subclass of: absent primordium
definition: Absence of lateral line primordium.
has_exact_synonym: missing lateral line primordium

absent anterior cerebral vein
type: Class
subclass of: abnormal anterior cerebral vein
subclass of: absent cerebral vein
definition: Absence of anterior cerebral vein.
has_exact_synonym: missing anterior cerebral vein

absent dorsal fin
type: Class
subclass of: abnormal dorsal fin
subclass of: absent fin
definition: Absence of dorsal fin.
has_exact_synonym: missing dorsal fin

absent vegetal endoderm
type: Class
subclass of: abnormal vegetal endoderm
subclass of: absent embryonic structure
definition: Absence of vegetal endoderm.
has_exact_synonym: missing vegetal endoderm

absent metacarpus
type: Class
subclass of: abnormal number of metacarpal bones
subclass of: absent bone element
definition: Absence of metacarpus.
has_exact_synonym: missing metacarpus

absent ionocyte
type: Class
subclass of: abnormal ionocyte
subclass of: absent non-ciliated epithelial cell
definition: Absence of ionocyte.
has_exact_synonym: missing ionocyte

absent non-ciliated epithelial cell
type: Class
subclass of: abnormal non-ciliated epithelial cell
subclass of: absent epithelial cell
definition: Absence of non-ciliated epithelial cell.
has_exact_synonym: missing non-ciliated epithelial cell

absent skeletal muscle
type: Class
subclass of: abnormal skeletal muscle
subclass of: absent muscle
definition: Absence of skeletal muscle.
has_exact_synonym: missing skeletal muscle

absent middle lateral line placode
type: Class
subclass of: abnormal middle lateral line placode
subclass of: absent lateral line placode
definition: Absence of middle lateral line placode.
has_exact_synonym: missing middle lateral line placode

absent central endoderm
type: Class
subclass of: abnormal central endoderm
subclass of: absent tissue
definition: Absence of central endoderm.
has_exact_synonym: missing central endoderm

absent blastocoel anlage
type: Class
subclass of: abnormal blastocoel anlage
subclass of: absent primordium
definition: Absence of blastocoel anlage.
has_exact_synonym: missing blastocoel anlage

absent endocardial tube
type: Class
subclass of: abnormal endocardial tube
subclass of: absent embryonic structure
definition: Absence of endocardial tube.
has_exact_synonym: missing endocardial tube

absent atrioventricular valve leaflet
type: Class
subclass of: abnormal atrioventricular valve leaflet
subclass of: absent tissue
definition: Absence of atrioventricular valve leaflet.
has_exact_synonym: missing atrioventricular valve leaflet

absent large intestine
type: Class
subclass of: abnormal large intestine
subclass of: absent multi-tissue structure
definition: Absence of large intestine.
has_exact_synonym: missing large intestine

absent medial cardinal vein
type: Class
subclass of: abnormal medial cardinal vein
subclass of: absent vein
definition: Absence of medial cardinal vein.
has_exact_synonym: missing medial cardinal vein

absent omphalomesenteric vein
type: Class
subclass of: abnormal omphalomesenteric vein
subclass of: absent vein
definition: Absence of omphalomesenteric vein.
has_exact_synonym: missing omphalomesenteric vein

absent epaxial muscle
type: Class
subclass of: abnormal epaxial muscle
subclass of: absent skeletal muscle
definition: Absence of epaxial muscle.
has_exact_synonym: missing epaxial muscle

absent skeletal system
type: Class
subclass of: abnormal skeletal system
subclass of: absent anatomical system
definition: Absence of skeletal system.
has_exact_synonym: missing skeletal system

absent ciliated epidermal cell
type: Class
subclass of: abnormal ciliated epidermal cell
subclass of: absent epidermal cell
subclass of: absent ciliated cell
definition: Absence of ciliated epidermal cell.
has_exact_synonym: missing ciliated epidermal cell

absent monociliated cell
type: Class
subclass of: abnormal monociliated cell
subclass of: absent ciliated cell
definition: Absence of monociliated cell.
has_exact_synonym: missing monociliated cell

absent epidermal cell
type: Class
subclass of: abnormal epidermal cell
subclass of: absent epithelial cell
definition: Absence of epidermal cell.
has_exact_synonym: missing epidermal cell

absent ciliated cell
type: Class
subclass of: abnormal ciliated cell
subclass of: absent cell
definition: Absence of ciliated cell.
has_exact_synonym: missing ciliated cell

absent branchial arch
type: Class
subclass of: abnormal branchial arch
subclass of: absent pharyngeal arch
definition: Absence of branchial arch.
has_exact_synonym: missing branchial arch

absent splanchnocranium
type: Class
subclass of: abnormal splanchnocranium
subclass of: absent cranium
definition: Absence of splanchnocranium.
has_exact_synonym: missing splanchnocranium

absent aortic arch 3
type: Class
subclass of: abnormal aortic arch 3
subclass of: absent aortic arch
definition: Absence of aortic arch 3.
has_exact_synonym: missing aortic arch 3

absent sclerotome of tail somite 18
type: Class
subclass of: abnormal sclerotome of tail somite 18
subclass of: absent sclerotome
definition: Absence of sclerotome of tail somite 18.
has_exact_synonym: missing sclerotome of tail somite 18

absent intersomitic artery
type: Class
subclass of: abnormal intersomitic artery
subclass of: absent intersomitic vessel
definition: Absence of intersomitic artery.
has_exact_synonym: missing intersomitic artery

absent intersomitic vessel
type: Class
subclass of: abnormal intersomitic vessel
subclass of: absent blood vessel
definition: Absence of intersomitic vessel.
has_exact_synonym: missing intersomitic vessel

absent inner limiting membrane
type: Class
subclass of: abnormal inner limiting membrane
subclass of: absent tissue
definition: Absence of inner limiting membrane.
has_exact_synonym: missing inner limiting membrane

absent m. geniohyoideus primordium
type: Class
subclass of: abnormal m. geniohyoideus primordium
subclass of: absent cranial muscle primordium
definition: Absence of m. geniohyoideus primordium.
has_exact_synonym: missing m. geniohyoideus primordium

absent ophthalmic artery
type: Class
subclass of: abnormal ophthalmic artery
subclass of: absent artery
definition: Absence of ophthalmic artery.
has_exact_synonym: missing ophthalmic artery

absent multiciliated cell precursor
type: Class
subclass of: abnormal multiciliated cell precursor
subclass of: absent cell
definition: Absence of multiciliated cell precursor.
has_exact_synonym: missing multiciliated cell precursor

absent anterodorsal tegmental nucleus
type: Class
subclass of: abnormal anterodorsal tegmental nucleus
subclass of: absent neural nucleus
definition: Absence of anterodorsal tegmental nucleus.
has_exact_synonym: missing anterodorsal tegmental nucleus

absent fourth ventricle
type: Class
subclass of: abnormal fourth ventricle
subclass of: absent brain ventricle
definition: Absence of fourth ventricle.
has_exact_synonym: missing fourth ventricle

absent sclerotome of trunk somite 4
type: Class
subclass of: abnormal sclerotome of trunk somite 4
subclass of: absent sclerotome
definition: Absence of sclerotome of trunk somite 4.
has_exact_synonym: missing sclerotome of trunk somite 4

absent mesentery
type: Class
subclass of: abnormal mesentery
subclass of: absent epithelium
definition: Absence of mesentery.
has_exact_synonym: missing mesentery

absent rectum
type: Class
subclass of: abnormal rectum
subclass of: absent multi-tissue structure
definition: Absence of rectum.
has_exact_synonym: missing rectum

absent myotome of trunk somite 4
type: Class
subclass of: abnormal myotome of trunk somite 4
subclass of: absent myotome
definition: Absence of myotome of trunk somite 4.
has_exact_synonym: missing myotome of trunk somite 4

absent distal tubule
type: Class
subclass of: abnormal distal tubule
subclass of: absent tissue
definition: Absence of distal tubule.
has_exact_synonym: missing distal tubule

absent blastomere V2.1.2
type: Class
subclass of: abnormal blastomere V2.1.2
subclass of: absent ventral vegetal hemisphere blastomere
definition: Absence of blastomere V2.1.2.
has_exact_synonym: missing blastomere V2.1.2